DUMMY MEDICARE_PROVIDER_NUMBER,,DUMMY MEDICAL RECORD NUMBER,BIRTH_DATE,SEX,RACE,DUMMY ZIP,ADMISSION_DATE,DISCHARGE_DATE,PAYMENT_SOURCE,DISPOSITION,DUMMY HOSP,TOTAL_CHARGE,HOSP_BASED_PHYS_CHARGE,BIRTH_WEIGHT,ATTENDING_PHYSICIAN,PRINCIPAL_DIAGNOSIS,OTHER_DIAGNOSIS1,OTHER_DIAGNOSIS2,OTHER_DIAGNOSIS3,OTHER_DIAGNOSIS4,OTHER_DIAGNOSIS5,OTHER_DIAGNOSIS6,OTHER_DIAGNOSIS7,OTHER_DIAGNOSIS8,OTHER_DIAGNOSIS9,E_CODE,PRINCIPAL_PROCEDURE,OTHER_PROCEDURE1,OTHER_PROCEDURE2,OTHER_PROCEDURE3,OTHER_PROCEDURE4,OTHER_PROCEDURE5,OTHER_PROCEDURE6,OTHER_PROCEDURE7,OTHER_PROCEDURE8,OTHER_PROCEDURE9,PRINCIPAL_SURGEON,OTHER_SURGEON1,OTHER_SURGEON2,OTHER_SURGEON3,OTHER_SURGEON4,OTHER_SURGEON5,OTHER_SURGEON6,OTHER_SURGEON7,OTHER_SURGEON8,OTHER_SURGEON9,PRINCIPAL_PROCEDURE_DATE,OTHER_PROCEDURE_DATE1,OTHER_PROCEDURE_DATE2,OTHER_PROCEDURE_DATE3,OTHER_PROCEDURE_DATE4,OTHER_PROCEDURE_DATE5,OTHER_PROCEDURE_DATE6,OTHER_PROCEDURE_DATE7,OTHER_PROCEDURE_DATE8,OTHER_PROCEDURE_DATE9,ADMISSION_TYPE,ADMISSION_SOURCE,ADMISSION_HOUR
400247,194720,14008,2/26/1958,1,1,6755,1/1/2000,1/1/1998,6,,1,226,0,0,008326,,,,,,,,,,,,,,,,,,,,,,,,,,,,,,,,,,,,,,,,,,,,00
400349,172979,7996,2/3/1915,2,5,6755,5/6/2000,1/1/1998,6,,2,328,0,0,008326,,,78609,,,,,,,,,,,,,,,,,,,,,,,,,,,,,,,,,,,,,,,,,00
400262,206851,14009,12/22/1991,2,2,6792,9/9/2000,1/1/1998,6,,2,241,0,0,010033,,,8730,E9179,,,,,,,,,,,,,,,,,,,,,,,,,,,,,,,,,,,,,,,,00
400330,202450,14010,9/21/1978,1,1,6719,9/9/2000,1/1/1998,6,,1,309,0,0,010157,,,87342,E9179,,,,,,,,,,,,,,,,,,,,,,,,,,,,,,,,,,,,,,,,00
403713,665983,474182,11/16/1987,1,4,6716,9/9/2000,1/1/1998,6,1,3,413,0,0,010157,78609,,,,,,,,,,,,,,,,,,,,,,,,,,,,,,,,,,,,,,,,,3,9,00
404309,666870,458806,10/26/1996,1,1,6825,7/31/2000,1/1/1998,4,1,1,1009,0,0,011627,7806,,,,,,,,,,,,,,,,,,,,,,,,,,,,,,,,,,,,,,,,,3,9,00
403350,452207,247287,3/2/1988,2,3,6821,7/31/2000,1/1/1998,4,1,7,50,0,0,013268,9309,E914,,,,,,,,,E8499,,,,,,,,,,,,,,,,,,,,,,,,,,,,,,,3,9,00
403905,448702,302854,6/2/1990,1,3,6706,1/27/2001,1/1/1998,13,1,8,605,0,0,014225,6089,,,,,,,,,,,,,,,,,,,,,,,,,,,,,,,,,,,,,,,,,3,9,00
403575,712292,485424,10/29/1991,2,3,1112,9/9/2000,1/1/1998,6,1,2,275,0,0,014761,82123,E8844,,,,,,,,,E8490,9354,,,,,,,,,,051565,,,,,,,,,,1/1/1998,,,,,,,,,,3,9,01
403752,424613,236282,1/13/1980,2,4,6817,9/9/2000,1/1/1998,6,1,3,452,0,0,016386,9597,E927,,,,,,,,,E8499,,,,,,,,,,,,,,,,,,,,,,,,,,,,,,,3,9,01
403685,632814,485425,5/30/1961,2,5,6822,12/18/2000,1/1/1998,11,1,0,385,0,0,016956,V718,,,,,,,,,,,,,,,,,,,,,,,,,,,,,,,,,,,,,,,,,3,9,01
403802,388448,249110,5/27/1976,2,4,6813,1/27/2001,1/1/1998,13,1,2,502,0,0,016956,94428,E8981,,,,,,,,,E8499,,,,,,,,,,,,,,,,,,,,,,,,,,,,,,,3,9,02
403511,382079,238625,10/25/1987,1,5,6817,1/27/2001,1/1/1998,13,1,3,211,0,0,016956,94424,94800,,,,,,,,,E9230,,,,,,,,,,,,,,,,,,,,,,,,,,,,,,,3,9,02
403652,636820,485428,2/28/1972,1,1,6815,12/18/2000,1/1/1998,11,1,1,352,0,0,018549,8830,E9203,,,,,,,,,E8499,9354,,,,,,,,,,028621,,,,,,,,,,1/1/1998,,,,,,,,,,3,9,02
403965,635556,485429,1/10/1969,2,2,6826,12/18/2000,1/1/1998,11,1,0,665,0,0,018549,8728,E9060,,,,,,,,,E8499,184,,,,,,,,,,028621,,,,,,,,,,1/1/1998,,,,,,,,,,3,9,02
403505,546468,399487,7/8/1994,2,4,6734,1/27/2001,1/1/1998,13,1,4,205,0,0,019976,1274,61611,,,,,,,,,,,,,,,,,,,,,,,,,,,,,,,,,,,,,,,,3,9,02
404174,636417,485430,1/30/1971,2,3,6816,12/18/2000,1/1/1998,11,1,0,874,0,0,022079,9656,E8506,,,,,,,,,E8499,,,,,,,,,,,,,,,,,,,,,,,,,,,,,,,3,9,02
404653,522731,377197,7/31/1993,2,2,6819,1/27/2001,1/1/1998,13,1,2,1353,0,0,026286,5990,59080,7806,2888,,,,,,,,,,,,,,,,,,,,,,,,,,,,,,,,,,,,,,3,9,03
403575,620172,473197,6/15/1997,1,3,6817,1/27/2001,1/1/1998,13,1,3,275,0,0,032763,3829,7806,,,,,,,,,,,,,,,,,,,,,,,,,,,,,,,,,,,,,,,,3,9,04
403674,690597,485431,8/19/1947,2,3,1112,12/18/2000,1/1/1998,11,1,7,374,0,0,032789,6823,,,,,,,,,,,8604,,,,,,,,,,092320,,,,,,,,,,1/1/1998,,,,,,,,,,3,9,06
403626,680284,485432,7/23/1997,2,5,6797,9/9/2000,1/1/1998,6,1,3,326,0,0,035006,486,,,,,,,,,,,,,,,,,,,,,,,,,,,,,,,,,,,,,,,,,3,9,06
403691,598274,447903,9/11/1969,2,5,6826,12/18/2000,1/1/1998,11,1,2,391,0,0,040055,87342,E9179,,,,,,,,,E8499,0881,,,,,,,,,,092320,,,,,,,,,,1/1/1998,,,,,,,,,,3,9,06
403480,553019,393591,4/13/1994,1,5,6819,12/18/2000,1/1/1998,11,1,1,180,0,0,040055,9180,,,,,,,,,,E9064,,,,,,,,,,,,,,,,,,,,,,,,,,,,,,,3,9,08
404051,950401,803820,5/4/1996,1,2,6816,1/27/2001,1/1/1998,13,1,1,751,0,0,040055,78609,7862,3829,,,,,,,,,,,,,,,,,,,,,,,,,,,,,,,,,,,,,,,3,9,08
403344,610680,463842,1/16/1997,1,1,6816,1/27/2001,1/1/1998,13,1,1,44,0,0,040055,7862,4781,3829,,,,,,,,,,,,,,,,,,,,,,,,,,,,,,,,,,,,,,,3,9,09
403744,591787,444323,11/4/1994,1,3,6706,1/27/2001,1/1/1998,13,1,1,444,0,0,040055,78609,,,,,,,,,,,,,,,,,,,,,,,,,,,,,,,,,,,,,,,,,3,9,09
403913,338105,195239,2/18/1986,1,1,6815,1/27/2001,1/1/1998,13,1,8,613,0,0,040055,82382,,,,,,,,,,E848,,,,,,,,,,,,,,,,,,,,,,,,,,,,,,,3,9,09
403726,665733,485437,11/1/1956,1,4,6744,9/9/2000,1/1/1998,6,1,0,426,0,0,040055,87342,87320,V065,,,,,,,,E885,8659,,,,,,,,,,092320,,,,,,,,,,1/1/1998,,,,,,,,,,3,9,09
405159,313472,130679,7/29/1983,1,3,6819,9/29/2000,1/1/1998,7,1,2,1859,0,0,040055,37992,8509,E9600,,,,,,,,E8499,,,,,,,,,,,,,,,,,,,,,,,,,,,,,,,3,9,10
403761,521224,335623,7/17/1972,2,5,6816,9/9/2000,1/1/1998,6,1,2,461,0,0,040055,490,7806,,,,,,,,,,,,,,,,,,,,,,,,,,,,,,,,,,,,,,,,3,9,10
403482,662354,467258,3/11/1997,1,5,6734,9/9/2000,1/1/1998,6,1,1,182,0,0,040055,7806,0740,3829,,,,,,,,,,,,,,,,,,,,,,,,,,,,,,,,,,,,,,,3,9,10
403896,628424,434156,10/30/1995,1,5,6789,9/9/2000,1/1/1998,6,1,1,596,0,0,040055,49391,46619,,,,,,,,,,,,,,,,,,,,,,,,,,,,,,,,,,,,,,,,3,9,10
403527,673459,478682,9/12/1997,1,5,6818,9/9/2000,1/1/1998,6,1,6,227,0,0,040055,4781,7862,0796,,,,,,,,,,,,,,,,,,,,,,,,,,,,,,,,,,,,,,,3,9,10
403669,582553,436149,11/22/1995,2,4,6817,1/27/2001,1/1/1998,13,1,9,369,0,0,040055,78609,3829,7862,,,,,,,,,,,,,,,,,,,,,,,,,,,,,,,,,,,,,,,3,9,10
404838,653656,459177,10/31/1996,2,2,6815,9/9/2000,1/1/1998,6,1,2,1538,0,0,040055,7806,2765,3829,,,,,,,,,,,,,,,,,,,,,,,,,,,,,,,,,,,,,,,3,9,11
404023,680320,485439,8/21/1997,1,1,6797,9/9/2000,1/1/1998,6,1,1,723,0,0,040204,7806,7862,3829,,,,,,,,,,,,,,,,,,,,,,,,,,,,,,,,,,,,,,,3,9,11
404583,381593,204447,7/17/1949,2,4,6825,9/9/2000,1/1/1998,6,1,3,1283,0,0,040808,78900,,,,,,,,,,,,,,,,,,,,,,,,,,,,,,,,,,,,,,,,,3,9,11
405517,633333,485440,8/11/1962,2,4,6816,12/18/2000,1/1/1998,11,1,7,2217,0,0,042952,38869,37272,920,9100,E9689,,,,,,E8490,,,,,,,,,,,,,,,,,,,,,,,,,,,,,,,3,9,11
403500,385632,197246,4/1/1980,1,3,6821,9/9/2000,1/1/1998,6,1,6,200,0,0,044644,9181,37230,E9289,,,,,,,,E8499,,,,,,,,,,,,,,,,,,,,,,,,,,,,,,,3,9,11
403559,526036,380372,9/21/1993,2,2,6813,1/27/2001,1/1/1998,13,1,4,259,0,0,044644,38010,,,,,,,,,,,,,,,,,,,,,,,,,,,,,,,,,,,,,,,,,3,9,12
403561,509330,352437,7/21/1987,1,1,6826,12/18/2000,1/1/1998,11,1,1,261,0,0,045195,94425,94800,,,,,,,,,E9230,,,,,,,,,,,,,,,,,,,,,,,,,,,,,,,3,9,12
403344,624493,464031,1/19/1997,2,4,6817,12/18/2000,1/1/1998,11,1,7,44,0,0,050161,4559,,,,,,,,,,,,,,,,,,,,,,,,,,,,,,,,,,,,,,,,,3,9,12
403745,651895,470223,10/28/1995,1,1,8888,9/9/2000,1/1/1998,6,1,0,445,0,0,050161,7862,78609,3829,,,,,,,,,,,,,,,,,,,,,,,,,,,,,,,,,,,,,,,3,9,12
403651,584383,397619,6/12/1994,2,4,6819,9/29/2000,1/1/1998,7,1,2,351,0,0,052795,7862,78609,,,,,,,,,,,,,,,,,,,,,,,,,,,,,,,,,,,,,,,,3,9,12
403559,672911,485441,5/18/1996,1,2,6819,9/29/2000,1/1/1998,7,1,3,259,0,0,052795,49391,,,,,,,,,,,,,,,,,,,,,,,,,,,,,,,,,,,,,,,,,3,9,12
403552,535913,376747,7/25/1993,1,4,6819,12/18/2000,1/1/1998,11,1,1,252,0,0,053918,462,7862,,,,,,,,,,,,,,,,,,,,,,,,,,,,,,,,,,,,,,,,3,9,12
404177,168062,017170,11/29/1970,2,3,6819,12/18/2000,1/1/1998,11,1,0,877,0,0,059964,042,7841,7804,78701,78791,7291,,,,,,,,,,,,,,,,,,,,,,,,,,,,,,,,,,,,3,9,12
403619,318533,186335,4/26/1957,2,4,6826,11/23/2000,1/1/1998,13,1,8,319,0,0,060350,5283,,,,,,,,,,,,,,,,,,,,,,,,,,,,,,,,,,,,,,,,,3,9,12
403552,296409,114205,2/4/1982,2,5,6826,9/29/2000,1/1/1998,7,1,4,252,0,0,063883,7841,,,,,,,,,,,,,,,,,,,,,,,,,,,,,,,,,,,,,,,,,3,9,12
403588,595597,449004,5/29/1996,2,3,6817,11/23/2000,1/1/1998,13,1,2,288,0,0,069898,9233,E918,,,,,,,,,E8490,,,,,,,,,,,,,,,,,,,,,,,,,,,,,,,3,9,12
403709,502830,358468,8/2/1990,1,1,6825,11/23/2000,1/1/1998,13,1,1,409,0,0,073817,9597,84500,E9289,,,,,,,,E8490,,,,,,,,,,,,,,,,,,,,,,,,,,,,,,,3,9,12
404022,239884,112260,6/22/1944,2,5,6817,11/23/2000,1/1/1998,13,1,2,722,0,0,075200,99851,04111,,,,,,,,,E8788,,,,,,,,,,,,,,,,,,,,,,,,,,,,,,,3,9,13
404883,605208,477509,12/31/1944,2,4,6826,11/23/2000,1/1/1998,13,1,8,1583,0,0,075259,87340,2769,2765,,,,,,,,E888,8659,,,,,,,,,,092320,,,,,,,,,,1/1/1998,,,,,,,,,,3,9,13
403716,419303,235057,9/1/1987,2,4,6825,8/25/2000,1/1/1998,7,1,2,416,0,0,076570,9130,E885,,,,,,,,,E8490,9354,,,,,,,,,,077776,,,,,,,,,,1/1/1998,,,,,,,,,,3,9,13
403598,668093,480308,5/17/1997,2,4,6826,8/25/2000,1/1/1998,7,1,4,298,0,0,081893,8830,E9202,,,,,,,,,E8499,,,,,,,,,,,,,,,,,,,,,,,,,,,,,,,3,9,13
404606,178352,045575,9/10/1957,2,3,6792,11/23/2000,1/1/1998,13,1,9,1306,0,0,082925,78909,,,,,,,,,,,,,,,,,,,,,,,,,,,,,,,,,,,,,,,,,3,9,14
404220,666720,485444,9/27/1994,2,1,8888,8/10/2000,1/1/1998,6,1,2,920,0,0,084210,7806,462,,,,,,,,,,,,,,,,,,,,,,,,,,,,,,,,,,,,,,,,3,9,14
404375,568132,374937,6/25/1993,1,3,6825,9/9/2000,1/1/1998,6,1,4,1075,0,0,430744,85409,E8849,,,,,,,,,E8499,,,,,,,,,,,,,,,,,,,,,,,,,,,,,,,3,9,14
403784,641780,485442,6/2/1982,1,1,6706,12/18/2000,1/1/1998,11,1,1,484,0,0,800011,8920,E9208,,,,,,,,,E8499,9354,,,,,,,,,,077776,,,,,,,,,,1/1/1998,,,,,,,,,,3,9,13
404688,635544,485446,9/26/1968,2,5,6819,12/18/2000,1/1/1998,11,1,11,1388,0,0,800011,7806,490,,,,,,,,,,,,,,,,,,,,,,,,,,,,,,,,,,,,,,,,3,9,14
403822,602235,383627,4/13/1988,1,1,6819,6/21/2000,1/1/1998,2,1,10,522,0,0,800011,7806,3829,78039,7834,,,,,,,,,,,,,,,,,,,,,,,,,,,,,,,,,,,,,,3,9,14
404969,501435,356348,5/10/1992,2,1,6819,11/23/2000,1/1/1998,13,1,4,1669,0,0,800011,7806,2888,,,,,,,,,,,,,,,,,,,,,,,,,,,,,,,,,,,,,,,,3,9,14
404253,518509,368697,10/10/1967,2,5,6813,12/18/2000,1/1/1998,11,1,7,953,0,0,800011,7840,78703,2765,5990,4739,,,,,,,,,,,,,,,,,,,,,,,,,,,,,,,,,,,,,3,9,15
403646,412966,222036,2/24/1987,1,2,6817,9/9/2000,1/1/1998,6,1,0,346,0,0,800045,78900,78841,,,,,,,,,,,,,,,,,,,,,,,,,,,,,,,,,,,,,,,,3,9,15
403588,669152,481118,10/22/1997,2,3,6813,9/29/2000,1/1/1998,7,1,3,288,0,0,800045,684,,,,,,,,,,,,,,,,,,,,,,,,,,,,,,,,,,,,,,,,,3,9,15
404889,707895,485447,3/26/1996,2,1,2117,9/9/2000,1/1/1998,6,1,2,1589,0,0,800045,7806,7862,4781,2889,,,,,,,,,,,,,,,,,,,,,,,,,,,,,,,,,,,,,,3,9,15
403598,663990,485170,12/5/1953,1,1,6813,9/9/2000,1/1/1998,6,1,1,298,0,0,800045,94522,94800,,,,,,,,,E9241,,,,,,,,,,,,,,,,,,,,,,,,,,,,,,,3,9,15
403717,674638,485448,5/15/1982,2,4,6816,9/9/2000,1/1/1998,6,1,2,417,0,0,800045,7806,463,7862,,,,,,,,,,,,,,,,,,,,,,,,,,,,,,,,,,,,,,,3,9,15
403710,516823,324564,11/14/1990,2,4,6822,9/9/2000,1/1/1998,6,1,3,410,0,0,800045,81250,,,,,,,,,,E9179,,,,,,,,,,,,,,,,,,,,,,,,,,,,,,,3,9,16
403567,641026,480356,10/9/1997,1,2,6822,12/18/2000,1/1/1998,11,1,1,267,0,0,800045,85401,E8499,920,,,,,,,,E8849,,,,,,,,,,,,,,,,,,,,,,,,,,,,,,,3,9,16
403975,292850,136521,2/21/1984,1,1,6764,12/18/2000,1/1/1998,11,1,1,675,0,0,800045,9592,92300,,,,,,,,,E8498,,,,,,,,,,,,,,,,,,,,,,,,,,,,,,,3,9,17
404471,632528,485450,9/26/1997,1,4,6817,11/23/2000,1/1/1998,13,1,1,1171,0,0,800045,46611,7862,7806,,,,,,,,,,,,,,,,,,,,,,,,,,,,,,,,,,,,,,,3,9,17
403525,428533,284519,7/11/1989,1,4,6822,11/23/2000,1/1/1998,13,1,8,225,0,0,800045,6800,,,,,,,,,,,,,,,,,,,,,,,,,,,,,,,,,,,,,,,,,3,9,17
403563,680330,485451,12/29/1997,1,1,6819,8/10/2000,1/1/1998,6,1,1,263,0,9999,800045,99811,,,,,,,,,,E8788,,,,,,,,,,,,,,,,,,,,,,,,,,,,,,,3,9,18
403301,681673,485211,12/28/1997,1,4,6555,8/10/2000,1/1/1998,6,1,6,1,0,9999,800045,7746,,,,,,,,,,,,,,,,,,,,,,,,,,,,,,,,,,,,,,,,,3,9,15
403675,632614,485452,7/7/1994,1,5,6720,11/23/2000,1/1/1998,13,1,8,375,0,0,800045,8820,E9201,,,,,,,,,E8493,,,,,,,,,,,,,,,,,,,,,,,,,,,,,,,3,9,18
403486,668431,485453,6/6/1950,1,2,5907,8/10/2000,1/1/1998,6,1,0,186,0,0,800045,4871,490,,,,,,,,,,,,,,,,,,,,,,,,,,,,,,,,,,,,,,,,3,9,18
403509,643316,455579,9/8/1996,2,2,6797,8/25/2000,1/1/1998,7,1,4,209,0,0,800045,3829,0740,78791,78703,,,,,,,,,,,,,,,,,,,,,,,,,,,,,,,,,,,,,,3,9,19
403344,600807,459616,8/14/1981,2,3,6817,11/23/2000,1/1/1998,13,1,2,44,0,0,800045,V718,,,,,,,,,,,,,,,,,,,,,,,,,,,,,,,,,,,,,,,,,3,9,20
403554,630498,485459,6/11/1991,1,4,6797,11/23/2000,1/1/1998,13,1,8,254,0,0,800045,9180,9101,E8261,,,,,,,,E8494,,,,,,,,,,,,,,,,,,,,,,,,,,,,,,,3,9,21
403769,585766,392244,3/25/1994,2,2,6816,8/10/2000,1/1/1998,6,1,3,469,0,0,800045,7862,7806,486,,,,,,,,,,,,,,,,,,,,,,,,,,,,,,,,,,,,,,,3,9,21
403984,610785,485460,9/6/1996,1,1,9999,10/24/2000,1/1/1998,11,1,1,684,0,0,800045,486,,,,,,,,,,,,,,,,,,,,,,,,,,,,,,,,,,,,,,,,,3,9,21
403490,411648,273574,1/31/1973,2,4,6817,11/23/2000,1/1/1998,13,1,4,190,0,0,800078,8920,E9208,,,,,,,,,E8499,,,,,,,,,,,,,,,,,,,,,,,,,,,,,,,3,9,21
403610,621120,460733,11/27/1996,1,1,6819,10/24/2000,1/1/1998,11,1,6,310,0,0,800078,0542,68100,7806,,,,,,,,,,,,,,,,,,,,,,,,,,,,,,,,,,,,,,,3,9,22
403474,556387,364006,4/9/1991,1,3,6826,8/10/2000,1/1/1998,6,1,1,174,0,0,800078,78900,,,,,,,,,,,,,,,,,,,,,,,,,,,,,,,,,,,,,,,,,3,9,23
403748,662375,467781,3/19/1997,2,1,6819,8/10/2000,1/1/1998,6,1,4,448,0,0,800078,3829,7931,,,,,,,,,,,,,,,,,,,,,,,,,,,,,,,,,,,,,,,,3,9,23
400277,327048,136875,11/2/1947,2,4,6825,7/11/2000,1/1/1998,4,1,5,251,0,0,800078,8830,E9203,,,,,,,,,E8499,8659,,,,,,,,,,040055,,,,,,,,,,1/1/1998,,,,,,,,,,3,9,23
401153,286778,136876,7/16/1967,1,4,6797,10/24/2000,1/1/1998,11,5,7,1127,0,0,800078,9462,E9230,,,,,,,,,E8499,,,,,,,,,,,,,,,,,,,,,,,,,,,,,,,3,9,00
401618,321163,136877,12/14/1949,1,4,6792,7/26/2000,1/1/1998,5,5,0,1592,0,0,800078,78650,,,,,,,,,,,,,,,,,,,,,,,,,,,,,,,,,,,,,,,,,3,9,00
401697,331625,136878,10/17/1995,1,1,6707,8/10/2000,1/1/1998,6,1,1,1671,0,0,800078,78031,,,,,,,,,,,,,,,,,,,,,,,,,,,,,,,,,,,,,,,,,3,9,00
401556,302977,136879,8/3/1918,1,3,6782,8/10/2000,1/1/1998,6,1,2,1530,0,0,800425,78900,,,,,,,,,,,,,,,,,,,,,,,,,,,,,,,,,,,,,,,,,3,9,00
402750,316111,136880,3/7/1936,2,2,6797,7/26/2000,1/1/1998,5,1,1,2724,0,0,800433,51881,486,,,,,,,,,,9604,9671,,,,,,,,,040055,040055,,,,,,,,,1/1/1998,1/1/1998,,,,,,,,,3,9,01
400183,328605,136881,12/17/1987,1,1,6734,8/10/2000,1/1/1998,6,1,1,157,0,0,800433,9181,9409,E9230,,,,,,,,E8499,,,,,,,,,,,,,,,,,,,,,,,,,,,,,,,3,9,01
400305,319017,136882,2/1/1963,1,3,6818,8/10/2000,1/1/1998,6,1,3,279,0,0,800490,9211,9182,E9230,,,,,,,,E8499,,,,,,,,,,,,,,,,,,,,,,,,,,,,,,,3,9,01
400228,334821,136883,12/30/1968,2,2,6816,7/11/2000,1/1/1998,4,1,0,202,0,0,800490,9182,E9230,,,,,,,,,E8499,,,,,,,,,,,,,,,,,,,,,,,,,,,,,,,3,9,01
400305,327744,136884,5/20/1986,1,5,6782,8/10/2000,1/1/1998,6,1,1,279,0,0,800490,9181,E9230,,,,,,,,,E8499,,,,,,,,,,,,,,,,,,,,,,,,,,,,,,,3,9,01
400519,189553,037283,1/7/1918,2,4,6789,9/9/2000,1/1/1998,8,1,6,493,0,0,E50821,8470,E8121,,,,,,,,,E8495,,,,,,,,,,,,,,,,,,,,,,,,,,,,,,,3,9,02
400208,248662,045649,7/9/1982,1,3,6782,7/11/2000,1/1/1998,4,1,8,182,0,0,E50821,462,,,,,,,,,,,,,,,,,,,,,,,,,,,,,,,,,,,,,,,,,3,9,02
400211,227623,092166,9/3/1964,2,4,6782,11/23/2000,1/1/1998,13,1,13,185,0,0,E50821,9170,E9289,30390,30570,,,,,,,E8499,9604,9671,,,,,,,,,040055,040055,,,,,,,,,1/1/1998,1/1/1998,,,,,,,,,3,9,02
400200,321681,117956,11/21/1946,2,2,6701,6/11/2000,1/1/1998,2,1,4,174,0,0,E50821,V2541,,,,,,,,,,,,,,,,,,,,,,,,,,,,,,,,,,,,,,,,,3,9,03
