Issue 859 attachment: pdfium_embeddertests.log (30.7 KB)

1
2
3
4
5
6
7
8
9
10
11
12
13
14
15
16
17
18
19
20
21
22
23
24
25
26
27
28
29
30
31
32
33
34
35
36
37
38
39
40
41
42
43
44
45
46
47
48
49
50
51
52
53
54
55
56
57
58
59
60
61
62
63
64
65
66
67
68
69
70
71
72
73
74
75
76
77
78
79
80
81
82
83
84
85
86
87
88
89
90
91
92
93
94
95
96
97
98
99
100
101
102
103
104
105
106
107
108
109
110
111
112
113
114
115
116
117
118
119
120
121
122
123
124
125
126
127
ninja: Entering directory `out'
[1/1] LINK ./pdfium_embeddertests
FAILED: pdfium_embeddertests
/usr/bin/python2 "../build/toolchain/gcc_link_wrapper.py" --output="./pdfium_embeddertests" -- ../../../../../../usr/bin/clang++ -Wl,--fatal-warnings -fPIC -Wl,-z,noexecstack -Wl,-z,now -Wl,-z,relro -Wl,-z,defs -Wl,--no-as-needed -lpthread -Wl,--as-needed -fuse-ld=gold -B../third_party/binutils/Linux_x64/Release/bin -m64 -pthread -Wl,-O1 -Wl,--gc-sections -Wl,-rpath-link=. -Wl,--disable-new-dtags -Wl,-rpath=\$ORIGIN/. -Wl,-rpath-link=. -o "./pdfium_embeddertests" -Wl,--start-group @"./pdfium_embeddertests.rsp" ./libpdfium.so ./libv8.so ./libicui18n.so ./libicuuc.so ./libv8_libplatform.so -Wl,--end-group -ldl -lrt -lfreetype
obj/pdfium_embeddertests/fpdf_parser_decode_embeddertest.o:../core/fpdfapi/parser/fpdf_parser_decode_embeddertest.cpp:function FPDFParserDecodeEmbeddertest_FlateEncode_Test::TestBody(): error: undefined reference to 'FlateEncode(unsigned char const*, unsigned int, unsigned char**, unsigned int*)'
obj/pdfium_embeddertests/fpdf_parser_decode_embeddertest.o:../core/fpdfapi/parser/fpdf_parser_decode_embeddertest.cpp:function FPDFParserDecodeEmbeddertest_FlateDecode_Test::TestBody(): error: undefined reference to 'FlateDecode(unsigned char const*, unsigned int, unsigned char**, unsigned int*)'
obj/pdfium_embeddertests/fpdfedit_embeddertest.o:../fpdfsdk/fpdfedit_embeddertest.cpp:function FPDFEditEmbeddertest_AddPaths_Test::TestBody(): error: undefined reference to 'CPDFDocumentFromFPDFDocument(void*)'
obj/pdfium_embeddertests/fpdfedit_embeddertest.o:../fpdfsdk/fpdfedit_embeddertest.cpp:function FPDFEditEmbeddertest_AddStrokedPaths_Test::TestBody(): error: undefined reference to 'CPDFDocumentFromFPDFDocument(void*)'
obj/pdfium_embeddertests/fpdfedit_embeddertest.o:../fpdfsdk/fpdfedit_embeddertest.cpp:function FPDFEditEmbeddertest_AddStandardFontText_Test::TestBody(): error: undefined reference to 'CPDFDocumentFromFPDFDocument(void*)'
obj/pdfium_embeddertests/fpdfedit_embeddertest.o:../fpdfsdk/fpdfedit_embeddertest.cpp:function FPDFEditEmbeddertest_GraphicsData_Test::TestBody(): error: undefined reference to 'CPDFDocumentFromFPDFDocument(void*)'
obj/pdfium_embeddertests/fpdfedit_embeddertest.o:../fpdfsdk/fpdfedit_embeddertest.cpp:function FPDFEditEmbeddertest_GraphicsData_Test::TestBody(): error: undefined reference to 'CPDFPageFromFPDFPage(void*)'
obj/pdfium_embeddertests/fpdfedit_embeddertest.o:../fpdfsdk/fpdfedit_embeddertest.cpp:function FPDFEditEmbeddertest_GraphicsData_Test::TestBody(): error: undefined reference to 'CPDF_Dictionary::GetDictFor(CFX_ByteString const&) const'
obj/pdfium_embeddertests/fpdfedit_embeddertest.o:../fpdfsdk/fpdfedit_embeddertest.cpp:function FPDFEditEmbeddertest_DoubleGenerating_Test::TestBody(): error: undefined reference to 'CPDFPageFromFPDFPage(void*)'
obj/pdfium_embeddertests/fpdfedit_embeddertest.o:../fpdfsdk/fpdfedit_embeddertest.cpp:function FPDFEditEmbeddertest_DoubleGenerating_Test::TestBody(): error: undefined reference to 'CPDF_Dictionary::GetDictFor(CFX_ByteString const&) const'
obj/pdfium_embeddertests/fpdfedit_embeddertest.o:../fpdfsdk/fpdfedit_embeddertest.cpp:function FPDFEditEmbeddertest_DoubleGenerating_Test::TestBody(): error: undefined reference to 'CPDF_Dictionary::GetDictFor(CFX_ByteString const&) const'
obj/pdfium_embeddertests/fpdfedit_embeddertest.o:../fpdfsdk/fpdfedit_embeddertest.cpp:function FPDFEditEmbeddertest_LoadSimpleType1Font_Test::TestBody(): error: undefined reference to 'CPDF_Font::GetStockFont(CPDF_Document*, CFX_StringCTemplate<char> const&)'
obj/pdfium_embeddertests/fpdfedit_embeddertest.o:../fpdfsdk/fpdfedit_embeddertest.cpp:function FPDFEditEmbeddertest_LoadSimpleType1Font_Test::TestBody(): error: undefined reference to 'CPDF_Dictionary::GetStringFor(CFX_ByteString const&) const'
obj/pdfium_embeddertests/fpdfedit_embeddertest.o:../fpdfsdk/fpdfedit_embeddertest.cpp:function FPDFEditEmbeddertest_LoadSimpleType1Font_Test::TestBody(): error: undefined reference to 'CPDF_Dictionary::GetStringFor(CFX_ByteString const&) const'
obj/pdfium_embeddertests/fpdfedit_embeddertest.o:../fpdfsdk/fpdfedit_embeddertest.cpp:function FPDFEditEmbeddertest_LoadSimpleType1Font_Test::TestBody(): error: undefined reference to 'CPDF_Dictionary::GetStringFor(CFX_ByteString const&) const'
obj/pdfium_embeddertests/fpdfedit_embeddertest.o:../fpdfsdk/fpdfedit_embeddertest.cpp:function FPDFEditEmbeddertest_LoadSimpleType1Font_Test::TestBody(): error: undefined reference to 'CPDF_Dictionary::KeyExist(CFX_ByteString const&) const'
obj/pdfium_embeddertests/fpdfedit_embeddertest.o:../fpdfsdk/fpdfedit_embeddertest.cpp:function FPDFEditEmbeddertest_LoadSimpleType1Font_Test::TestBody(): error: undefined reference to 'CPDF_Dictionary::KeyExist(CFX_ByteString const&) const'
obj/pdfium_embeddertests/fpdfedit_embeddertest.o:../fpdfsdk/fpdfedit_embeddertest.cpp:function FPDFEditEmbeddertest_LoadSimpleType1Font_Test::TestBody(): error: undefined reference to 'CPDF_Dictionary::GetIntegerFor(CFX_ByteString const&) const'
obj/pdfium_embeddertests/fpdfedit_embeddertest.o:../fpdfsdk/fpdfedit_embeddertest.cpp:function FPDFEditEmbeddertest_LoadSimpleType1Font_Test::TestBody(): error: undefined reference to 'CPDF_Dictionary::GetIntegerFor(CFX_ByteString const&) const'
obj/pdfium_embeddertests/fpdfedit_embeddertest.o:../fpdfsdk/fpdfedit_embeddertest.cpp:function FPDFEditEmbeddertest_LoadSimpleType1Font_Test::TestBody(): error: undefined reference to 'CPDF_Dictionary::GetArrayFor(CFX_ByteString const&) const'
obj/pdfium_embeddertests/fpdfedit_embeddertest.o:../fpdfsdk/fpdfedit_embeddertest.cpp:function FPDFEditEmbeddertest_LoadSimpleType1Font_Test::TestBody(): error: undefined reference to 'CPDF_Array::GetNumberAt(unsigned long) const'
obj/pdfium_embeddertests/fpdfedit_embeddertest.o:../fpdfsdk/fpdfedit_embeddertest.cpp:function FPDFEditEmbeddertest_LoadSimpleType1Font_Test::TestBody(): error: undefined reference to 'CPDF_Array::GetNumberAt(unsigned long) const'
obj/pdfium_embeddertests/fpdfedit_embeddertest.o:../fpdfsdk/fpdfedit_embeddertest.cpp:function FPDFEditEmbeddertest_LoadSimpleType1Font_Test::TestBody(): error: undefined reference to 'CPDF_Array::GetNumberAt(unsigned long) const'
obj/pdfium_embeddertests/fpdfedit_embeddertest.o:../fpdfsdk/fpdfedit_embeddertest.cpp:function FPDFEditEmbeddertest::CheckFontDescriptor(CPDF_Dictionary*, int, bool, bool, unsigned int, unsigned char const*): error: undefined reference to 'CPDF_Dictionary::GetDictFor(CFX_ByteString const&) const'
obj/pdfium_embeddertests/fpdfedit_embeddertest.o:../fpdfsdk/fpdfedit_embeddertest.cpp:function FPDFEditEmbeddertest::CheckFontDescriptor(CPDF_Dictionary*, int, bool, bool, unsigned int, unsigned char const*): error: undefined reference to 'CPDF_Dictionary::GetStringFor(CFX_ByteString const&) const'
obj/pdfium_embeddertests/fpdfedit_embeddertest.o:../fpdfsdk/fpdfedit_embeddertest.cpp:function FPDFEditEmbeddertest::CheckFontDescriptor(CPDF_Dictionary*, int, bool, bool, unsigned int, unsigned char const*): error: undefined reference to 'CPDF_Dictionary::KeyExist(CFX_ByteString const&) const'
obj/pdfium_embeddertests/fpdfedit_embeddertest.o:../fpdfsdk/fpdfedit_embeddertest.cpp:function FPDFEditEmbeddertest::CheckFontDescriptor(CPDF_Dictionary*, int, bool, bool, unsigned int, unsigned char const*): error: undefined reference to 'CPDF_Dictionary::GetIntegerFor(CFX_ByteString const&) const'
obj/pdfium_embeddertests/fpdfedit_embeddertest.o:../fpdfsdk/fpdfedit_embeddertest.cpp:function FPDFEditEmbeddertest::CheckFontDescriptor(CPDF_Dictionary*, int, bool, bool, unsigned int, unsigned char const*): error: undefined reference to 'CPDF_Dictionary::KeyExist(CFX_ByteString const&) const'
obj/pdfium_embeddertests/fpdfedit_embeddertest.o:../fpdfsdk/fpdfedit_embeddertest.cpp:function FPDFEditEmbeddertest::CheckFontDescriptor(CPDF_Dictionary*, int, bool, bool, unsigned int, unsigned char const*): error: undefined reference to 'CPDF_Dictionary::GetArrayFor(CFX_ByteString const&) const'
obj/pdfium_embeddertests/fpdfedit_embeddertest.o:../fpdfsdk/fpdfedit_embeddertest.cpp:function FPDFEditEmbeddertest::CheckFontDescriptor(CPDF_Dictionary*, int, bool, bool, unsigned int, unsigned char const*): error: undefined reference to 'CPDF_Dictionary::GetStreamFor(CFX_ByteString const&) const'
obj/pdfium_embeddertests/fpdfedit_embeddertest.o:../fpdfsdk/fpdfedit_embeddertest.cpp:function FPDFEditEmbeddertest_LoadSimpleTrueTypeFont_Test::TestBody(): error: undefined reference to 'CPDF_Font::GetStockFont(CPDF_Document*, CFX_StringCTemplate<char> const&)'
obj/pdfium_embeddertests/fpdfedit_embeddertest.o:../fpdfsdk/fpdfedit_embeddertest.cpp:function FPDFEditEmbeddertest_LoadSimpleTrueTypeFont_Test::TestBody(): error: undefined reference to 'CPDF_Dictionary::GetIntegerFor(CFX_ByteString const&) const'
obj/pdfium_embeddertests/fpdfedit_embeddertest.o:../fpdfsdk/fpdfedit_embeddertest.cpp:function FPDFEditEmbeddertest_LoadSimpleTrueTypeFont_Test::TestBody(): error: undefined reference to 'CPDF_Dictionary::GetArrayFor(CFX_ByteString const&) const'
obj/pdfium_embeddertests/fpdfedit_embeddertest.o:../fpdfsdk/fpdfedit_embeddertest.cpp:function FPDFEditEmbeddertest_LoadSimpleTrueTypeFont_Test::TestBody(): error: undefined reference to 'CPDF_Array::GetNumberAt(unsigned long) const'
obj/pdfium_embeddertests/fpdfedit_embeddertest.o:../fpdfsdk/fpdfedit_embeddertest.cpp:function FPDFEditEmbeddertest_LoadCIDType0Font_Test::TestBody(): error: undefined reference to 'CPDF_Font::GetStockFont(CPDF_Document*, CFX_StringCTemplate<char> const&)'
obj/pdfium_embeddertests/fpdfedit_embeddertest.o:../fpdfsdk/fpdfedit_embeddertest.cpp:function FPDFEditEmbeddertest_LoadCIDType0Font_Test::TestBody(): error: undefined reference to 'CPDF_Dictionary::GetArrayFor(CFX_ByteString const&) const'
obj/pdfium_embeddertests/fpdfedit_embeddertest.o:../fpdfsdk/fpdfedit_embeddertest.cpp:function FPDFEditEmbeddertest_LoadCIDType0Font_Test::TestBody(): error: undefined reference to 'CPDF_Array::GetDictAt(unsigned long) const'
obj/pdfium_embeddertests/fpdfedit_embeddertest.o:../fpdfsdk/fpdfedit_embeddertest.cpp:function FPDFEditEmbeddertest_LoadCIDType0Font_Test::TestBody(): error: undefined reference to 'CPDF_Dictionary::GetNumberFor(CFX_ByteString const&) const'
obj/pdfium_embeddertests/fpdfedit_embeddertest.o:../fpdfsdk/fpdfedit_embeddertest.cpp:function FPDFEditEmbeddertest::CheckCompositeFontWidths(CPDF_Array*, CPDF_Font*): error: undefined reference to 'CPDF_Array::GetObjectAt(unsigned long) const'
obj/pdfium_embeddertests/fpdfedit_embeddertest.o:../fpdfsdk/fpdfedit_embeddertest.cpp:function FPDFEditEmbeddertest_LoadCIDType2Font_Test::TestBody(): error: undefined reference to 'CPDF_Font::GetStockFont(CPDF_Document*, CFX_StringCTemplate<char> const&)'
obj/pdfium_embeddertests/fpdfedit_embeddertest.o:../fpdfsdk/fpdfedit_embeddertest.cpp:function FPDFEditEmbeddertest_LoadCIDType2Font_Test::TestBody(): error: undefined reference to 'CPDF_Array::GetDictAt(unsigned long) const'
obj/pdfium_embeddertests/fpdfedit_embeddertest.o:../fpdfsdk/fpdfedit_embeddertest.cpp:function FPDFEditEmbeddertest_LoadCIDType2Font_Test::TestBody(): error: undefined reference to 'CPDF_Dictionary::GetNumberFor(CFX_ByteString const&) const'
obj/pdfium_embeddertests/fpdfedit_embeddertest.o:../fpdfsdk/fpdfedit_embeddertest.cpp:function FPDFEditEmbeddertest_AddCIDFontText_Test::TestBody(): error: undefined reference to 'CFX_Font::CFX_Font()'
obj/pdfium_embeddertests/fpdfedit_embeddertest.o:../fpdfsdk/fpdfedit_embeddertest.cpp:function FPDFEditEmbeddertest_AddCIDFontText_Test::TestBody(): error: undefined reference to 'CFX_Font::LoadSubst(CFX_ByteString const&, bool, unsigned int, int, int, int, bool)'
obj/pdfium_embeddertests/fpdfedit_embeddertest.o:../fpdfsdk/fpdfedit_embeddertest.cpp:function FPDFEditEmbeddertest_AddCIDFontText_Test::TestBody(): error: undefined reference to 'CFX_Font::GetFaceName() const'
obj/pdfium_embeddertests/fpdfedit_embeddertest.o:../fpdfsdk/fpdfedit_embeddertest.cpp:function FPDFEditEmbeddertest_AddCIDFontText_Test::TestBody(): error: undefined reference to 'CFX_Font::~CFX_Font()'
obj/pdfium_embeddertests/fsdk_baseform_embeddertest.o:../fpdfsdk/fsdk_baseform_embeddertest.cpp:function FSDKBaseFormEmbeddertest_CBA_AnnotIterator_Test::TestBody(): error: undefined reference to 'CPDFSDK_FormFillEnvironment::GetPageView(int)'
obj/pdfium_embeddertests/fsdk_baseform_embeddertest.o:../fpdfsdk/fsdk_baseform_embeddertest.cpp:function FSDKBaseFormEmbeddertest_CBA_AnnotIterator_Test::TestBody(): error: undefined reference to 'CBA_AnnotIterator::CBA_AnnotIterator(CPDFSDK_PageView*, CPDF_Annot::Subtype)'
obj/pdfium_embeddertests/fsdk_baseform_embeddertest.o:../fpdfsdk/fsdk_baseform_embeddertest.cpp:function FSDKBaseFormEmbeddertest_CBA_AnnotIterator_Test::TestBody(): error: undefined reference to 'CBA_AnnotIterator::GetFirstAnnot()'
obj/pdfium_embeddertests/fsdk_baseform_embeddertest.o:../fpdfsdk/fsdk_baseform_embeddertest.cpp:function FSDKBaseFormEmbeddertest_CBA_AnnotIterator_Test::TestBody(): error: undefined reference to 'CBA_AnnotIterator::GetNextAnnot(CPDFSDK_Annot*)'
obj/pdfium_embeddertests/fsdk_baseform_embeddertest.o:../fpdfsdk/fsdk_baseform_embeddertest.cpp:function FSDKBaseFormEmbeddertest_CBA_AnnotIterator_Test::TestBody(): error: undefined reference to 'CBA_AnnotIterator::GetNextAnnot(CPDFSDK_Annot*)'
obj/pdfium_embeddertests/fsdk_baseform_embeddertest.o:../fpdfsdk/fsdk_baseform_embeddertest.cpp:function FSDKBaseFormEmbeddertest_CBA_AnnotIterator_Test::TestBody(): error: undefined reference to 'CBA_AnnotIterator::GetNextAnnot(CPDFSDK_Annot*)'
obj/pdfium_embeddertests/fsdk_baseform_embeddertest.o:../fpdfsdk/fsdk_baseform_embeddertest.cpp:function FSDKBaseFormEmbeddertest_CBA_AnnotIterator_Test::TestBody(): error: undefined reference to 'CBA_AnnotIterator::GetNextAnnot(CPDFSDK_Annot*)'
obj/pdfium_embeddertests/fsdk_baseform_embeddertest.o:../fpdfsdk/fsdk_baseform_embeddertest.cpp:function FSDKBaseFormEmbeddertest_CBA_AnnotIterator_Test::TestBody(): error: undefined reference to 'CBA_AnnotIterator::GetFirstAnnot()'
obj/pdfium_embeddertests/fsdk_baseform_embeddertest.o:../fpdfsdk/fsdk_baseform_embeddertest.cpp:function FSDKBaseFormEmbeddertest_CBA_AnnotIterator_Test::TestBody(): error: undefined reference to 'CBA_AnnotIterator::GetLastAnnot()'
obj/pdfium_embeddertests/fsdk_baseform_embeddertest.o:../fpdfsdk/fsdk_baseform_embeddertest.cpp:function FSDKBaseFormEmbeddertest_CBA_AnnotIterator_Test::TestBody(): error: undefined reference to 'CBA_AnnotIterator::GetPrevAnnot(CPDFSDK_Annot*)'
obj/pdfium_embeddertests/fsdk_baseform_embeddertest.o:../fpdfsdk/fsdk_baseform_embeddertest.cpp:function FSDKBaseFormEmbeddertest_CBA_AnnotIterator_Test::TestBody(): error: undefined reference to 'CBA_AnnotIterator::GetPrevAnnot(CPDFSDK_Annot*)'
obj/pdfium_embeddertests/fsdk_baseform_embeddertest.o:../fpdfsdk/fsdk_baseform_embeddertest.cpp:function FSDKBaseFormEmbeddertest_CBA_AnnotIterator_Test::TestBody(): error: undefined reference to 'CBA_AnnotIterator::GetPrevAnnot(CPDFSDK_Annot*)'
obj/pdfium_embeddertests/fsdk_baseform_embeddertest.o:../fpdfsdk/fsdk_baseform_embeddertest.cpp:function FSDKBaseFormEmbeddertest_CBA_AnnotIterator_Test::TestBody(): error: undefined reference to 'CBA_AnnotIterator::GetPrevAnnot(CPDFSDK_Annot*)'
obj/pdfium_embeddertests/fsdk_baseform_embeddertest.o:../fpdfsdk/fsdk_baseform_embeddertest.cpp:function FSDKBaseFormEmbeddertest_CBA_AnnotIterator_Test::TestBody(): error: undefined reference to 'CBA_AnnotIterator::GetLastAnnot()'
obj/pdfium_embeddertests/fsdk_baseform_embeddertest.o:../fpdfsdk/fsdk_baseform_embeddertest.cpp:function FSDKBaseFormEmbeddertest_CBA_AnnotIterator_Test::TestBody(): error: undefined reference to 'CBA_AnnotIterator::~CBA_AnnotIterator()'
obj/pdfium_embeddertests/fsdk_baseform_embeddertest.o:../fpdfsdk/fsdk_baseform_embeddertest.cpp:function FSDKBaseFormEmbeddertest_CBA_AnnotIterator_Test::TestBody(): error: undefined reference to 'CPDFSDK_FormFillEnvironment::GetPageView(int)'
obj/pdfium_embeddertests/fsdk_baseform_embeddertest.o:../fpdfsdk/fsdk_baseform_embeddertest.cpp:function FSDKBaseFormEmbeddertest_CBA_AnnotIterator_Test::TestBody(): error: undefined reference to 'CBA_AnnotIterator::CBA_AnnotIterator(CPDFSDK_PageView*, CPDF_Annot::Subtype)'
obj/pdfium_embeddertests/fsdk_baseform_embeddertest.o:../fpdfsdk/fsdk_baseform_embeddertest.cpp:function FSDKBaseFormEmbeddertest_CBA_AnnotIterator_Test::TestBody(): error: undefined reference to 'CBA_AnnotIterator::GetFirstAnnot()'
obj/pdfium_embeddertests/fsdk_baseform_embeddertest.o:../fpdfsdk/fsdk_baseform_embeddertest.cpp:function FSDKBaseFormEmbeddertest_CBA_AnnotIterator_Test::TestBody(): error: undefined reference to 'CBA_AnnotIterator::GetFirstAnnot()'
obj/pdfium_embeddertests/fsdk_baseform_embeddertest.o:../fpdfsdk/fsdk_baseform_embeddertest.cpp:function FSDKBaseFormEmbeddertest_CBA_AnnotIterator_Test::TestBody(): error: undefined reference to 'CBA_AnnotIterator::GetLastAnnot()'
obj/pdfium_embeddertests/fsdk_baseform_embeddertest.o:../fpdfsdk/fsdk_baseform_embeddertest.cpp:function FSDKBaseFormEmbeddertest_CBA_AnnotIterator_Test::TestBody(): error: undefined reference to 'CBA_AnnotIterator::GetLastAnnot()'
obj/pdfium_embeddertests/fsdk_baseform_embeddertest.o:../fpdfsdk/fsdk_baseform_embeddertest.cpp:function FSDKBaseFormEmbeddertest_CBA_AnnotIterator_Test::TestBody(): error: undefined reference to 'CBA_AnnotIterator::~CBA_AnnotIterator()'
obj/pdfium_embeddertests/fsdk_baseform_embeddertest.o:../fpdfsdk/fsdk_baseform_embeddertest.cpp:function FSDKBaseFormEmbeddertest_CBA_AnnotIterator_Test::TestBody(): error: undefined reference to 'CPDFSDK_FormFillEnvironment::GetPageView(int)'
obj/pdfium_embeddertests/fsdk_baseform_embeddertest.o:../fpdfsdk/fsdk_baseform_embeddertest.cpp:function FSDKBaseFormEmbeddertest_CBA_AnnotIterator_Test::TestBody(): error: undefined reference to 'CBA_AnnotIterator::CBA_AnnotIterator(CPDFSDK_PageView*, CPDF_Annot::Subtype)'
obj/pdfium_embeddertests/fsdk_baseform_embeddertest.o:../fpdfsdk/fsdk_baseform_embeddertest.cpp:function FSDKBaseFormEmbeddertest_CBA_AnnotIterator_Test::TestBody(): error: undefined reference to 'CBA_AnnotIterator::~CBA_AnnotIterator()'
obj/pdfium_embeddertests/cpwl_combo_box_embeddertest.o:../fpdfsdk/pwl/cpwl_combo_box_embeddertest.cpp:function CPWLComboBoxEditEmbeddertest_GetSelectedTextEmptyAndBasicNormal_Test::TestBody(): error: undefined reference to 'CPWL_ComboBox::GetText() const'
obj/pdfium_embeddertests/cpwl_combo_box_embeddertest.o:../fpdfsdk/pwl/cpwl_combo_box_embeddertest.cpp:function CPWLComboBoxEditEmbeddertest_GetSelectedTextEmptyAndBasicNormal_Test::TestBody(): error: undefined reference to 'CPWL_ComboBox::GetText() const'
obj/pdfium_embeddertests/cpwl_combo_box_embeddertest.o:../fpdfsdk/pwl/cpwl_combo_box_embeddertest.cpp:function CPWLComboBoxEditEmbeddertest_GetSelectedTextEmptyAndBasicNormal_Test::TestBody(): error: undefined reference to 'CPWL_ComboBox::SetSelectText()'
obj/pdfium_embeddertests/cpwl_combo_box_embeddertest.o:../fpdfsdk/pwl/cpwl_combo_box_embeddertest.cpp:function CPWLComboBoxEditEmbeddertest_GetSelectedTextEmptyAndBasicNormal_Test::TestBody(): error: undefined reference to 'CPWL_ComboBox::SetSelect(int)'
obj/pdfium_embeddertests/cpwl_combo_box_embeddertest.o:../fpdfsdk/pwl/cpwl_combo_box_embeddertest.cpp:function CPWLComboBoxEditEmbeddertest_GetSelectedTextEmptyAndBasicNormal_Test::TestBody(): error: undefined reference to 'CPWL_ComboBox::SetSelect(int)'
obj/pdfium_embeddertests/cpwl_combo_box_embeddertest.o:../fpdfsdk/pwl/cpwl_combo_box_embeddertest.cpp:function CPWLComboBoxEditEmbeddertest::FormFillerAndWindowSetup(CPDFSDK_Annot*): error: undefined reference to 'CPDFSDK_FormFillEnvironment::GetInteractiveFormFiller()'
obj/pdfium_embeddertests/cpwl_combo_box_embeddertest.o:../fpdfsdk/pwl/cpwl_combo_box_embeddertest.cpp:function CPWLComboBoxEditEmbeddertest::FormFillerAndWindowSetup(CPDFSDK_Annot*): error: undefined reference to 'CFFL_InteractiveFormFiller::OnSetFocus(CFX_Observable<CPDFSDK_Annot>::ObservedPtr*, unsigned int)'
obj/pdfium_embeddertests/cpwl_combo_box_embeddertest.o:../fpdfsdk/pwl/cpwl_combo_box_embeddertest.cpp:function CPWLComboBoxEditEmbeddertest::FormFillerAndWindowSetup(CPDFSDK_Annot*): error: undefined reference to 'CFFL_InteractiveFormFiller::GetFormFiller(CPDFSDK_Annot*, bool)'
obj/pdfium_embeddertests/cpwl_combo_box_embeddertest.o:../fpdfsdk/pwl/cpwl_combo_box_embeddertest.cpp:function CPWLComboBoxEditEmbeddertest::FormFillerAndWindowSetup(CPDFSDK_Annot*): error: undefined reference to 'CPDFSDK_FormFillEnvironment::GetPageView(int)'
obj/pdfium_embeddertests/cpwl_combo_box_embeddertest.o:../fpdfsdk/pwl/cpwl_combo_box_embeddertest.cpp:function CPWLComboBoxEditEmbeddertest::FormFillerAndWindowSetup(CPDFSDK_Annot*): error: undefined reference to 'CFFL_FormFiller::GetPDFWindow(CPDFSDK_PageView*, bool)'
obj/pdfium_embeddertests/cpwl_combo_box_embeddertest.o:../fpdfsdk/pwl/cpwl_combo_box_embeddertest.cpp:function CPWLComboBoxEditEmbeddertest_GetSelectedTextFragmentsNormal_Test::TestBody(): error: undefined reference to 'CPWL_ComboBox::GetText() const'
obj/pdfium_embeddertests/cpwl_combo_box_embeddertest.o:../fpdfsdk/pwl/cpwl_combo_box_embeddertest.cpp:function CPWLComboBoxEditEmbeddertest_GetSelectedTextFragmentsNormal_Test::TestBody(): error: undefined reference to 'CPWL_ComboBox::SetEditSelection(int, int)'
obj/pdfium_embeddertests/cpwl_combo_box_embeddertest.o:../fpdfsdk/pwl/cpwl_combo_box_embeddertest.cpp:function CPWLComboBoxEditEmbeddertest_GetSelectedTextFragmentsNormal_Test::TestBody(): error: undefined reference to 'CPWL_ComboBox::SetEditSelection(int, int)'
obj/pdfium_embeddertests/cpwl_combo_box_embeddertest.o:../fpdfsdk/pwl/cpwl_combo_box_embeddertest.cpp:function CPWLComboBoxEditEmbeddertest_GetSelectedTextFragmentsNormal_Test::TestBody(): error: undefined reference to 'CPWL_ComboBox::SetEditSelection(int, int)'
obj/pdfium_embeddertests/cpwl_combo_box_embeddertest.o:../fpdfsdk/pwl/cpwl_combo_box_embeddertest.cpp:function CPWLComboBoxEditEmbeddertest_GetSelectedTextFragmentsNormal_Test::TestBody(): error: undefined reference to 'CPWL_ComboBox::SetEditSelection(int, int)'
obj/pdfium_embeddertests/cpwl_combo_box_embeddertest.o:../fpdfsdk/pwl/cpwl_combo_box_embeddertest.cpp:function CPWLComboBoxEditEmbeddertest_GetSelectedTextEmptyAndBasicEditable_Test::TestBody(): error: undefined reference to 'CPWL_ComboBox::GetText() const'
obj/pdfium_embeddertests/cpwl_combo_box_embeddertest.o:../fpdfsdk/pwl/cpwl_combo_box_embeddertest.cpp:function CPWLComboBoxEditEmbeddertest_GetSelectedTextEmptyAndBasicEditable_Test::TestBody(): error: undefined reference to 'CPWL_ComboBox::SetSelect(int)'
obj/pdfium_embeddertests/cpwl_combo_box_embeddertest.o:../fpdfsdk/pwl/cpwl_combo_box_embeddertest.cpp:function CPWLComboBoxEditEmbeddertest_GetSelectedTextEmptyAndBasicEditable_Test::TestBody(): error: undefined reference to 'CPWL_ComboBox::SetSelectText()'
obj/pdfium_embeddertests/cpwl_combo_box_embeddertest.o:../fpdfsdk/pwl/cpwl_combo_box_embeddertest.cpp:function CPWLComboBoxEditEmbeddertest_GetSelectedTextEmptyAndBasicEditable_Test::TestBody(): error: undefined reference to 'CPWL_ComboBox::SetSelect(int)'
obj/pdfium_embeddertests/cpwl_combo_box_embeddertest.o:../fpdfsdk/pwl/cpwl_combo_box_embeddertest.cpp:function CPWLComboBoxEditEmbeddertest::CreateAndInitializeFormComboboxPDF(): error: undefined reference to 'CBA_AnnotIterator::CBA_AnnotIterator(CPDFSDK_PageView*, CPDF_Annot::Subtype)'
obj/pdfium_embeddertests/cpwl_combo_box_embeddertest.o:../fpdfsdk/pwl/cpwl_combo_box_embeddertest.cpp:function CPWLComboBoxEditEmbeddertest::CreateAndInitializeFormComboboxPDF(): error: undefined reference to 'CBA_AnnotIterator::~CBA_AnnotIterator()'
obj/pdfium_embeddertests/cpwl_edit_embeddertest.o:../fpdfsdk/pwl/cpwl_edit_embeddertest.cpp:function CPWLEditEmbeddertest_TypeText_Test::TestBody(): error: undefined reference to 'CPWL_EditCtrl::GetText() const'
obj/pdfium_embeddertests/cpwl_edit_embeddertest.o:../fpdfsdk/pwl/cpwl_edit_embeddertest.cpp:function CPWLEditEmbeddertest_TypeText_Test::TestBody(): error: undefined reference to 'CPWL_EditCtrl::GetText() const'
obj/pdfium_embeddertests/cpwl_edit_embeddertest.o:../fpdfsdk/pwl/cpwl_edit_embeddertest.cpp:function CPWLEditEmbeddertest::FormFillerAndWindowSetup(CPDFSDK_Annot*): error: undefined reference to 'CPDFSDK_FormFillEnvironment::GetInteractiveFormFiller()'
obj/pdfium_embeddertests/cpwl_edit_embeddertest.o:../fpdfsdk/pwl/cpwl_edit_embeddertest.cpp:function CPWLEditEmbeddertest::FormFillerAndWindowSetup(CPDFSDK_Annot*): error: undefined reference to 'CFFL_InteractiveFormFiller::OnSetFocus(CFX_Observable<CPDFSDK_Annot>::ObservedPtr*, unsigned int)'
obj/pdfium_embeddertests/cpwl_edit_embeddertest.o:../fpdfsdk/pwl/cpwl_edit_embeddertest.cpp:function CPWLEditEmbeddertest::FormFillerAndWindowSetup(CPDFSDK_Annot*): error: undefined reference to 'CFFL_InteractiveFormFiller::GetFormFiller(CPDFSDK_Annot*, bool)'
obj/pdfium_embeddertests/cpwl_edit_embeddertest.o:../fpdfsdk/pwl/cpwl_edit_embeddertest.cpp:function CPWLEditEmbeddertest::FormFillerAndWindowSetup(CPDFSDK_Annot*): error: undefined reference to 'CFFL_FormFiller::GetPDFWindow(CPDFSDK_PageView*, bool)'
obj/pdfium_embeddertests/cpwl_edit_embeddertest.o:../fpdfsdk/pwl/cpwl_edit_embeddertest.cpp:function CPWLEditEmbeddertest_GetSelectedTextEmptyAndBasic_Test::TestBody(): error: undefined reference to 'CPWL_EditCtrl::SetSelection(int, int)'
obj/pdfium_embeddertests/cpwl_edit_embeddertest.o:../fpdfsdk/pwl/cpwl_edit_embeddertest.cpp:function CPWLEditEmbeddertest_GetSelectedTextEmptyAndBasic_Test::TestBody(): error: undefined reference to 'CPWL_EditCtrl::SetSelection(int, int)'
obj/pdfium_embeddertests/cpwl_edit_embeddertest.o:../fpdfsdk/pwl/cpwl_edit_embeddertest.cpp:function CPWLEditEmbeddertest_GetSelectedTextFragments_Test::TestBody(): error: undefined reference to 'CPWL_EditCtrl::SetSelection(int, int)'
obj/pdfium_embeddertests/cpwl_edit_embeddertest.o:../fpdfsdk/pwl/cpwl_edit_embeddertest.cpp:function CPWLEditEmbeddertest_GetSelectedTextFragments_Test::TestBody(): error: undefined reference to 'CPWL_EditCtrl::SetSelection(int, int)'
obj/pdfium_embeddertests/cpwl_edit_embeddertest.o:../fpdfsdk/pwl/cpwl_edit_embeddertest.cpp:function CPWLEditEmbeddertest_DeleteEntireTextSelection_Test::TestBody(): error: undefined reference to 'CPWL_EditCtrl::GetText() const'
obj/pdfium_embeddertests/cpwl_edit_embeddertest.o:../fpdfsdk/pwl/cpwl_edit_embeddertest.cpp:function CPWLEditEmbeddertest_DeleteTextSelectionMiddle_Test::TestBody(): error: undefined reference to 'CPWL_EditCtrl::GetText() const'
obj/pdfium_embeddertests/embedder_test.o:../testing/embedder_test.cpp:function EmbedderTest::CompareBitmap(void*, int, int, char const*): error: undefined reference to 'CRYPT_MD5Generate(unsigned char const*, unsigned int, unsigned char*)'
obj/pdfium_embeddertests/embedder_test.o:../testing/embedder_test.cpp:function EmbedderTest::HashBitmap[abi:cxx11](void*, int, int): error: undefined reference to 'CRYPT_MD5Generate(unsigned char const*, unsigned int, unsigned char*)'
obj/pdfium_embeddertests/public_methods_embeddertest.o:../fpdfsdk/javascript/public_methods_embeddertest.cpp:function PublicMethodsEmbedderTest_MakeRegularDate_Test::TestBody(): error: undefined reference to 'CJS_PublicMethods::MakeRegularDate(CFX_WideString const&, CFX_WideString const&, bool*)'
obj/pdfium_embeddertests/public_methods_embeddertest.o:../fpdfsdk/javascript/public_methods_embeddertest.cpp:function PublicMethodsEmbedderTest_MakeRegularDate_Test::TestBody(): error: undefined reference to 'CJS_PublicMethods::MakeRegularDate(CFX_WideString const&, CFX_WideString const&, bool*)'
obj/pdfium_embeddertests/public_methods_embeddertest.o:../fpdfsdk/javascript/public_methods_embeddertest.cpp:function PublicMethodsEmbedderTest_MakeRegularDate_Test::TestBody(): error: undefined reference to 'CJS_PublicMethods::MakeRegularDate(CFX_WideString const&, CFX_WideString const&, bool*)'
obj/pdfium_embeddertests/public_methods_embeddertest.o:../fpdfsdk/javascript/public_methods_embeddertest.cpp:function PublicMethodsEmbedderTest_MakeRegularDate_Test::TestBody(): error: undefined reference to 'CJS_PublicMethods::MakeRegularDate(CFX_WideString const&, CFX_WideString const&, bool*)'
obj/pdfium_embeddertests/public_methods_embeddertest.o:../fpdfsdk/javascript/public_methods_embeddertest.cpp:function PublicMethodsEmbedderTest_MakeFormatDate_Test::TestBody(): error: undefined reference to 'CJS_PublicMethods::MakeFormatDate(double, CFX_WideString const&)'
obj/pdfium_embeddertests/public_methods_embeddertest.o:../fpdfsdk/javascript/public_methods_embeddertest.cpp:function PublicMethodsEmbedderTest_MakeFormatDate_Test::TestBody(): error: undefined reference to 'CJS_PublicMethods::MakeFormatDate(double, CFX_WideString const&)'
obj/pdfium_embeddertests/public_methods_embeddertest.o:../fpdfsdk/javascript/public_methods_embeddertest.cpp:function PublicMethodsEmbedderTest_MakeFormatDate_Test::TestBody(): error: undefined reference to 'CJS_PublicMethods::MakeFormatDate(double, CFX_WideString const&)'
obj/pdfium_embeddertests/public_methods_embeddertest.o:../fpdfsdk/javascript/public_methods_embeddertest.cpp:function PublicMethodsEmbedderTest_MakeFormatDate_Test::TestBody(): error: undefined reference to 'CJS_PublicMethods::MakeFormatDate(double, CFX_WideString const&)'
obj/pdfium_embeddertests/xfa_js_embedder_test.o:../testing/xfa_js_embedder_test.cpp:function XFAJSEmbedderTest::OpenDocument(std::__cxx11::basic_string<char, std::char_traits<char>, std::allocator<char> > const&, char const*, bool): error: undefined reference to 'UnderlyingFromFPDFDocument(void*)'
obj/pdfium_embeddertests/xfa_js_embedder_test.o:../testing/xfa_js_embedder_test.cpp:function XFAJSEmbedderTest::OpenDocument(std::__cxx11::basic_string<char, std::char_traits<char>, std::allocator<char> > const&, char const*, bool): error: undefined reference to 'CXFA_DocumentParser::GetDocument() const'
obj/pdfium_embeddertests/xfa_js_embedder_test.o:../testing/xfa_js_embedder_test.cpp:function XFAJSEmbedderTest::OpenDocument(std::__cxx11::basic_string<char, std::char_traits<char>, std::allocator<char> > const&, char const*, bool): error: undefined reference to 'CXFA_Document::GetScriptContext()'
obj/pdfium_embeddertests/xfa_js_embedder_test.o:../testing/xfa_js_embedder_test.cpp:function XFAJSEmbedderTest::ExecuteHelper(CFX_StringCTemplate<char> const&): error: undefined reference to 'UnderlyingFromFPDFDocument(void*)'
obj/pdfium_embeddertests/xfa_js_embedder_test.o:../testing/xfa_js_embedder_test.cpp:function XFAJSEmbedderTest::ExecuteHelper(CFX_StringCTemplate<char> const&): error: undefined reference to 'CXFA_DocumentParser::GetDocument() const'
obj/pdfium_embeddertests/xfa_js_embedder_test.o:../testing/xfa_js_embedder_test.cpp:function XFAJSEmbedderTest::ExecuteHelper(CFX_StringCTemplate<char> const&): error: undefined reference to 'CXFA_ScriptContext::RunScript(XFA_SCRIPTLANGTYPE, CFX_StringCTemplate<wchar_t> const&, CFXJSE_Value*, CXFA_Object*)'
obj/test_support/test_support.o:../testing/test_support.cpp:function GenerateMD5Base16[abi:cxx11](unsigned char const*, unsigned int): error: undefined reference to 'CRYPT_MD5Generate(unsigned char const*, unsigned int, unsigned char*)'
clang-4.0: error: linker command failed with exit code 1 (use -v to see invocation)
ninja: build stopped: subcommand failed.