{"text_format":"3","workbook":"xlsx","n_sheets":15,"sheets":["Fragebogen","Ergebnis","Datenbank","Norm_f16–20","Norm_f21–24","Norm_f25–29","Norm_f30–49","Norm_f49+","Norm_f","Norm_m16–20","Norm_m21–24","Norm_m25–29","Norm_m30–49","Norm_m49+","Norm_m"],"not_rendered":{"charts":1,"defined_names":2},"read":"whole","date_system":"1900"}

{"sheet":"Fragebogen","index":0,"n_rows":248,"n_cols":7,"rows_kept":248,"merged":[[2,0,2,2]]}
["NEO PI-R"]
[]
["Bitte lesen Sie jede Aussage genau durch und tragen Sie als Antwort die Zahl ein, die Ihre Sichtweise am besten ausdrückt."]
[]
[{"$nulls":3},"Alles hierunter bitte nicht verändern ↓"]
[]
["Nr.","Antwort","Item","Rohwert","Invertiert?","Tabelle für Eingabekontrolle"]
[1,null,"Ich bin nicht leicht beunruhigt.",{"$f":"IF(ISNUMBER(B8),IF(E8=\"b\",4-B8,B8),\"\")","v":""},"b",0,"Starke Ablehnung"]
[2,null,"Die meisten Menschen die mir begegnen sind mir wirklich sympathisch.","",null,1,"Ablehnung"]
[3,null,"Ich habe eine sehr lebhafte Vorstellungskraft.","",null,2,"Neutral"]
{"$rows_left_out":239}
{"sheet":"Ergebnis","index":1,"n_rows":38,"n_cols":24,"rows_kept":38,"merged":[[0,1,0,5],[0,17,0,18],[0,20,0,23],[1,6,1,12],[2,14,2,15]]}
["Normstichprobe:","Frauen von 30–49",{"$nulls":12},"Gewählt:",{"$f":"VLOOKUP(B1,O4:P17,2,FALSE)","v":"Norm_f30–49"},null,"Werte für Tabelle",null,null,"HILFSSPALTEN, BITTE SO LASSEN"]
[{"$nulls":6},"T-Werte (zentriert)",{"$nulls":11},{"$f":"D4","v":"<=20"},null,"B",36,37,38]
["Bezeichnung","Abkürzung","Rohwert","T","ST","PR",{"$nulls":8},"Lookup Table",null,null,{"$f":"D5","v":"<=20"},null,null,"C",35,36,37]
["Neurotizismus","neon",{"$f":"SUM(C5:C10)","v":0},{"$f":"VLOOKUP($C4,INDIRECT(\"'\"&$P$1&\"'!\"&$U2&\"4:$AM$64\"),V2,TRUE)","v":"<=20"},{"$f":"VLOOKUP($C4,INDIRECT(\"'\"&$P$1&\"'!\"&$U2&\"4:$AM$64\"),W2,TRUE)","v":1},{"$f":"VLOOKUP($C4,INDIRECT(\"'\"&$P$1&\"'!\"&$U2&\"4:$AM$64\"),X2,TRUE)","v":"<=0,1"},{"$nulls":8},"Frauen von 16–20","Norm_f16–20",null,"<=20",null,null,"D",34,35,36]
["Ängstlichkeit","neon1",{"$f":"SUM(Fragebogen!D98,Fragebogen!D68,Fragebogen!D38,Fragebogen!D8,Fragebogen!D158,Fragebogen!D218,Fragebogen!D128,Fragebogen!D188)","v":0},"<=20",1,"<=0,1",{"$nulls":8},"Frauen von 21–24","Norm_f21–24",null,"<=20",null,null,"E",33,34,35]
["Reizbarkeit","neon2",{"$f":"SUM(Fragebogen!D43,Fragebogen!D13,Fragebogen!D103,Fragebogen!D73,Fragebogen!D163,Fragebogen!D133,Fragebogen!D193,Fragebogen!D223)","v":0},"<=20",1,"<=0,1",{"$nulls":8},"Frauen von 25–29","Norm_f25–29",null,"<=20",null,null,"F",32,33,34]
["Depression","neon3",{"$f":"SUM(Fragebogen!D48,Fragebogen!D108,Fragebogen!D138,Fragebogen!D168,Fragebogen!D198,Fragebogen!D18,Fragebogen!D228,Fragebogen!D78)","v":0},"<=20",1,"<=0,1",{"$nulls":8},"Frauen von 30–49","Norm_f30–49",null,"<=20",null,null,"G",31,32,33]
["Befangenheit","neon4",{"$f":"SUM(Fragebogen!D53,Fragebogen!D23,Fragebogen!D113,Fragebogen!D83,Fragebogen!D143,Fragebogen!D173,Fragebogen!D203,Fragebogen!D233)","v":0},"<=20",1,"<=0,1",{"$nulls":8},"Frauen über 49","Norm_f49+",null,"<=20",null,null,"H",30,31,32]
["Impulsivität","neon5",{"$f":"SUM(Fragebogen!D58,Fragebogen!D28,Fragebogen!D118,Fragebogen!D88,Fragebogen!D178,Fragebogen!D238,Fragebogen!D208,Fragebogen!D148)","v":0},"<=20",1,"<=0,1",{"$nulls":8},"Frauen gesamt","Norm_f",null,null,{"$f":"D11","v":"<=20"},null,"I",29,30,31]
["Verletzlichkeit","neon6",{"$f":"SUM(Fragebogen!D63,Fragebogen!D33,Fragebogen!D123,Fragebogen!D93,Fragebogen!D183,Fragebogen!D153,Fragebogen!D213,Fragebogen!D243)","v":0},"<=20",1,"<=0,1",{"$nulls":8},"Männer von 16–20","Norm_m16–20",null,{"$f":"D12","v":"<=20"},null,null,"J",28,29,30]
{"$rows_left_out":29}
{"sheet":"Datenbank","index":2,"n_rows":2,"n_cols":37,"rows_kept":2}
["Pat.-Nr./Name","Normtabelle","Neurotizismus","Ängstlichkeit","Reizbarkeit","Depression","Befangenheit","Impulsivität","Verletzlichkeit","Extraversion","Herzlichkeit","Geselligkeit","Durchsetzungsfähigkeit","Aktivität","Erlebnishunger","Frohsinn","Openness","Phantasie","Ästhetik","Gefühle","Handlungen","Ideen","Werte","Agreeableness","Vertrauen","Freimütigkeit","Altruismus","Entgegenkommen","Bescheidenheit","Gutherzigkeit","Conciousness","Kompetenz","Ordnungsliebe","Pflichtbewusstsein","Leistungsstreben","Selbstdisziplin","Besonnenheit"]
["Patient1"]

{"sheet":"Norm_f16–20","index":3,"n_rows":65,"n_cols":39,"rows_kept":65,"hidden":true}
[null,"NEO-PI-R-Form S Normwerte: Frauen 16–20"]
[]
["T","n","n1","n2","n3","n4","n5","n6","e","e1","e2","e3","e4","e5","e6","o","o1","o2","o3","o4","o5","o6","a","a1","a2","a3","a4","a5","a6","c","c1","c2","c3","c4","c5","c6","T","ST","PR"]
["<=20",0,0,0,0,0,0,0,0,0,0,0,0,0,0,0,0,0,0,0,0,0,0,0,0,0,0,0,0,0,null,0,0,0,0,0,"<=20",1,"<=0,1"]
[21,46,null,null,1,null,5,null,58,{"$nulls":3},5,3,5,83,7,6,null,5,{"$nulls":8},8,null,0,null,5,{"$nulls":3},21,1,0.2]
[22,47,4,4,null,null,6,3,null,10,null,2,{"$nulls":3},84,9,null,11,6,null,12,57,4,{"$nulls":3},4,null,48,null,null,6,null,3,3,22,1,0.3]
[23,null,5,null,null,6,null,null,59,{"$nulls":3},6,4,7,85,null,7,12,7,6,null,59,null,5,9,4,null,10,49,null,5,7,{"$nulls":3},23,1,0.4]
[24,48,null,null,2,null,7,null,62,11,4,null,7,5,8,86,null,8,{"$nulls":4},61,5,6,null,null,5,11,51,9,null,null,7,null,null,24,1,0.5]
[25,49,6,5,null,7,null,4,63,12,{"$nulls":5},87,null,9,13,null,null,13,64,null,null,11,{"$nulls":3},55,null,null,8,null,4,4,25,1,0.6]
[26,50,{"$nulls":4},8,null,65,null,5,3,8,null,9,88,10,10,null,8,7,null,65,null,7,{"$nulls":3},12,59,10,6,{"$nulls":4},26,1,0.8]
{"$rows_left_out":56}
{"sheet":"Norm_f21–24","index":4,"n_rows":65,"n_cols":39,"rows_kept":65,"hidden":true}
[null,"NEO-PI-R-Form S Normwerte: Frauen 21–24"]
[]
["T","n","n1","n2","n3","n4","n5","n6","e","e1","e2","e3","e4","e5","e6","o","o1","o2","o3","o4","o5","o6","a","a1","a2","a3","a4","a5","a6","c","c1","c2","c3","c4","c5","c6","T","ST","PR"]
["<=20",0,0,0,0,0,0,0,0,0,0,0,0,0,0,0,0,0,0,0,0,0,0,0,0,0,0,0,0,0,0,0,0,0,0,0,"<=20",1,"<=0,1"]
[21,32,null,2,null,3,null,null,45,{"$nulls":3},7,null,null,68,6,4,11,null,null,11,40,{"$nulls":3},3,2,null,43,null,2,{"$nulls":4},21,1,0.2]
[22,36,3,null,1,4,6,null,46,8,{"$nulls":4},5,72,null,6,12,6,5,null,41,3,5,8,null,null,9,44,7,3,null,6,3,null,22,1,0.3]
[23,38,{"$nulls":5},2,51,9,2,null,null,4,6,75,7,null,13,null,null,12,48,{"$nulls":3},4,null,10,50,null,null,8,null,null,2,23,1,0.4]
[24,39,null,3,null,5,7,null,57,10,3,2,{"$nulls":3},76,null,7,null,7,null,null,52,4,6,9,null,4,null,54,null,4,null,7,null,null,24,1,0.5]
[25,41,4,{"$nulls":5},58,{"$nulls":3},8,null,7,81,8,8,null,null,6,13,63,null,null,11,5,5,11,57,8,5,9,null,4,3,25,1,0.6]
[26,43,5,4,2,6,8,3,62,11,4,3,null,null,8,82,null,9,14,8,null,null,66,5,{"$nulls":3},6,12,60,9,null,10,8,null,null,26,1,0.8]
{"$rows_left_out":56}
{"sheet":"Norm_f25–29","index":5,"n_rows":65,"n_cols":39,"rows_kept":65,"hidden":true}
[null,"NEO-PI-R-Form S Normwerte: Frauen 25–29"]
[]
["T","n","n1","n2","n3","n4","n5","n6","e","e1","e2","e3","e4","e5","e6","o","o1","o2","o3","o4","o5","o6","a","a1","a2","a3","a4","a5","a6","c","c1","c2","c3","c4","c5","c6","T","ST","PR"]
["<=20",0,0,0,0,0,0,0,0,0,0,null,0,0,0,0,0,0,0,0,0,0,0,0,0,0,0,0,0,0,0,0,0,0,0,0,"<=20",1,"<=0,1"]
[21,35,{"$nulls":4},5,null,51,8,3,0,null,null,2,null,5,7,10,{"$nulls":3},60,null,6,9,null,1,10,60,8,{"$nulls":5},21,1,0.2]
[22,null,null,3,1,3,{"$nulls":3},9,null,null,7,null,3,72,null,null,11,7,4,null,null,4,null,null,4,{"$nulls":4},5,{"$nulls":4},22,1,0.3]
[23,37,3,{"$nulls":3},6,2,53,10,4,{"$nulls":3},4,73,{"$nulls":6},62,null,7,null,null,5,11,61,9,null,8,7,null,null,23,1,0.4]
[24,null,null,4,{"$nulls":4},55,null,null,2,null,3,null,null,7,8,null,null,5,12,63,5,null,10,{"$nulls":3},63,{"$nulls":4},4,2,24,1,0.5]
[25,40,4,null,2,6,7,null,56,11,5,null,8,null,5,74,null,null,12,8,null,null,64,null,null,11,5,6,12,64,10,null,11,{"$nulls":3},25,1,0.6]
[26,43,null,5,{"$nulls":3},3,57,{"$nulls":5},6,75,8,9,13,null,6,null,66,6,8,null,6,null,null,66,11,6,{"$nulls":3},4,26,1,0.8]
{"$rows_left_out":56}
{"sheet":"Norm_f30–49","index":6,"n_rows":65,"n_cols":39,"rows_kept":65,"hidden":true}
[null,"NEO-PI-R-Form S Normwerte: Frauen 30–49"]
[]
["T","n","n1","n2","n3","n4","n5","n6","e","e1","e2","e3","e4","e5","e6","o","o1","o2","o3","o4","o5","o6","a","a1","a2","a3","a4","a5","a6","c","c1","c2","c3","c4","c5","c6","T","ST","PR"]
["<=20",0,0,0,0,0,0,0,0,0,0,0,0,0,0,0,0,0,0,0,0,0,0,0,0,0,0,0,0,0,0,0,0,0,0,0,"<=20",1,"<=0,1"]
[21,31,{"$nulls":6},52,8,null,2,null,null,3,63,null,null,10,5,3,10,53,null,null,9,4,null,10,56,8,4,8,{"$nulls":3},21,1,0.2]
[22,33,{"$nulls":3},4,5,null,null,9,null,null,7,1,null,67,5,4,11,null,4,null,60,5,null,null,5,4,null,58,{"$nulls":5},3,22,1,0.3]
[23,36,3,3,{"$nulls":3},1,55,null,3,{"$nulls":3},4,68,null,6,null,null,5,11,65,null,7,11,6,5,11,60,9,5,9,7,5,null,23,1,0.4]
[24,37,null,null,1,{"$nulls":3},57,10,{"$nulls":5},70,null,7,12,6,null,null,67,6,{"$nulls":5},61,null,null,11,null,null,4,24,1,0.5]
[25,38,4,null,null,5,6,2,58,null,null,3,8,2,5,73,7,8,null,null,6,12,70,{"$nulls":4},7,12,63,10,6,{"$nulls":4},25,1,0.6]
[26,41,{"$nulls":5},3,60,11,4,{"$nulls":3},6,74,null,9,null,null,7,null,73,7,8,12,7,null,null,65,null,null,12,8,6,5,26,1,0.8]
{"$rows_left_out":56}
{"sheet":"Norm_f49+","index":7,"n_rows":65,"n_cols":39,"rows_kept":65,"hidden":true}
[null,"NEO-PI-R-Form S Normwerte: Frauen 50+"]
[]
["T","n","n1","n2","n3","n4","n5","n6","e","e1","e2","e3","e4","e5","e6","o","o1","o2","o3","o4","o5","o6","a","a1","a2","a3","a4","a5","a6","c","c1","c2","c3","c4","c5","c6","T","ST","PR"]
["<=20",0,0,0,null,0,null,0,0,0,0,0,0,0,0,0,0,0,0,0,0,0,0,0,0,0,0,0,0,0,0,0,0,null,0,0,"<=20",1,"<=0,1"]
[21,23,null,null,0,1,null,null,40,11,{"$nulls":4},2,63,null,8,{"$nulls":4},68,null,9,10,5,5,null,68,10,null,12,0,6,3,21,1,0.2]
[22,null,2,{"$nulls":8},2,{"$nulls":16},12,{"$nulls":7},22,1,0.3]
[23,35,{"$nulls":3},2,0,2,48,12,null,null,4,{"$nulls":8},10,69,4,null,null,7,{"$nulls":4},5,{"$nulls":4},23,1,0.4]
[24,38,null,4,null,4,null,null,49,null,3,{"$nulls":3},5,68,4,9,11,{"$nulls":6},11,null,8,14,71,null,7,null,null,8,null,24,1,0.5]
[25,39,3,null,null,5,null,3,51,13,null,3,{"$nulls":3},69,{"$nulls":3},6,4,null,78,7,10,null,8,null,null,72,11,8,14,8,null,4,25,1,0.6]
[26,42,4,5,2,null,6,null,55,null,4,null,7,2,7,70,null,11,12,null,null,11,82,8,null,13,{"$nulls":10},26,1,0.8]
{"$rows_left_out":56}
{"sheet":"Norm_f","index":8,"n_rows":65,"n_cols":39,"rows_kept":65,"hidden":true}
[null,"NEO-PI-R-Form S Normwerte: Frauen gesamt"]
[]
["T","n","n1","n2","n3","n4","n5","n6","e","e1","e2","e3","e4","e5","e6","o","o1","o2","o3","o4","o5","o6","a","a1","a2","a3","a4","a5","a6","c","c1","c2","c3","c4","c5","c6","T","ST","PR"]
["<=20",0,0,0,0,0,null,0,0,0,0,0,0,null,0,0,0,0,null,null,0,0,0,0,0,null,0,0,0,0,null,0,0,null,null,0,"<=20",1,"<=0,1"]
[21,{"$nulls":35},21,1,0.2]
[22,{"$nulls":5},5,{"$nulls":18},0,{"$nulls":4},0,null,null,0,0,null,22,1,0.3]
[23,29,3,null,null,3,null,null,39,10,{"$nulls":3},0,5,51,null,null,0,null,1,null,49,4,7,null,4,null,null,71,null,4,8,{"$nulls":3},23,1,0.4]
[24,null,null,4,{"$nulls":3},2,null,null,3,2,6,{"$nulls":4},2,{"$nulls":3},10,{"$nulls":13},4,24,1,0.5]
[25,45,4,null,3,6,6,null,49,12,{"$nulls":4},6,67,7,null,null,0,3,null,69,6,{"$nulls":3},5,10,76,null,5,12,8,6,null,25,1,0.6]
[26,46,5,5,null,7,null,3,{"$nulls":4},7,2,{"$nulls":3},4,{"$nulls":3},12,74,null,8,11,5,{"$nulls":3},11,{"$nulls":4},5,26,1,0.8]
{"$rows_left_out":56}
{"sheet":"Norm_m16–20","index":9,"n_rows":65,"n_cols":39,"rows_kept":65,"hidden":true}
[null,"NEO-PI-R-Form S Normwerte: Männer 16–20"]
[]
["T","n","n1","n2","n3","n4","n5","n6","e","e1","e2","e3","e4","e5","e6","o","o1","o2","o3","o4","o5","o6","a","a1","a2","a3","a4","a5","a6","c","c1","c2","c3","c4","c5","c6","T","ST","PR"]
["<=20",0,null,0,0,0,null,null,0,0,0,0,0,0,0,0,null,null,0,null,null,0,0,0,0,0,0,0,null,0,0,0,null,0,null,0,"<=20",1,"<=0,1"]
[21,null,0,{"$nulls":3},0,{"$nulls":9},0,0,null,0,0,{"$nulls":7},0,{"$nulls":3},0,null,0,null,21,1,0.2]
[22,{"$nulls":35},22,1,0.3]
[23,{"$nulls":6},0,50,{"$nulls":3},3,6,5,45,null,null,7,null,null,7,49,null,3,7,{"$nulls":3},49,null,3,{"$nulls":4},23,1,0.4]
[24,40,null,null,1,5,null,null,54,null,3,4,{"$nulls":3},56,null,null,8,{"$nulls":3},50,6,5,8,3,2,8,58,9,{"$nulls":4},4,24,1,0.5]
[25,null,3,{"$nulls":3},7,{"$nulls":5},6,7,7,null,null,1,null,null,6,{"$nulls":10},5,null,4,null,null,25,1,0.6]
[26,42,null,4,2,null,null,1,55,10,null,5,{"$nulls":3},69,6,{"$nulls":4},8,57,null,6,10,4,3,9,59,10,6,9,null,4,5,26,1,0.8]
{"$rows_left_out":56}
{"sheet":"Norm_m21–24","index":10,"n_rows":65,"n_cols":39,"rows_kept":65,"hidden":true}
[null,"NEO-PI-R-Form S Normwerte: Männer 21–24"]
[]
["T","n","n1","n2","n3","n4","n5","n6","e","e1","e2","e3","e4","e5","e6","o","o1","o2","o3","o4","o5","o6","a","a1","a2","a3","a4","a5","a6","c","c1","c2","c3","c4","c5","c6","T","ST","PR"]
["<=20",0,0,0,null,0,0,null,0,0,0,0,0,0,0,0,0,0,0,0,0,0,0,0,0,0,0,0,0,0,0,0,0,0,0,0,"<=20",1,"<=0,1"]
[21,25,{"$nulls":6},45,6,null,2,{"$nulls":3},63,{"$nulls":5},7,{"$nulls":3},7,4,null,4,null,8,4,null,5,null,null,21,1,0.2]
[22,26,2,2,0,3,4,0,48,null,1,{"$nulls":3},2,66,5,null,9,5,6,9,46,null,2,null,null,3,null,54,null,null,6,null,3,null,22,1,0.3]
[23,29,{"$nulls":6},49,{"$nulls":3},5,null,null,67,6,4,{"$nulls":4},48,4,null,8,null,null,5,55,{"$nulls":3},6,null,null,23,1,0.4]
[24,30,{"$nulls":4},5,null,50,8,2,3,null,5,3,68,null,null,10,6,7,10,51,{"$nulls":3},5,null,7,56,9,5,7,null,null,4,24,1,0.5]
[25,33,3,3,{"$nulls":4},53,9,3,{"$nulls":3},6,69,7,5,{"$nulls":4},53,5,5,null,null,4,null,59,null,null,8,null,4,null,25,1,0.6]
[26,35,null,null,1,4,null,null,61,10,null,4,7,null,7,74,{"$nulls":4},8,11,54,null,null,9,6,null,8,61,null,6,null,8,null,null,26,1,0.8]
{"$rows_left_out":56}
{"sheet":"Norm_m25–29","index":11,"n_rows":65,"n_cols":39,"rows_kept":65,"hidden":true}
[null,"NEO-PI-R-Form S Normwerte: Männer 25–29"]
[]
["T","n","n1","n2","n3","n4","n5","n6","e","e1","e2","e3","e4","e5","e6","o","o1","o2","o3","o4","o5","o6","a","a1","a2","a3","a4","a5","a6","c","c1","c2","c3","c4","c5","c6","T","ST","PR"]
["<=20",0,0,0,null,0,0,0,0,0,0,0,0,0,0,0,null,0,0,0,0,0,0,0,0,0,0,0,0,0,0,0,0,0,0,0,"<=20",1,"<=0,1"]
[21,20,null,null,0,null,5,null,38,6,null,null,5,null,2,54,0,null,6,{"$nulls":3},47,1,null,8,null,null,5,39,8,4,6,null,1,null,21,1,0.2]
[22,24,null,2,{"$nulls":4},45,null,1,{"$nulls":4},60,{"$nulls":8},2,9,null,3,null,null,9,{"$nulls":5},22,1,0.3]
[23,25,1,null,null,3,null,1,46,8,{"$nulls":3},3,3,63,{"$nulls":3},1,6,10,56,{"$nulls":3},6,4,8,46,null,5,null,5,null,3,23,1,0.4]
[24,28,{"$nulls":4},6,null,48,null,2,3,6,null,null,68,null,4,9,{"$nulls":3},57,5,5,{"$nulls":3},9,48,10,6,8,{"$nulls":3},24,1,0.5]
[25,{"$nulls":3},1,{"$nulls":3},50,9,{"$nulls":3},5,5,75,7,{"$nulls":3},7,12,58,6,null,10,{"$nulls":3},57,{"$nulls":5},4,25,1,0.6]
[26,32,3,3,null,4,7,2,54,null,3,4,{"$nulls":5},6,null,7,null,null,64,null,6,null,null,5,null,58,11,null,9,7,4,5,26,1,0.8]
{"$rows_left_out":56}
{"sheet":"Norm_m30–49","index":12,"n_rows":65,"n_cols":39,"rows_kept":65,"hidden":true}
[null,"NEO-PI-R-Form S Normwerte: Männer 30–49"]
[]
["T","n","n1","n2","n3","n4","n5","n6","e","e1","e2","e3","e4","e5","e6","o","o1","o2","o3","o4","o5","o6","a","a1","a2","a3","a4","a5","a6","c","c1","c2","c3","c4","c5","c6","T","ST","PR"]
["<=20",0,0,0,null,0,0,null,0,0,0,0,0,null,0,0,0,0,0,0,0,0,0,0,0,0,0,0,0,0,0,0,0,0,0,0,"<=20",1,"<=0,1"]
[21,null,1,{"$nulls":4},0,{"$nulls":11},3,null,null,36,{"$nulls":7},3,{"$nulls":5},21,1,0.2]
[22,23,null,2,null,1,3,null,43,6,1,null,5,0,3,58,null,2,6,null,null,10,null,2,3,null,3,3,9,44,null,null,8,5,3,4,22,1,0.3]
[23,{"$nulls":3},0,{"$nulls":3},44,null,null,2,{"$nulls":3},62,5,3,8,null,4,null,45,{"$nulls":6},46,{"$nulls":5},5,23,1,0.4]
[24,27,2,3,null,2,4,null,46,{"$nulls":3},6,null,null,63,null,4,null,4,null,11,49,3,null,6,4,4,null,50,9,5,9,6,null,null,24,1,0.5]
[25,31,{"$nulls":3},3,null,1,48,8,{"$nulls":3},3,5,67,null,5,9,null,null,12,60,null,6,{"$nulls":3},10,55,null,null,10,null,4,null,25,1,0.6]
[26,34,{"$nulls":6},49,null,2,4,null,null,6,68,6,null,null,5,6,null,61,5,null,10,null,6,null,58,11,6,null,7,5,6,26,1,0.8]
{"$rows_left_out":56}
{"sheet":"Norm_m49+","index":13,"n_rows":65,"n_cols":39,"rows_kept":65,"hidden":true}
[null,"NEO-PI-R-Form S Normwerte: Männer 50+"]
[]
["T","n","n1","n2","n3","n4","n5","n6","e","e1","e2","e3","e4","e5","e6","o","o1","o2","o3","o4","o5","o6","a","a1","a2","a3","a4","a5","a6","c","c1","c2","c3","c4","c5","c6","T","ST","PR"]
["<=20",null,0,null,null,0,0,0,0,null,0,0,0,0,0,0,0,0,0,0,0,0,0,null,0,0,0,0,0,0,0,0,0,0,null,0,"<=20",1,"<=0,1"]
[21,{"$nulls":35},21,1,0.2]
[22,0,null,0,{"$nulls":3},0,null,0,{"$nulls":6},0,null,null,0,{"$nulls":3},0,{"$nulls":10},0,null,22,1,0.3]
[23,null,3,null,1,{"$nulls":3},26,null,1,2,5,null,null,65,0,5,7,4,null,null,57,{"$nulls":4},6,null,67,11,null,11,{"$nulls":3},23,1,0.4]
[24,{"$nulls":5},3,{"$nulls":6},1,6,{"$nulls":10},10,3,null,9,null,null,7,{"$nulls":4},24,1,0.5]
[25,33,{"$nulls":6},39,8,2,3,{"$nulls":3},68,{"$nulls":3},5,8,8,58,7,6,null,null,7,null,68,null,null,13,7,null,null,25,1,0.6]
[26,null,4,4,null,4,null,2,44,null,null,4,7,2,null,71,7,null,9,{"$nulls":3},64,null,null,11,4,null,null,73,12,8,null,null,7,6,26,1,0.8]
{"$rows_left_out":56}
{"sheet":"Norm_m","index":14,"n_rows":65,"n_cols":39,"rows_kept":65,"hidden":true}
[null,"NEO-PI-R-Form S Normwerte: Männer gesamt"]
[]
["T","n","n1","n2","n3","n4","n5","n6","e","e1","e2","e3","e4","e5","e6","o","o1","o2","o3","o4","o5","o6","a","a1","a2","a3","a4","a5","a6","c","c1","c2","c3","c4","c5","c6","T","ST","PR"]
["<=20",0,0,0,null,0,0,0,0,0,0,0,0,null,0,0,0,0,0,null,0,0,0,0,0,null,0,0,0,0,0,0,null,0,0,0,"<=20",1,"<=0,1"]
[21,{"$nulls":35},21,1,0.2]
[22,{"$nulls":12},0,{"$nulls":5},0,{"$nulls":5},0,{"$nulls":10},22,1,0.3]
[23,31,2,null,null,2,null,null,38,null,2,2,5,null,3,null,5,null,9,null,3,null,55,3,6,null,3,2,null,63,null,6,0,5,null,null,23,1,0.4]
[24,{"$nulls":6},1,{"$nulls":13},8,{"$nulls":8},10,{"$nulls":5},24,1,0.5]
[25,34,3,3,0,null,3,null,39,9,null,null,6,2,null,55,2,null,5,{"$nulls":3},57,null,7,10,4,4,10,69,{"$nulls":3},7,6,null,25,1,0.6]
[26,{"$nulls":4},5,null,null,44,null,null,3,null,null,6,{"$nulls":4},6,null,12,60,null,null,11,null,5,null,70,{"$nulls":3},8,null,6,26,1,0.8]
{"$rows_left_out":55}