{"text_format":"1","workbook":"xlsx","n_sheets":7,"sheets":["Budget Summary","Pivot","Budget Details","PivotData","Sorted_Data","KeystoneSalaries","CountryCodes"],"not_rendered":{"charts":0,"images":0,"macros":1,"external_links":0,"defined_names":3,"comments":0,"pivot_tables":1},"unopened":[],"bounds":{"document_bytes":16777216,"sheet_cells":100000,"rows_first":2000,"rows_last":500,"rows_between":2000,"halvings":0,"cell_chars":16384,"cell_head_chars":4096},"cells_cut":0,"cells_raw":0,"read":"whole","date_system":"1900"}

{"sheet":"Budget Summary","index":0,"n_rows":28,"n_cols":37,"rows_kept":28,"cut":false,"hidden":false,"merged":[[26,1,26,3],[27,1,27,3],[28,1,28,3],[32,1,32,2],[5,0,5,1],[13,1,14,2],[12,6,12,7],[11,6,11,7],[7,6,7,7],[6,6,6,7],[8,6,8,7],[9,6,9,7],[26,5,26,6],[27,5,27,6],[0,0,0,8],[10,6,10,7],[5,6,5,7],[1,5,1,7],[16,1,16,3],[17,1,17,3],[18,1,18,3],[19,1,19,3],[20,1,20,3],[22,1,22,3],[23,1,23,3],[24,1,24,3],[4,0,4,1],[6,0,6,1]]}
[{"$f":"C5 & \" - Project\"","v":" - Project"},null,null,null,null,null,null,null,null,null,null,null,null,null,null,null,null,null,null,null,null,null,null,null,null,null,null,null,null,null,null,null,null,null,null,null,"partner 2"]
[null,null,null,null,null,"Version 3.1",null,null,null,null,null,null,null,null,null,null,null,null,null,null,null,null,null,null,null,null,null,null,null,null,null,null,null,null,null,null,false]
[null,null,null,null,null,null,null,null,null,null,null,null,null,null,null,null,null,null,null,null,null,null,null,null,null,null,null,null,null,null,null,null,null,null,null,null,false]
[]
["Project Name:"]
["Primary Funding Partner:",null,null,null,null,"Category 3","Start Date",null,"mm/dd/yyyy"]
["Partners:",null,null,null,null,null,"End Date",null,"mm/dd/yyyy"]
[null,null,null,null,null,null,"Country"]
[]
[null,null,null,null,null,null,"Inflation Rate"]
[null,null,null,null,null,null,"Exchange Rate"]
[null,null,null,null,null,null,"No. of Languages"]
[null,null,null,null,null,null,"Sensitivity"]
[null,"Displayed in USD"]
[]
[]
[null,"Budget Approval Stats"]
[null,"Cash Costs (Category 1 & 2)"]
[null,"In-Kind Costs (Category 1 & 2)"]
[null,"Managing Organization's Supporting Costs (Category 3)"]
[null,"Grand Total - Cash & In-Kind"]
[]
[null,"Total Cash Costs"]
[null,"Other Partner Cash Contributions"]
[null,{"$f":"\"Total Cash Costs - \" & C6","v":"Total Cash Costs - "}]
[]
[null,"Annual Cost per Language - Cash & In-Kind",null,null,null,"Bible Translation %"]
[null,{"$f":"\"Annual Cost per Language - \" & C6","v":"Annual Cost per Language - "},null,null,null,{"$f":"C6& \" BT %\"","v":" BT %"}]

{"sheet":"Pivot","index":1,"n_rows":6,"n_cols":1,"rows_kept":6,"cut":false,"hidden":true,"merged":[]}
[]
[]
[]
[]
["Sum of FY18"]
[8004.2431786666657]

{"sheet":"Budget Details","index":2,"n_rows":107,"n_cols":27,"rows_kept":107,"cut":false,"hidden":false,"merged":[[26,3,26,4],[104,3,104,4],[0,2,2,10],[25,3,25,4],[104,9,104,12],[5,0,5,3],[5,4,5,9],[28,10,28,14],[5,10,5,14],[31,13,31,14],[31,9,31,12],[29,9,29,12],[30,3,30,4],[30,9,30,12],[104,13,104,14],[28,0,28,4],[29,3,29,4],[29,13,29,14],[30,13,30,14],[33,3,33,4],[35,3,35,4],[106,0,106,3],[103,3,103,4],[103,9,103,12],[103,13,103,14],[31,3,31,4]]}
[null,null,{"$f":"'Budget Summary'!C5&\" Budget Details\"&IF(RIGHT(E6,5)<>\"Local\",\" - \" & RIGHT(E6,3), \" - Local Currency\")","v":" Budget Details - USD"},null,null,null,null,null,null,null,null,null,null,null,null,null,null,null,null,null,null,null,null,null,null,24,36]
[null,null,null,null,null,null,null,null,null,null,null,null,null,null,null,null,null,null,null,null,null,null,null,null,null,32]
[null,null,null,null,null,null,null,null,null,null,null,null,null,null,null,null,null,null,null,null,null,null,null,null,null,3]
[]
[]
["Budget Information",null,null,null,"Budget in USD",null,null,null,null,null,"Details"]
["Partner\nAccount\nNo.","Partner Account Name",{"$f":"'Budget Summary'!C6&\" Account Name\"","v":" Account Name"},"Description","(Optional) \nEnter Yearly \nCost","FY17\n12 mo.","FY18\n12 mo.","FY19\n12 mo.","Line\nItem\nTotals",null,"Cost Type","Budget Category","Activity Type","Service Provider","Funding Organization"]
[null,null,null,null,null,null,null,null,{"$f":"SUM($F$8:$H$8)","v":0}]
[null,null,null,null,null,null,null,null,{"$f":"SUM($F$9:$H$9)","v":0}]
[null,null,null,null,null,0,null,null,{"$f":"SUM($F$10:$H$10)","v":0}]
[null,null,null,null,null,0,null,null,{"$f":"SUM($F$11:$H$11)","v":0}]
[null,null,null,null,null,0,null,null,{"$f":"SUM($F$12:$H$12)","v":0}]
[null,null,null,null,null,0,null,null,{"$f":"SUM($F$13:$H$13)","v":0}]
[null,null,null,null,null,null,null,null,{"$f":"SUM($F$14:$H$14)","v":0}]
[null,null,null,null,null,null,null,null,{"$f":"SUM($F$15:$H$15)","v":0}]
[null,null,null,null,null,null,null,null,{"$f":"SUM($F$16:$H$16)","v":0}]
[null,null,null,null,null,null,null,null,{"$f":"SUM($F$17:$H$17)","v":0}]
[null,null,null,null,null,null,null,null,{"$f":"SUM($F$18:$H$18)","v":0}]
[null,null,null,null,null,null,null,null,{"$f":"SUM($F$19:$H$19)","v":0}]
[null,null,null,null,null,null,null,null,{"$f":"SUM($F$20:$H$20)","v":0}]
[null,null,null,null,null,null,null,null,{"$f":"SUM($F$21:$H$21)","v":0}]
[null,null,null,null,null,null,null,null,{"$f":"SUM($F$22:$H$22)","v":0}]
[null,null,null,null,null,null,null,null,{"$f":"SUM($F$23:$H$23)","v":0}]
[null,null,null,null,null,null,null,null,{"$f":"SUM($F$24:$H$24)","v":0}]
[]
[null,null,null,"Filter Sub-Total",null,{"$f":"SUBTOTAL(9,F8:F24)","v":0},{"$f":"SUBTOTAL(9,G8:G24)","v":0},{"$f":"SUBTOTAL(9,H8:H24)","v":0},{"$f":"SUBTOTAL(9,I7:I24)","v":0}]
[null,null,null,"Total Expenses by Year",null,{"$f":"SUM(F8:F24)","v":0},{"$f":"SUM(G8:G24)","v":0},{"$f":"SUM(H8:H24)","v":0},{"$f":"SUM(I7:I24)","v":0}]
[]
["Other Partner Contributions",null,null,null,null,null,null,null,null,null,"Details"]
["Partner\nAccount\nNo.","Partner Account Name",{"$f":"'Budget Summary'!C6&\" Account Name\"","v":" Account Name"},"Description of Contribution",null,"FY17","FY18","FY19","Total","Donating Organization's Name",null,null,null,"Funds Recipient"]
{"$rows_left_out":78}
{"sheet":"PivotData","index":3,"n_rows":8,"n_cols":12,"rows_kept":8,"cut":false,"hidden":true,"merged":[]}
["Partner Account No.","Partner Account Name","Seed Company Account No.","Seed Company Account Name","Description","FY18","Cost Type","Budget Category","Activity Type","Service Provider","Funding Organization","Category"]
[null,null,{"$f":"IF(ISERROR(VLOOKUP(D2,Sorted_Data!I:J,2,FALSE)),0,VLOOKUP(D2,Sorted_Data!I:J,2,FALSE))","v":49999},"Other Partner Contributions",null,-100,"Cash",null,null,null,"org 1"]
[null,null,{"$f":"IF(ISERROR(VLOOKUP(D3,Sorted_Data!I:J,2,FALSE)),0,VLOOKUP(D3,Sorted_Data!I:J,2,FALSE))","v":49999},"Other Partner Contributions",null,-200,"Cash",null,null,null,"org 2"]
[null,null,{"$f":"IF(ISERROR(VLOOKUP(D4,Sorted_Data!I:J,2,FALSE)),0,VLOOKUP(D4,Sorted_Data!I:J,2,FALSE))","v":60091},"Salary/Stipend - Local Consultant"," Sr.Translation Consultant - 16 Weeks in FY18 at 341 USD per week. Half of consultant time is allocated for workshop preparation.",500,"In-Kind","Field Budget","Bible Translation","partner 2","Seed Company","Category 1"]
[null,null,{"$f":"IF(ISERROR(VLOOKUP(D5,Sorted_Data!I:J,2,FALSE)),0,VLOOKUP(D5,Sorted_Data!I:J,2,FALSE))","v":60092},"Salary/Stipend - Non Translator"," - 42 Weeks in FY18 at 167 USD per week.",7020.2495999999983,"Cash","Field Budget","Bible Translation","partner 2","Seed Company","Category 1"]
[null,null,{"$f":"IF(ISERROR(VLOOKUP(D6,Sorted_Data!I:J,2,FALSE)),0,VLOOKUP(D6,Sorted_Data!I:J,2,FALSE))","v":69910},"Financial Services",null,120.36266666666667,"Cash","Field Budget","Bible Translation","partner 2","Seed Company","Category 2"]
[null,null,{"$f":"IF(ISERROR(VLOOKUP(D7,Sorted_Data!I:J,2,FALSE)),0,VLOOKUP(D7,Sorted_Data!I:J,2,FALSE))","v":69910},"Financial Services",null,120.36266666666667,"Cash","Direct Charge to Funder","Bible Translation","partner 2","Seed Company","Category 2"]
[null,"Project Administration Fee",{"$f":"IF(ISERROR(VLOOKUP(D8,Sorted_Data!I:J,2,FALSE)),0,VLOOKUP(D8,Sorted_Data!I:J,2,FALSE))","v":69999},"Project Administration Fee",null,543.26824533333331,"Cash","Field Budget","Bible Translation","partner 1","Seed Company","Category 3"]

{"sheet":"Sorted_Data","index":4,"n_rows":6921,"n_cols":10,"rows_kept":6921,"cut":false,"hidden":true,"merged":[]}
["SC_Single_List","SIL_Single_List","SC_Lookup_SC","SC_Lookup_SIL","SIL_Lookup_SIL","SIL_Lookup_SC","SIL_Account_Name","SIL_Account_Num","SC_Account_Name","SC_Account_Num"]
["Bank Charges","Bank Fees","Salary/Stipend - Translator","Casual Labor","Bank Fees","Bank Charges","Sales - Taxable",40100,"Salary/Stipend - Translator",60090]
["Business Meals & Entertainment","Books & Publications","Salary/Stipend - Translator","Employee Salaries","Books & Publications","Reference Books & Materials","Sales - Taxable",40101,"Salary/Stipend - Local Consultant",60091]
["Computer Purchase","Broadcast Fees","Salary/Stipend - Translator","Labor Expense","Broadcast Fees","Non-Print Media","Sales - Taxable",40102,"Salary/Stipend - Non Translator",60092]
["Computer Software","Casual Labor","Salary/Stipend - Translator","Optional Employee Benefits","Casual Labor","Salary/Stipend - Translator","Sales - Taxable",40103,"Utilities",60500]
["Equipment Maintenance Expense","Communications","Salary/Stipend - Translator","Payroll Taxes - Employer's Portion","Casual Labor","Salary/Stipend - Non Translator","Sales - Taxable",40104,"Telephone-Internet Connectivity",60540]
["Equipment Purchase Expense","Computer and Data Processing Expense","Salary/Stipend - Translator","Required Employee Benefits ","Communications","Telephone-Internet Connectivity","Sales - Taxable",40105,"Trial Publications",60541]
["Financial Services","Donated Services","Salary/Stipend - Local Consultant","LP Consultant Services","Computer and Data Processing Expense","Computer Software","Sales - Taxable",40106,"Legal Fees",60840]
["Fuel Expense - Vehicle","Dues & Subscriptions","Salary/Stipend - Non Translator","Casual Labor","Computer and Data Processing Expense","Computer Purchase","Sales - Taxable",40107,"Bank Charges",65040]
["HR Services","Electricity","Salary/Stipend - Non Translator","Employee Salaries","Contributions From Global Partner Link - Temporarily Restricted","Other Partner Contributions","Sales - Taxable",40108,"Computer Software",65055]
["Insurance Expense","Employee Salaries","Salary/Stipend - Non Translator","Labor Expense","Contributions From JAARS - Temporarily Restricted","Other Partner Contributions","Sales - Taxable",40109,"Equipment Maintenance Expense",65120]
["IT Services","Equipment Expense","Salary/Stipend - Non Translator","Optional Employee Benefits","Contributions From SIL - Temporarily Restricted","Other Partner Contributions","Sales - Taxable",40110,"Equipment Purchase Expense",65130]
["Legal Fees","Equipment Leases","Salary/Stipend - Non Translator","Other Professional Services","Contributions From The Seed Company - Temporarily Restricted","Transfer Received from TSC","Sales - Taxable",40111,"Computer Purchase",65131]
["Maint & Repair Expense","Finance & Project Funding Services","Salary/Stipend - Non Translator","Payroll Taxes - Employer's Portion","Contributions From WOs - Temporarily Restricted","Other Partner Contributions","Sales - Taxable",40112,"Fuel Expense - Vehicle",65171]
["Meeting/Seminar Expense","Fuel","Salary/Stipend - Non Translator","Required Employee Benefits ","Contributions From Wycliffe Assoc US - Temporarily Restricted","Other Partner Contributions","Sales - Taxable",40113,"Insurance Expense",65190]
["Non-Print Media","Gas","Utilities","Electricity","Contributions From Wycliffe Australia - Temporarily Restricted","Other Partner Contributions","Sales - Taxable",40114,"Maint & Repair Expense",65240]
["Office Expense","Grant/Contr To Ext Orgs -Non US","Utilities","Gas","Contributions From Wycliffe Germany - Temporarily Restricted","Other Partner Contributions","Sales - Taxable",40115,"Meeting/Seminar Expense",65270]
["Postage & Freight Expense","Grant/Contr To Ext Orgs-U.S. ","Utilities","Utilities - SIL","Contributions From Wycliffe Netherlands - Temporarily Restricted","Other Partner Contributions","Sales - Taxable",40116,"Reference Books & Materials",65290]
["Printing","Grant/Contr To SIL Entities","Utilities","Water","Contributions From Wycliffe Sweden - Temporarily Restricted","Other Partner Contributions","Sales - Taxable",40117,"Office Expense",65300]
["Program Mgt Support","Grant/Contr To WMOs -US","Telephone-Internet Connectivity","Communications","Contributions From Wycliffe Switzerland - Temporarily Restricted","Other Partner Contributions","Sales - Taxable",40118,"Postage & Freight Expense",65330]
["Project Administration Fee","Grant/Contr To WMOs-Non US","Trial Publications","Printing And Media Production","Contributions-Temporarily Restricted","Other Partner Contributions","Sales - Taxable",40119,"Business Meals & Entertainment",65340]
["Reference Books & Materials","HR Services - SIL","Legal Fees","Legal","Donated Services","Other Partner Contributions","Sales - Nontaxable",40120,"Non-Print Media",65345]
["Rent Expense","Insurance","Bank Charges","Bank Fees","Dues & Subscriptions","Reference Books & Materials","Sales - Nontaxable",40121,"Printing",65350]
["Room/Board - Consultant","Interest","Bank Charges","Interest","Electricity","Utilities","Sales - Nontaxable",40122,"Rent Expense",65410]
["Room/Board - Non Translator","IT Services - SIL","Computer Software","Computer and Data Processing Expense","Employee Salaries","Salary/Stipend - Translator","Sales - Nontaxable",40123,"Taxes, Licenses, Fees",65460]
["Room/Board - Translator","Labor Expense","Computer Software","Software Development","Employee Salaries","Salary/Stipend - Non Translator","Sales - Nontaxable",40124,"Training/Professional Development",65470]
["Salary/Stipend - Local Consultant","Lang Prog Mgmt","Equipment Maintenance Expense","Maintenance And Overhaul/Replacement Reserves","Equipment Expense","Equipment Purchase Expense","Sales - Nontaxable",40125,"Room/Board - Consultant",65480]
["Salary/Stipend - Non Translator","Lang Prog Services & Planning","Equipment Purchase Expense","Equipment Expense","Equipment Expense","Computer Purchase","Sales - Nontaxable",40126,"Room/Board - Translator",65481]
["Salary/Stipend - Translator","Legal","Equipment Purchase Expense","Equipment Leases","Equipment Leases","Equipment Purchase Expense","Sales - Nontaxable",40127,"Room/Board - Non Translator",65482]
["Taxes, Licenses, Fees","LP Consultant Services","Computer Purchase","Computer and Data Processing Expense","Finance & Project Funding Services","Financial Services","Sales - Nontaxable",40128,"Travel - Consultant",65490]
{"$rows_left_out":6892}
{"sheet":"KeystoneSalaries","index":5,"n_rows":127,"n_cols":12,"rows_kept":127,"cut":false,"hidden":true,"merged":[]}
["Index","KeyStone Country","Role","Cost Type","Salary Benchmark","Full Cost of EMP %","Supervisory Load Factor %","Cost of Living Multiplier %","Local Econ Annual Sal","Local FT Factor","Local Salary Weekly Rate","Notes"]
[{"$f":"B2&\"-\"&C2","v":"Brazil-Sr. Translation Consultant"},"Brazil","Sr. Translation Consultant","Direct Project Costs",12808.75,0.23,0.17,1,17932.25,42,426.95833333333331,"FT Capacity is 42 weeks"]
[{"$f":"B3&\"-\"&C3","v":"Brazil-Independent Translation Consultant"},"Brazil","Independent Translation Consultant","Direct Project Costs",10247,0.23,0.17,1,14345.8,42,341.56666666666666,"FT Capacity is 42 weeks"]
["Brazil-Dependent Consultant (CiT)","Brazil","Dependent Consultant (CiT)","Direct Project Costs",5123.5,0.23,0.17,1,7172.9,42,170.78333333333333,"FT Capacity is 42 weeks"]
["Brazil-Facilitator/Trainer/Lead Translator","Brazil","Facilitator/Trainer/Lead Translator","Direct Project Costs",7204.8,0.23,0.17,1,10086.720000000001,42,240.16000000000003,"FT Capacity is 42 weeks"]
["Brazil-Translator","Brazil","Translator","Direct Project Costs",6004,0.23,0.17,1,8405.6,42,200.13333333333335,"FT Capacity is 42 weeks"]
["Brazil-Financial Services","Brazil","Financial Services","Direct Project Admin",5463,0.23,0.17,1,7648.2,30,254.94,"FT Capacity Management is Projects"]
["Brazil-IT Services","Brazil","IT Services","Direct Project Admin",4639,0.23,0.17,1,6494.6,20,324.73,"FT Capacity Management is Languages"]
["Brazil-HR Services","Brazil","HR Services","Direct Project Admin",4754,0.23,0.17,1,6655.6,30,221.85333333333335,"FT Capacity Management is Languages"]
["Brazil-Program Management Support","Brazil","Program Management Support","Direct Project Admin",6993,0.23,0.17,1,9790.1999999999989,25,391.60799999999995,"FT Capacity Management is Languages"]
["Cameroon-Sr. Translation Consultant","Cameroon","Sr. Translation Consultant","Direct Project Costs",9840,0.23,0.17,1,13776,42,328,"FT Capacity is 42 weeks"]
["Cameroon-Independent Translation Consultant","Cameroon","Independent Translation Consultant","Direct Project Costs",7872,0.23,0.17,1,11020.8,42,262.39999999999998,"FT Capacity is 42 weeks"]
["Cameroon-Dependent Consultant (CiT)","Cameroon","Dependent Consultant (CiT)","Direct Project Costs",3936,0.23,0.17,1,5510.4,42,131.19999999999999,"FT Capacity is 42 weeks"]
["Cameroon-Facilitator/Trainer/Lead Translator","Cameroon","Facilitator/Trainer/Lead Translator","Direct Project Costs",4821.5999999999995,0.23,0.17,1,6750.2399999999989,42,160.71999999999997,"FT Capacity is 42 weeks"]
["Cameroon-Translator","Cameroon","Translator","Direct Project Costs",4018,0.23,0.17,1,5625.2000000000007,42,133.93333333333334,"FT Capacity is 42 weeks"]
["Cameroon-Financial Services","Cameroon","Financial Services","Direct Project Admin",2480,0.23,0.17,1,3472,30,115.73333333333333,"FT Capacity Management is Projects"]
["Cameroon-IT Services","Cameroon","IT Services","Direct Project Admin",4018,0.23,0.17,1,5625.2000000000007,20,281.26000000000005,"FT Capacity Management is Languages"]
["Cameroon-HR Services","Cameroon","HR Services","Direct Project Admin",3817,0.23,0.17,1,5343.8,30,178.12666666666667,"FT Capacity Management is Languages"]
["Cameroon-Program Management Support","Cameroon","Program Management Support","Direct Project Admin",9840,0.23,0.17,1,13776,25,551.04,"FT Capacity Management is Languages"]
["China-Sr. Translation Consultant","China","Sr. Translation Consultant","Direct Project Costs",5327.5,0.23,0.17,1,7458.5,42,177.58333333333334,"FT Capacity is 42 weeks"]
["China-Independent Translation Consultant","China","Independent Translation Consultant","Direct Project Costs",4262,0.23,0.17,1,5966.8,42,142.06666666666666,"FT Capacity is 42 weeks"]
["China-Dependent Consultant (CiT)","China","Dependent Consultant (CiT)","Direct Project Costs",2131,0.23,0.17,1,2983.4,42,71.033333333333331,"FT Capacity is 42 weeks"]
["China-Facilitator/Trainer/Lead Translator","China","Facilitator/Trainer/Lead Translator","Direct Project Costs",5732.4,0.23,0.17,1,8025.36,42,191.07999999999998,"FT Capacity is 42 weeks"]
["China-Translator","China","Translator","Direct Project Costs",4777,0.23,0.17,1,6687.8,42,159.23333333333335,"FT Capacity is 42 weeks"]
["China-Financial Services","China","Financial Services","Direct Project Admin",3699,0.23,0.17,1,5178.6000000000004,30,172.62,"FT Capacity Management is Projects"]
["China-IT Services","China","IT Services","Direct Project Admin",2957,0.23,0.17,1,4139.8,20,206.99,"FT Capacity Management is Languages"]
["China-HR Services","China","HR Services","Direct Project Admin",3197,0.23,0.17,1,4475.8,30,149.19333333333333,"FT Capacity Management is Languages"]
["China-Program Management Support","China","Program Management Support","Direct Project Admin",4308,0.23,0.17,1,6031.2,25,241.24799999999999,"FT Capacity Management is Languages"]
["Egypt-Sr. Translation Consultant","Egypt","Sr. Translation Consultant","Direct Project Costs",9137.5,0.23,0.17,1,12792.5,42,304.58333333333331,"FT Capacity is 42 weeks"]
["Egypt-Independent Translation Consultant","Egypt","Independent Translation Consultant","Direct Project Costs",7310,0.23,0.17,1,10234,42,243.66666666666666,"FT Capacity is 42 weeks"]
{"$rows_left_out":98}
{"sheet":"CountryCodes","index":6,"n_rows":172,"n_cols":26,"rows_kept":172,"cut":false,"hidden":true,"merged":[]}
["Country","Region","KeyStone Country","Currency Code","CPI+Rent Index","Index Used",null,null,null,null,null,null,null,null,null,null,null,null,null,null,null,null,null,null,null,"Chad"]
["Afghanistan","Eurasia","Pakistan","AFN",2.77,"CPI+Rent",null,null,null,null,null,null,null,null,null,null,null,null,null,null,null,null,null,null,null,"XAF"]
["Albania","Eurasia","Russia","ALL",0.62,"CPI+Rent"]
["Algeria","Eurasia","Egypt","DZD",0.79,"CPI+Rent"]
["Angola","Africa-Southern","Mozambique","AOA",3.19,"CPI+Rent"]
["Argentina","Americas","Brazil","ARS",1.1599999999999999,"CPI+Rent"]
["Armenia","Eurasia","Russia","AMD",0.73,"CPI+Rent"]
["Australia","Pacific","Papua New Guinea","AUD",0.78,"CPI+Rent"]
["Austria","Eurasia","Germany","EUR",1.07,"CPI+Rent"]
["Azerbaijan","Eurasia","Germany","AZN",0.71,"CPI+Rent"]
["Bahrain","Eurasia","Germany","BHD",0.92,"CPI+Rent"]
["Bangladesh","Asia South","India","BDT",1.36,"CPI+Rent"]
["Belarus","Eurasia","Russia","BYR",0.88,"CPI+Rent"]
["Belgium","Eurasia","Germany","EUR",1.27,"CPI+Rent"]
["Belize","Americas","Mexico","BZD",1.35,"CPI+Rent"]
["Benin","Africa-Francophone","Cameroon","CFA",0.67,"GDP per capita"]
["Bolivia","Americas","Brazil","BOB",0.63,"CPI+Rent"]
["Bosnia And Herzegovina","Eurasia","Pakistan","BAM",1.32,"CPI+Rent"]
["Botswana","Africa-Southern","Mozambique","BWP",0.8,"CPI+Rent"]
["Brazil","Americas","Brazil","BRL",1,"Keystone"]
["Brunei","Asia Islands","Indonesia","BND",1.71,"CPI+Rent"]
["Bulgaria","Eurasia","Russia","BGN",0.67,"CPI+Rent"]
["Burkina Faso","Africa-Francophone","Cameroon","CFA",0.63,"GDP per capita"]
["Cambodia","Asia Mainland","China","KHR",0.93,"CPI+Rent"]
["Cameroon","Africa-Francophone","Cameroon","CFA",1,"Keystone"]
["Canada","Americas","Brazil","CAD",1.3167,"CPI+Rent"]
["Cape Verde","Africa-Southern","Mozambique","CVE",0.72,"CPI+Rent"]
["Central African Republic","Africa-Francophone","Cameroon","XAF",0.28999999999999998,"GDP per capita"]
["Chad","Africa-Francophone","Cameroon","XAF",1.04,"GDP per capita"]
["Chile","Americas","Brazil","CLP",0.95,"CPI+Rent"]
{"$rows_left_out":142}