{"text_format":"1","workbook":"xlsx","n_sheets":5,"sheets":["Dutch","Tables","Tennis","Soccer","Strategy"],"not_rendered":{"charts":0,"images":0,"macros":0,"external_links":0,"defined_names":76,"comments":0,"pivot_tables":0},"unopened":[],"bounds":{"document_bytes":16777216,"sheet_cells":100000,"rows_first":2000,"rows_last":500,"rows_between":2000,"halvings":0,"cell_chars":16384,"cell_head_chars":4096},"cells_cut":0,"cells_raw":0,"read":"whole","date_system":"1900"}

{"sheet":"Dutch","index":0,"n_rows":52,"n_cols":63,"rows_kept":52,"cut":false,"hidden":false,"merged":[]}
["Log","Time","Race","Horse","Prof","Loss","Res","Run","Win odds","Selection","Crse","CourseName","Charity","PA","Class","Listed","Grd1","Grd2","Grd3","Grp1","Grp2","Grp3","Grp 3","Nov","App","Sell","Mdn","Beg","Claim","Hunt","Hcap ","Cond","XC","Stks","Hrd","Chs","NHF","INHF","Date","Race Type","RaceName","Race Error","blank1","Min win Odds","Max win Odds","Course Min","Course Max","Min Runners","Max Runners","Selection",7,8,"blank2","Bet Min","Bet Max","BetRaceMin","BetRaceMax","LayRaceMin","LayRaceMax","Day","Win Stake","Win Prof","Plce Prof"]
["27/05/2016 14:39:39: [G_Auto] :  £ 5.00 Back bet placed on Majoris at 8.6. Fully matched at 8.6.  Ref: 10005","14:52:02","Hayd 27th May - 14:40 6f Nov Stks","Majoris",28,0,null,14,8.6,{"$f":"IF(C2=C1,J1+1,3)","v":3},{"$f":"IF(C2=\"\",\"\",LEFT(C2,5))","v":"Hayd"},{"$f":"IF($K2=\"\",0,VLOOKUP($K2,Course,2))","v":"Haydock"},{"$f":"IF(ISERROR(SEARCH(\"Charity\",$C2)),\"\",\"Charity\")","v":""},{"$f":"IF(ISERROR(SEARCH(\"PA\",$C2)),\"\",\"PA\")","v":""},{"$f":"IF(ISERROR(SEARCH(\"Class\",$C2)),\"\",\"Class\")","v":""},{"$f":"IF(ISERROR(SEARCH(\"Listed\",$C2)),\"\",\"Listed\")","v":""},{"$f":"IF(ISERROR(SEARCH(\"Grd1\",$C2)),\"\",\"Grd1\")","v":""},{"$f":"IF(ISERROR(SEARCH(\"Grd2\",$C2)),\"\",\"Grd2\")","v":""},{"$f":"IF(ISERROR(SEARCH(\"Grd3\",$C2)),\"\",\"Grd3\")","v":""},{"$f":"IF(ISERROR(SEARCH(\"Grp1\",$C2)),\"\",\"Grp1\")","v":""},{"$f":"IF(ISERROR(SEARCH(\"Grp2\",$C2)),\"\",\"Grp2\")","v":""},{"$f":"IF(ISERROR(SEARCH(\"Grp3\",$C2)),\"\",\"Grp3\")","v":""},{"$f":"IF(ISERROR(SEARCH(\"Grp 3\",$C2)),\"\",\"Grp3\")","v":""},{"$f":"IF(ISERROR(SEARCH(\"Nov\",$C2)),\"\",\"Nov\")","v":"Nov"},{"$f":"IF(ISERROR(SEARCH(\"App\",$C2)),\"\",\"App\")","v":""},{"$f":"IF(ISERROR(SEARCH(\"Sell\",$C2)),\"\",\"Sell\")","v":""},{"$f":"IF(ISERROR(SEARCH(\"Mdn\",$C2)),\"\",\"Mdn\")","v":""},{"$f":"IF(ISERROR(SEARCH(\"Beg\",$C2)),\"\",\"Beg\")","v":""},{"$f":"IF(ISERROR(SEARCH(\"Claim\",$C2)),\"\",\"Claim\")","v":""},{"$f":"IF(ISERROR(SEARCH(\"Hunt\",$C2)),\"\",\"Hunt\")","v":""},{"$f":"IF(ISERROR(SEARCH(\"Hcap\",$C2)),\"\",\"Hcap\")","v":""},{"$f":"IF(ISERROR(SEARCH(\"Cond\",$C2)),\"\",\"Cond\")","v":""},{"$f":"IF(ISERROR(SEARCH(\"XC\",$C2)),\"\",\"XC\")","v":""},{"$f":"IF(ISERROR(SEARCH(\"Stks\",$C2)),\"\",\"Stks\")","v":"Stks"},{"$f":"IF(ISERROR(SEARCH(\"Hrd\",$C2)),\"\",\"Hrd\")","v":""},{"$f":"IF(ISERROR(SEARCH(\"Chs\",$C2)),\"\",\"Chs\")","v":""},{"$f":"IF(ISERROR(SEARCH(\" NHF\",$C2)),\"\",\"NHF\")","v":""},{"$f":"IF(ISERROR(SEARCH(\"INHF\",$C2)),\"\",\"INHF\")","v":""},{"$f":"LEFT(A2,10)","v":"27/05/2016"},{"$f":"CONCATENATE(M2,N2,O2,P2,Q2,R2,S2,T2,U2,V2,W2,X2,Y2,Z2,AB2,AA2,AC2,AD2,AE2,AF2,AG2,AH2,AK2,AL2,AI2,AJ2)","v":"NovStks"},{"$f":"IF($AN2=\"\",0,VLOOKUP($AN2,Race,1))","v":"NovStks"},{"$f":"IF($AN2<>$AO2,1,\"\")","v":""},null,{"$f":"IF($I2=\"\",0,IF($I2<Tables!$T$2,0,1))","v":1},{"$f":"IF($I2=\"\",0,IF($I2>Tables!$U$2,0,1))","v":1},{"$f":"IF($I2=\"\",0,IF($H2<VLOOKUP($K2,Course,3),0,1))","v":1},{"$f":"IF($I2=\"\",0,IF($H2>VLOOKUP($K2,Course,4),0,1))","v":0},{"$f":"IF($AN2=\"\",0,IF($H2<VLOOKUP($AN2,Race,2),0,1))","v":1},{"$f":"IF($AN2=\"\",0,IF($H2>VLOOKUP($AN2,Race,3),0,1))","v":1},{"$f":"IF($J2=\"\",0,VLOOKUP($J2,Selection,2))","v":1},{"$f":"IF(E2=0,0,IF(SUM(AR2:AX2)=$AY$1,1,0))","v":0},{"$f":"IF($AY2<>1,0,IF($G2=1,1,0))","v":0},null,{"$f":"IF($K2=\"\",0,VLOOKUP($K2,Course,3))","v":10},{"$f":"IF($K2=\"\",0,VLOOKUP($K2,Course,4))","v":13},{"$f":"IF($AN2=\"\",0,VLOOKUP($AN2,Race,2))","v":1},{"$f":"IF($AN2=\"\",0,VLOOKUP($AN2,Race,3))","v":50},{"$f":"IF($AN2=\"\",0,VLOOKUP($AN2,Race,4))","v":1},{"$f":"IF($AN2=\"\",0,VLOOKUP($AN2,Race,5))","v":50},{"$f":"WEEKDAY(AM2)","v":6},{"$f":"IF($AY2=1,5,\"\")","v":""},{"$f":"IF($AZ2=1,($I2*$BI2),\"\")","v":""},{"$f":"IF($BG2=1,($J2*$BK2),\"\")","v":""}]
["27/05/2016 14:39:39: [G_Auto] :  £ 5.00 Back bet placed on Waqaas at 11. Fully matched at 11.  Ref: 10006","14:52:02","Hayd 27th May - 14:40 6f Nov Stks","Waqaas",40,0,null,14,11,{"$f":"IF(C3=C2,J2+1,3)","v":4},{"$f":"IF(C3=\"\",\"\",LEFT(C3,5))","v":"Hayd"},{"$f":"IF($K3=\"\",0,VLOOKUP($K3,Course,2))","v":"Haydock"},{"$f":"IF(ISERROR(SEARCH(\"Charity\",$C3)),\"\",\"Charity\")","v":""},{"$f":"IF(ISERROR(SEARCH(\"PA\",$C3)),\"\",\"PA\")","v":""},{"$f":"IF(ISERROR(SEARCH(\"Class\",$C3)),\"\",\"Class\")","v":""},{"$f":"IF(ISERROR(SEARCH(\"Listed\",$C3)),\"\",\"Listed\")","v":""},{"$f":"IF(ISERROR(SEARCH(\"Grd1\",$C3)),\"\",\"Grd1\")","v":""},{"$f":"IF(ISERROR(SEARCH(\"Grd2\",$C3)),\"\",\"Grd2\")","v":""},{"$f":"IF(ISERROR(SEARCH(\"Grd3\",$C3)),\"\",\"Grd3\")","v":""},{"$f":"IF(ISERROR(SEARCH(\"Grp1\",$C3)),\"\",\"Grp1\")","v":""},{"$f":"IF(ISERROR(SEARCH(\"Grp2\",$C3)),\"\",\"Grp2\")","v":""},{"$f":"IF(ISERROR(SEARCH(\"Grp3\",$C3)),\"\",\"Grp3\")","v":""},{"$f":"IF(ISERROR(SEARCH(\"Grp 3\",$C3)),\"\",\"Grp3\")","v":""},{"$f":"IF(ISERROR(SEARCH(\"Nov\",$C3)),\"\",\"Nov\")","v":"Nov"},{"$f":"IF(ISERROR(SEARCH(\"App\",$C3)),\"\",\"App\")","v":""},{"$f":"IF(ISERROR(SEARCH(\"Sell\",$C3)),\"\",\"Sell\")","v":""},{"$f":"IF(ISERROR(SEARCH(\"Mdn\",$C3)),\"\",\"Mdn\")","v":""},{"$f":"IF(ISERROR(SEARCH(\"Beg\",$C3)),\"\",\"Beg\")","v":""},{"$f":"IF(ISERROR(SEARCH(\"Claim\",$C3)),\"\",\"Claim\")","v":""},{"$f":"IF(ISERROR(SEARCH(\"Hunt\",$C3)),\"\",\"Hunt\")","v":""},{"$f":"IF(ISERROR(SEARCH(\"Hcap\",$C3)),\"\",\"Hcap\")","v":""},{"$f":"IF(ISERROR(SEARCH(\"Cond\",$C3)),\"\",\"Cond\")","v":""},{"$f":"IF(ISERROR(SEARCH(\"XC\",$C3)),\"\",\"XC\")","v":""},{"$f":"IF(ISERROR(SEARCH(\"Stks\",$C3)),\"\",\"Stks\")","v":"Stks"},{"$f":"IF(ISERROR(SEARCH(\"Hrd\",$C3)),\"\",\"Hrd\")","v":""},{"$f":"IF(ISERROR(SEARCH(\"Chs\",$C3)),\"\",\"Chs\")","v":""},{"$f":"IF(ISERROR(SEARCH(\" NHF\",$C3)),\"\",\"NHF\")","v":""},{"$f":"IF(ISERROR(SEARCH(\"INHF\",$C3)),\"\",\"INHF\")","v":""},{"$f":"LEFT(A3,10)","v":"27/05/2016"},{"$f":"CONCATENATE(M3,N3,O3,P3,Q3,R3,S3,T3,U3,V3,W3,X3,Y3,Z3,AB3,AA3,AC3,AD3,AE3,AF3,AG3,AH3,AK3,AL3,AI3,AJ3)","v":"NovStks"},{"$f":"IF($AN3=\"\",0,VLOOKUP($AN3,Race,1))","v":"NovStks"},{"$f":"IF($AN3<>$AO3,1,\"\")","v":""},null,{"$f":"IF($I3=\"\",0,IF($I3<Tables!$T$2,0,1))","v":1},{"$f":"IF($I3=\"\",0,IF($I3>Tables!$U$2,0,1))","v":1},{"$f":"IF($I3=\"\",0,IF($H3<VLOOKUP($K3,Course,3),0,1))","v":1},{"$f":"IF($I3=\"\",0,IF($H3>VLOOKUP($K3,Course,4),0,1))","v":0},{"$f":"IF($AN3=\"\",0,IF($H3<VLOOKUP($AN3,Race,2),0,1))","v":1},{"$f":"IF($AN3=\"\",0,IF($H3>VLOOKUP($AN3,Race,3),0,1))","v":1},{"$f":"IF($J3=\"\",0,VLOOKUP($J3,Selection,2))","v":1},{"$f":"IF(E3=0,0,IF(SUM(AR3:AX3)=$AY$1,1,0))","v":0},{"$f":"IF($AY3<>1,0,IF($G3=1,1,0))","v":0},null,{"$f":"IF($K3=\"\",0,VLOOKUP($K3,Course,3))","v":10},{"$f":"IF($K3=\"\",0,VLOOKUP($K3,Course,4))","v":13},{"$f":"IF($AN3=\"\",0,VLOOKUP($AN3,Race,2))","v":1},{"$f":"IF($AN3=\"\",0,VLOOKUP($AN3,Race,3))","v":50},{"$f":"IF($AN3=\"\",0,VLOOKUP($AN3,Race,4))","v":1},{"$f":"IF($AN3=\"\",0,VLOOKUP($AN3,Race,5))","v":50},{"$f":"WEEKDAY(AM3)","v":6},{"$f":"IF($AY3=1,5,\"\")","v":""},{"$f":"IF($AZ3=1,($I3*$BI3),\"\")","v":""},{"$f":"IF($BG3=1,($J3*$BK3),\"\")","v":""}]
["27/05/2016 14:39:39: [G_Auto] :  £ 5.00 Back bet placed on Our Boy at 11.5. Fully matched at 11.5.  Ref: 10007","14:52:02","Hayd 27th May - 14:40 6f Nov Stks","Our Boy",42.5,0,null,14,11.5,{"$f":"IF(C4=C3,J3+1,3)","v":5},{"$f":"IF(C4=\"\",\"\",LEFT(C4,5))","v":"Hayd"},{"$f":"IF($K4=\"\",0,VLOOKUP($K4,Course,2))","v":"Haydock"},{"$f":"IF(ISERROR(SEARCH(\"Charity\",$C4)),\"\",\"Charity\")","v":""},{"$f":"IF(ISERROR(SEARCH(\"PA\",$C4)),\"\",\"PA\")","v":""},{"$f":"IF(ISERROR(SEARCH(\"Class\",$C4)),\"\",\"Class\")","v":""},{"$f":"IF(ISERROR(SEARCH(\"Listed\",$C4)),\"\",\"Listed\")","v":""},{"$f":"IF(ISERROR(SEARCH(\"Grd1\",$C4)),\"\",\"Grd1\")","v":""},{"$f":"IF(ISERROR(SEARCH(\"Grd2\",$C4)),\"\",\"Grd2\")","v":""},{"$f":"IF(ISERROR(SEARCH(\"Grd3\",$C4)),\"\",\"Grd3\")","v":""},{"$f":"IF(ISERROR(SEARCH(\"Grp1\",$C4)),\"\",\"Grp1\")","v":""},{"$f":"IF(ISERROR(SEARCH(\"Grp2\",$C4)),\"\",\"Grp2\")","v":""},{"$f":"IF(ISERROR(SEARCH(\"Grp3\",$C4)),\"\",\"Grp3\")","v":""},{"$f":"IF(ISERROR(SEARCH(\"Grp 3\",$C4)),\"\",\"Grp3\")","v":""},{"$f":"IF(ISERROR(SEARCH(\"Nov\",$C4)),\"\",\"Nov\")","v":"Nov"},{"$f":"IF(ISERROR(SEARCH(\"App\",$C4)),\"\",\"App\")","v":""},{"$f":"IF(ISERROR(SEARCH(\"Sell\",$C4)),\"\",\"Sell\")","v":""},{"$f":"IF(ISERROR(SEARCH(\"Mdn\",$C4)),\"\",\"Mdn\")","v":""},{"$f":"IF(ISERROR(SEARCH(\"Beg\",$C4)),\"\",\"Beg\")","v":""},{"$f":"IF(ISERROR(SEARCH(\"Claim\",$C4)),\"\",\"Claim\")","v":""},{"$f":"IF(ISERROR(SEARCH(\"Hunt\",$C4)),\"\",\"Hunt\")","v":""},{"$f":"IF(ISERROR(SEARCH(\"Hcap\",$C4)),\"\",\"Hcap\")","v":""},{"$f":"IF(ISERROR(SEARCH(\"Cond\",$C4)),\"\",\"Cond\")","v":""},{"$f":"IF(ISERROR(SEARCH(\"XC\",$C4)),\"\",\"XC\")","v":""},{"$f":"IF(ISERROR(SEARCH(\"Stks\",$C4)),\"\",\"Stks\")","v":"Stks"},{"$f":"IF(ISERROR(SEARCH(\"Hrd\",$C4)),\"\",\"Hrd\")","v":""},{"$f":"IF(ISERROR(SEARCH(\"Chs\",$C4)),\"\",\"Chs\")","v":""},{"$f":"IF(ISERROR(SEARCH(\" NHF\",$C4)),\"\",\"NHF\")","v":""},{"$f":"IF(ISERROR(SEARCH(\"INHF\",$C4)),\"\",\"INHF\")","v":""},{"$f":"LEFT(A4,10)","v":"27/05/2016"},{"$f":"CONCATENATE(M4,N4,O4,P4,Q4,R4,S4,T4,U4,V4,W4,X4,Y4,Z4,AB4,AA4,AC4,AD4,AE4,AF4,AG4,AH4,AK4,AL4,AI4,AJ4)","v":"NovStks"},{"$f":"IF($AN4=\"\",0,VLOOKUP($AN4,Race,1))","v":"NovStks"},{"$f":"IF($AN4<>$AO4,1,\"\")","v":""},null,{"$f":"IF($I4=\"\",0,IF($I4<Tables!$T$2,0,1))","v":1},{"$f":"IF($I4=\"\",0,IF($I4>Tables!$U$2,0,1))","v":1},{"$f":"IF($I4=\"\",0,IF($H4<VLOOKUP($K4,Course,3),0,1))","v":1},{"$f":"IF($I4=\"\",0,IF($H4>VLOOKUP($K4,Course,4),0,1))","v":0},{"$f":"IF($AN4=\"\",0,IF($H4<VLOOKUP($AN4,Race,2),0,1))","v":1},{"$f":"IF($AN4=\"\",0,IF($H4>VLOOKUP($AN4,Race,3),0,1))","v":1},{"$f":"IF($J4=\"\",0,VLOOKUP($J4,Selection,2))","v":1},{"$f":"IF(E4=0,0,IF(SUM(AR4:AX4)=$AY$1,1,0))","v":0},{"$f":"IF($AY4<>1,0,IF($G4=1,1,0))","v":0},null,{"$f":"IF($K4=\"\",0,VLOOKUP($K4,Course,3))","v":10},{"$f":"IF($K4=\"\",0,VLOOKUP($K4,Course,4))","v":13},{"$f":"IF($AN4=\"\",0,VLOOKUP($AN4,Race,2))","v":1},{"$f":"IF($AN4=\"\",0,VLOOKUP($AN4,Race,3))","v":50},{"$f":"IF($AN4=\"\",0,VLOOKUP($AN4,Race,4))","v":1},{"$f":"IF($AN4=\"\",0,VLOOKUP($AN4,Race,5))","v":50},{"$f":"WEEKDAY(AM4)","v":6},{"$f":"IF($AY4=1,5,\"\")","v":""},{"$f":"IF($AZ4=1,($I4*$BI4),\"\")","v":""},{"$f":"IF($BG4=1,($J4*$BK4),\"\")","v":""}]
["27/05/2016 14:49:56: [G_Auto] :  £ 5.00 Back bet placed on Al Sailiyah at 5.6. Fully matched at 5.6.  Ref: 10008","14:55:17","Brig 27th May - 14:50 6f Hcap","Al Sailiyah",23,0,null,7,5.6,{"$f":"IF(C5=C4,J4+1,3)","v":3},{"$f":"IF(C5=\"\",\"\",LEFT(C5,5))","v":"Brig"},{"$f":"IF($K5=\"\",0,VLOOKUP($K5,Course,2))","v":"Brighton"},{"$f":"IF(ISERROR(SEARCH(\"Charity\",$C5)),\"\",\"Charity\")","v":""},{"$f":"IF(ISERROR(SEARCH(\"PA\",$C5)),\"\",\"PA\")","v":""},{"$f":"IF(ISERROR(SEARCH(\"Class\",$C5)),\"\",\"Class\")","v":""},{"$f":"IF(ISERROR(SEARCH(\"Listed\",$C5)),\"\",\"Listed\")","v":""},{"$f":"IF(ISERROR(SEARCH(\"Grd1\",$C5)),\"\",\"Grd1\")","v":""},{"$f":"IF(ISERROR(SEARCH(\"Grd2\",$C5)),\"\",\"Grd2\")","v":""},{"$f":"IF(ISERROR(SEARCH(\"Grd3\",$C5)),\"\",\"Grd3\")","v":""},{"$f":"IF(ISERROR(SEARCH(\"Grp1\",$C5)),\"\",\"Grp1\")","v":""},{"$f":"IF(ISERROR(SEARCH(\"Grp2\",$C5)),\"\",\"Grp2\")","v":""},{"$f":"IF(ISERROR(SEARCH(\"Grp3\",$C5)),\"\",\"Grp3\")","v":""},{"$f":"IF(ISERROR(SEARCH(\"Grp 3\",$C5)),\"\",\"Grp3\")","v":""},{"$f":"IF(ISERROR(SEARCH(\"Nov\",$C5)),\"\",\"Nov\")","v":""},{"$f":"IF(ISERROR(SEARCH(\"App\",$C5)),\"\",\"App\")","v":""},{"$f":"IF(ISERROR(SEARCH(\"Sell\",$C5)),\"\",\"Sell\")","v":""},{"$f":"IF(ISERROR(SEARCH(\"Mdn\",$C5)),\"\",\"Mdn\")","v":""},{"$f":"IF(ISERROR(SEARCH(\"Beg\",$C5)),\"\",\"Beg\")","v":""},{"$f":"IF(ISERROR(SEARCH(\"Claim\",$C5)),\"\",\"Claim\")","v":""},{"$f":"IF(ISERROR(SEARCH(\"Hunt\",$C5)),\"\",\"Hunt\")","v":""},{"$f":"IF(ISERROR(SEARCH(\"Hcap\",$C5)),\"\",\"Hcap\")","v":"Hcap"},{"$f":"IF(ISERROR(SEARCH(\"Cond\",$C5)),\"\",\"Cond\")","v":""},{"$f":"IF(ISERROR(SEARCH(\"XC\",$C5)),\"\",\"XC\")","v":""},{"$f":"IF(ISERROR(SEARCH(\"Stks\",$C5)),\"\",\"Stks\")","v":""},{"$f":"IF(ISERROR(SEARCH(\"Hrd\",$C5)),\"\",\"Hrd\")","v":""},{"$f":"IF(ISERROR(SEARCH(\"Chs\",$C5)),\"\",\"Chs\")","v":""},{"$f":"IF(ISERROR(SEARCH(\" NHF\",$C5)),\"\",\"NHF\")","v":""},{"$f":"IF(ISERROR(SEARCH(\"INHF\",$C5)),\"\",\"INHF\")","v":""},{"$f":"LEFT(A5,10)","v":"27/05/2016"},{"$f":"CONCATENATE(M5,N5,O5,P5,Q5,R5,S5,T5,U5,V5,W5,X5,Y5,Z5,AB5,AA5,AC5,AD5,AE5,AF5,AG5,AH5,AK5,AL5,AI5,AJ5)","v":"Hcap"},{"$f":"IF($AN5=\"\",0,VLOOKUP($AN5,Race,1))","v":"Hcap"},{"$f":"IF($AN5<>$AO5,1,\"\")","v":""},null,{"$f":"IF($I5=\"\",0,IF($I5<Tables!$T$2,0,1))","v":1},{"$f":"IF($I5=\"\",0,IF($I5>Tables!$U$2,0,1))","v":1},{"$f":"IF($I5=\"\",0,IF($H5<VLOOKUP($K5,Course,3),0,1))","v":0},{"$f":"IF($I5=\"\",0,IF($H5>VLOOKUP($K5,Course,4),0,1))","v":1},{"$f":"IF($AN5=\"\",0,IF($H5<VLOOKUP($AN5,Race,2),0,1))","v":1},{"$f":"IF($AN5=\"\",0,IF($H5>VLOOKUP($AN5,Race,3),0,1))","v":1},{"$f":"IF($J5=\"\",0,VLOOKUP($J5,Selection,2))","v":1},{"$f":"IF(E5=0,0,IF(SUM(AR5:AX5)=$AY$1,1,0))","v":0},{"$f":"IF($AY5<>1,0,IF($G5=1,1,0))","v":0},null,{"$f":"IF($K5=\"\",0,VLOOKUP($K5,Course,3))","v":99},{"$f":"IF($K5=\"\",0,VLOOKUP($K5,Course,4))","v":99},{"$f":"IF($AN5=\"\",0,VLOOKUP($AN5,Race,2))","v":1},{"$f":"IF($AN5=\"\",0,VLOOKUP($AN5,Race,3))","v":50},{"$f":"IF($AN5=\"\",0,VLOOKUP($AN5,Race,4))","v":1},{"$f":"IF($AN5=\"\",0,VLOOKUP($AN5,Race,5))","v":50},{"$f":"WEEKDAY(AM5)","v":6},{"$f":"IF($AY5=1,5,\"\")","v":""},{"$f":"IF($AZ5=1,($I5*$BI5),\"\")","v":""},{"$f":"IF($BG5=1,($J5*$BK5),\"\")","v":""}]
["27/05/2016 15:49:56: [G_Auto] :  £ 5.00 Back bet placed on Dr Drey at 6.2. Fully matched at 6.2.  Ref: 10012","15:55:22","Brig 27th May - 15:50 1m4f Hcap","Dr Drey",26,0,null,5,6.2,{"$f":"IF(C6=C5,J5+1,3)","v":3},{"$f":"IF(C6=\"\",\"\",LEFT(C6,5))","v":"Brig"},{"$f":"IF($K6=\"\",0,VLOOKUP($K6,Course,2))","v":"Brighton"},{"$f":"IF(ISERROR(SEARCH(\"Charity\",$C6)),\"\",\"Charity\")","v":""},{"$f":"IF(ISERROR(SEARCH(\"PA\",$C6)),\"\",\"PA\")","v":""},{"$f":"IF(ISERROR(SEARCH(\"Class\",$C6)),\"\",\"Class\")","v":""},{"$f":"IF(ISERROR(SEARCH(\"Listed\",$C6)),\"\",\"Listed\")","v":""},{"$f":"IF(ISERROR(SEARCH(\"Grd1\",$C6)),\"\",\"Grd1\")","v":""},{"$f":"IF(ISERROR(SEARCH(\"Grd2\",$C6)),\"\",\"Grd2\")","v":""},{"$f":"IF(ISERROR(SEARCH(\"Grd3\",$C6)),\"\",\"Grd3\")","v":""},{"$f":"IF(ISERROR(SEARCH(\"Grp1\",$C6)),\"\",\"Grp1\")","v":""},{"$f":"IF(ISERROR(SEARCH(\"Grp2\",$C6)),\"\",\"Grp2\")","v":""},{"$f":"IF(ISERROR(SEARCH(\"Grp3\",$C6)),\"\",\"Grp3\")","v":""},{"$f":"IF(ISERROR(SEARCH(\"Grp 3\",$C6)),\"\",\"Grp3\")","v":""},{"$f":"IF(ISERROR(SEARCH(\"Nov\",$C6)),\"\",\"Nov\")","v":""},{"$f":"IF(ISERROR(SEARCH(\"App\",$C6)),\"\",\"App\")","v":""},{"$f":"IF(ISERROR(SEARCH(\"Sell\",$C6)),\"\",\"Sell\")","v":""},{"$f":"IF(ISERROR(SEARCH(\"Mdn\",$C6)),\"\",\"Mdn\")","v":""},{"$f":"IF(ISERROR(SEARCH(\"Beg\",$C6)),\"\",\"Beg\")","v":""},{"$f":"IF(ISERROR(SEARCH(\"Claim\",$C6)),\"\",\"Claim\")","v":""},{"$f":"IF(ISERROR(SEARCH(\"Hunt\",$C6)),\"\",\"Hunt\")","v":""},{"$f":"IF(ISERROR(SEARCH(\"Hcap\",$C6)),\"\",\"Hcap\")","v":"Hcap"},{"$f":"IF(ISERROR(SEARCH(\"Cond\",$C6)),\"\",\"Cond\")","v":""},{"$f":"IF(ISERROR(SEARCH(\"XC\",$C6)),\"\",\"XC\")","v":""},{"$f":"IF(ISERROR(SEARCH(\"Stks\",$C6)),\"\",\"Stks\")","v":""},{"$f":"IF(ISERROR(SEARCH(\"Hrd\",$C6)),\"\",\"Hrd\")","v":""},{"$f":"IF(ISERROR(SEARCH(\"Chs\",$C6)),\"\",\"Chs\")","v":""},{"$f":"IF(ISERROR(SEARCH(\" NHF\",$C6)),\"\",\"NHF\")","v":""},{"$f":"IF(ISERROR(SEARCH(\"INHF\",$C6)),\"\",\"INHF\")","v":""},{"$f":"LEFT(A6,10)","v":"27/05/2016"},{"$f":"CONCATENATE(M6,N6,O6,P6,Q6,R6,S6,T6,U6,V6,W6,X6,Y6,Z6,AB6,AA6,AC6,AD6,AE6,AF6,AG6,AH6,AK6,AL6,AI6,AJ6)","v":"Hcap"},{"$f":"IF($AN6=\"\",0,VLOOKUP($AN6,Race,1))","v":"Hcap"},{"$f":"IF($AN6<>$AO6,1,\"\")","v":""},null,{"$f":"IF($I6=\"\",0,IF($I6<Tables!$T$2,0,1))","v":1},{"$f":"IF($I6=\"\",0,IF($I6>Tables!$U$2,0,1))","v":1},{"$f":"IF($I6=\"\",0,IF($H6<VLOOKUP($K6,Course,3),0,1))","v":0},{"$f":"IF($I6=\"\",0,IF($H6>VLOOKUP($K6,Course,4),0,1))","v":1},{"$f":"IF($AN6=\"\",0,IF($H6<VLOOKUP($AN6,Race,2),0,1))","v":1},{"$f":"IF($AN6=\"\",0,IF($H6>VLOOKUP($AN6,Race,3),0,1))","v":1},{"$f":"IF($J6=\"\",0,VLOOKUP($J6,Selection,2))","v":1},{"$f":"IF(E6=0,0,IF(SUM(AR6:AX6)=$AY$1,1,0))","v":0},{"$f":"IF($AY6<>1,0,IF($G6=1,1,0))","v":0},null,{"$f":"IF($K6=\"\",0,VLOOKUP($K6,Course,3))","v":99},{"$f":"IF($K6=\"\",0,VLOOKUP($K6,Course,4))","v":99},{"$f":"IF($AN6=\"\",0,VLOOKUP($AN6,Race,2))","v":1},{"$f":"IF($AN6=\"\",0,VLOOKUP($AN6,Race,3))","v":50},{"$f":"IF($AN6=\"\",0,VLOOKUP($AN6,Race,4))","v":1},{"$f":"IF($AN6=\"\",0,VLOOKUP($AN6,Race,5))","v":50},{"$f":"WEEKDAY(AM6)","v":6},{"$f":"IF($AY6=1,5,\"\")","v":""},{"$f":"IF($AZ6=1,($I6*$BI6),\"\")","v":""},{"$f":"IF($BG6=1,($J6*$BK6),\"\")","v":""}]
["27/05/2016 16:19:58: [G_Auto] :  £ 5.00 Back bet placed on Pink Ribbon at 9.4. Fully matched at 9.4.  Ref: 10016","16:24:59","Brig 27th May - 16:20 1m2f Hcap","Pink Ribbon",42,0,null,9,9.4,{"$f":"IF(C7=C6,J6+1,3)","v":3},{"$f":"IF(C7=\"\",\"\",LEFT(C7,5))","v":"Brig"},{"$f":"IF($K7=\"\",0,VLOOKUP($K7,Course,2))","v":"Brighton"},{"$f":"IF(ISERROR(SEARCH(\"Charity\",$C7)),\"\",\"Charity\")","v":""},{"$f":"IF(ISERROR(SEARCH(\"PA\",$C7)),\"\",\"PA\")","v":""},{"$f":"IF(ISERROR(SEARCH(\"Class\",$C7)),\"\",\"Class\")","v":""},{"$f":"IF(ISERROR(SEARCH(\"Listed\",$C7)),\"\",\"Listed\")","v":""},{"$f":"IF(ISERROR(SEARCH(\"Grd1\",$C7)),\"\",\"Grd1\")","v":""},{"$f":"IF(ISERROR(SEARCH(\"Grd2\",$C7)),\"\",\"Grd2\")","v":""},{"$f":"IF(ISERROR(SEARCH(\"Grd3\",$C7)),\"\",\"Grd3\")","v":""},{"$f":"IF(ISERROR(SEARCH(\"Grp1\",$C7)),\"\",\"Grp1\")","v":""},{"$f":"IF(ISERROR(SEARCH(\"Grp2\",$C7)),\"\",\"Grp2\")","v":""},{"$f":"IF(ISERROR(SEARCH(\"Grp3\",$C7)),\"\",\"Grp3\")","v":""},{"$f":"IF(ISERROR(SEARCH(\"Grp 3\",$C7)),\"\",\"Grp3\")","v":""},{"$f":"IF(ISERROR(SEARCH(\"Nov\",$C7)),\"\",\"Nov\")","v":""},{"$f":"IF(ISERROR(SEARCH(\"App\",$C7)),\"\",\"App\")","v":""},{"$f":"IF(ISERROR(SEARCH(\"Sell\",$C7)),\"\",\"Sell\")","v":""},{"$f":"IF(ISERROR(SEARCH(\"Mdn\",$C7)),\"\",\"Mdn\")","v":""},{"$f":"IF(ISERROR(SEARCH(\"Beg\",$C7)),\"\",\"Beg\")","v":""},{"$f":"IF(ISERROR(SEARCH(\"Claim\",$C7)),\"\",\"Claim\")","v":""},{"$f":"IF(ISERROR(SEARCH(\"Hunt\",$C7)),\"\",\"Hunt\")","v":""},{"$f":"IF(ISERROR(SEARCH(\"Hcap\",$C7)),\"\",\"Hcap\")","v":"Hcap"},{"$f":"IF(ISERROR(SEARCH(\"Cond\",$C7)),\"\",\"Cond\")","v":""},{"$f":"IF(ISERROR(SEARCH(\"XC\",$C7)),\"\",\"XC\")","v":""},{"$f":"IF(ISERROR(SEARCH(\"Stks\",$C7)),\"\",\"Stks\")","v":""},{"$f":"IF(ISERROR(SEARCH(\"Hrd\",$C7)),\"\",\"Hrd\")","v":""},{"$f":"IF(ISERROR(SEARCH(\"Chs\",$C7)),\"\",\"Chs\")","v":""},{"$f":"IF(ISERROR(SEARCH(\" NHF\",$C7)),\"\",\"NHF\")","v":""},{"$f":"IF(ISERROR(SEARCH(\"INHF\",$C7)),\"\",\"INHF\")","v":""},{"$f":"LEFT(A7,10)","v":"27/05/2016"},{"$f":"CONCATENATE(M7,N7,O7,P7,Q7,R7,S7,T7,U7,V7,W7,X7,Y7,Z7,AB7,AA7,AC7,AD7,AE7,AF7,AG7,AH7,AK7,AL7,AI7,AJ7)","v":"Hcap"},{"$f":"IF($AN7=\"\",0,VLOOKUP($AN7,Race,1))","v":"Hcap"},{"$f":"IF($AN7<>$AO7,1,\"\")","v":""},null,{"$f":"IF($I7=\"\",0,IF($I7<Tables!$T$2,0,1))","v":1},{"$f":"IF($I7=\"\",0,IF($I7>Tables!$U$2,0,1))","v":1},{"$f":"IF($I7=\"\",0,IF($H7<VLOOKUP($K7,Course,3),0,1))","v":0},{"$f":"IF($I7=\"\",0,IF($H7>VLOOKUP($K7,Course,4),0,1))","v":1},{"$f":"IF($AN7=\"\",0,IF($H7<VLOOKUP($AN7,Race,2),0,1))","v":1},{"$f":"IF($AN7=\"\",0,IF($H7>VLOOKUP($AN7,Race,3),0,1))","v":1},{"$f":"IF($J7=\"\",0,VLOOKUP($J7,Selection,2))","v":1},{"$f":"IF(E7=0,0,IF(SUM(AR7:AX7)=$AY$1,1,0))","v":0},{"$f":"IF($AY7<>1,0,IF($G7=1,1,0))","v":0},null,{"$f":"IF($K7=\"\",0,VLOOKUP($K7,Course,3))","v":99},{"$f":"IF($K7=\"\",0,VLOOKUP($K7,Course,4))","v":99},{"$f":"IF($AN7=\"\",0,VLOOKUP($AN7,Race,2))","v":1},{"$f":"IF($AN7=\"\",0,VLOOKUP($AN7,Race,3))","v":50},{"$f":"IF($AN7=\"\",0,VLOOKUP($AN7,Race,4))","v":1},{"$f":"IF($AN7=\"\",0,VLOOKUP($AN7,Race,5))","v":50},{"$f":"WEEKDAY(AM7)","v":6},{"$f":"IF($AY7=1,5,\"\")","v":""},{"$f":"IF($AZ7=1,($I7*$BI7),\"\")","v":""},{"$f":"IF($BG7=1,($J7*$BK7),\"\")","v":""}]
["27/05/2016 16:29:55: [G_Auto] :  £ 5.00 Back bet placed on Cliffs of Dover at 5.8. Fully matched at 5.8.  Ref: 10017","16:39:10","Bath 27th May - 16:30 1m2f Class Stks","Cliffs of Dover",24,0,null,6,5.8,{"$f":"IF(C8=C7,J7+1,3)","v":3},{"$f":"IF(C8=\"\",\"\",LEFT(C8,5))","v":"Bath"},{"$f":"IF($K8=\"\",0,VLOOKUP($K8,Course,2))","v":"Bath"},{"$f":"IF(ISERROR(SEARCH(\"Charity\",$C8)),\"\",\"Charity\")","v":""},{"$f":"IF(ISERROR(SEARCH(\"PA\",$C8)),\"\",\"PA\")","v":""},{"$f":"IF(ISERROR(SEARCH(\"Class\",$C8)),\"\",\"Class\")","v":"Class"},{"$f":"IF(ISERROR(SEARCH(\"Listed\",$C8)),\"\",\"Listed\")","v":""},{"$f":"IF(ISERROR(SEARCH(\"Grd1\",$C8)),\"\",\"Grd1\")","v":""},{"$f":"IF(ISERROR(SEARCH(\"Grd2\",$C8)),\"\",\"Grd2\")","v":""},{"$f":"IF(ISERROR(SEARCH(\"Grd3\",$C8)),\"\",\"Grd3\")","v":""},{"$f":"IF(ISERROR(SEARCH(\"Grp1\",$C8)),\"\",\"Grp1\")","v":""},{"$f":"IF(ISERROR(SEARCH(\"Grp2\",$C8)),\"\",\"Grp2\")","v":""},{"$f":"IF(ISERROR(SEARCH(\"Grp3\",$C8)),\"\",\"Grp3\")","v":""},{"$f":"IF(ISERROR(SEARCH(\"Grp 3\",$C8)),\"\",\"Grp3\")","v":""},{"$f":"IF(ISERROR(SEARCH(\"Nov\",$C8)),\"\",\"Nov\")","v":""},{"$f":"IF(ISERROR(SEARCH(\"App\",$C8)),\"\",\"App\")","v":""},{"$f":"IF(ISERROR(SEARCH(\"Sell\",$C8)),\"\",\"Sell\")","v":""},{"$f":"IF(ISERROR(SEARCH(\"Mdn\",$C8)),\"\",\"Mdn\")","v":""},{"$f":"IF(ISERROR(SEARCH(\"Beg\",$C8)),\"\",\"Beg\")","v":""},{"$f":"IF(ISERROR(SEARCH(\"Claim\",$C8)),\"\",\"Claim\")","v":""},{"$f":"IF(ISERROR(SEARCH(\"Hunt\",$C8)),\"\",\"Hunt\")","v":""},{"$f":"IF(ISERROR(SEARCH(\"Hcap\",$C8)),\"\",\"Hcap\")","v":""},{"$f":"IF(ISERROR(SEARCH(\"Cond\",$C8)),\"\",\"Cond\")","v":""},{"$f":"IF(ISERROR(SEARCH(\"XC\",$C8)),\"\",\"XC\")","v":""},{"$f":"IF(ISERROR(SEARCH(\"Stks\",$C8)),\"\",\"Stks\")","v":"Stks"},{"$f":"IF(ISERROR(SEARCH(\"Hrd\",$C8)),\"\",\"Hrd\")","v":""},{"$f":"IF(ISERROR(SEARCH(\"Chs\",$C8)),\"\",\"Chs\")","v":""},{"$f":"IF(ISERROR(SEARCH(\" NHF\",$C8)),\"\",\"NHF\")","v":""},{"$f":"IF(ISERROR(SEARCH(\"INHF\",$C8)),\"\",\"INHF\")","v":""},{"$f":"LEFT(A8,10)","v":"27/05/2016"},{"$f":"CONCATENATE(M8,N8,O8,P8,Q8,R8,S8,T8,U8,V8,W8,X8,Y8,Z8,AB8,AA8,AC8,AD8,AE8,AF8,AG8,AH8,AK8,AL8,AI8,AJ8)","v":"ClassStks"},{"$f":"IF($AN8=\"\",0,VLOOKUP($AN8,Race,1))","v":"ClassStks"},{"$f":"IF($AN8<>$AO8,1,\"\")","v":""},null,{"$f":"IF($I8=\"\",0,IF($I8<Tables!$T$2,0,1))","v":1},{"$f":"IF($I8=\"\",0,IF($I8>Tables!$U$2,0,1))","v":1},{"$f":"IF($I8=\"\",0,IF($H8<VLOOKUP($K8,Course,3),0,1))","v":0},{"$f":"IF($I8=\"\",0,IF($H8>VLOOKUP($K8,Course,4),0,1))","v":1},{"$f":"IF($AN8=\"\",0,IF($H8<VLOOKUP($AN8,Race,2),0,1))","v":1},{"$f":"IF($AN8=\"\",0,IF($H8>VLOOKUP($AN8,Race,3),0,1))","v":1},{"$f":"IF($J8=\"\",0,VLOOKUP($J8,Selection,2))","v":1},{"$f":"IF(E8=0,0,IF(SUM(AR8:AX8)=$AY$1,1,0))","v":0},{"$f":"IF($AY8<>1,0,IF($G8=1,1,0))","v":0},null,{"$f":"IF($K8=\"\",0,VLOOKUP($K8,Course,3))","v":99},{"$f":"IF($K8=\"\",0,VLOOKUP($K8,Course,4))","v":99},{"$f":"IF($AN8=\"\",0,VLOOKUP($AN8,Race,2))","v":1},{"$f":"IF($AN8=\"\",0,VLOOKUP($AN8,Race,3))","v":50},{"$f":"IF($AN8=\"\",0,VLOOKUP($AN8,Race,4))","v":1},{"$f":"IF($AN8=\"\",0,VLOOKUP($AN8,Race,5))","v":50},{"$f":"WEEKDAY(AM8)","v":6},{"$f":"IF($AY8=1,5,\"\")","v":""},{"$f":"IF($AZ8=1,($I8*$BI8),\"\")","v":""},{"$f":"IF($BG8=1,($J8*$BK8),\"\")","v":""}]
{"$rows_left_out":45}
{"sheet":"Tables","index":1,"n_rows":128,"n_cols":22,"rows_kept":128,"cut":false,"hidden":false,"merged":[]}
["Win No",{"$f":"Dutch!AZ1545","v":42},41,"Course Code","Course","Win Min","Win Max","Pl Min","Pl Max","Bet",null,"RaceType","Win Min","Win Max","Pl Min","Pl Max","Bet",null,null,"Min","Max"]
["Win Prof",{"$f":"Dutch!BJ1546","v":1104.5},1270.5,"Aint","Aintree",99,99,99,99,0,null,"AppHcap",1,50,1,50,0,null,"Win",5,12,9.2]
["Ave",{"$f":"B2/B1","v":26.297619047619},30.99,"Ascot","Ascot",99,99,99,99,0,null,"AppMdnStks",1,50,1,50,0,null,"Place",3,3.9]
[null,null,null,"Ayr 1","Ayr",99,99,99,99,1,null,"BegChs",1,50,1,50,0]
[null,null,null,"Ayr 2","Ayr",99,99,99,99,1,null,"BegHrd",1,50,1,50,0,null,3,1]
[null,null,null,"Ayr 3","Ayr",99,99,99,99,1,null,"CharityStks",1,50,1,50,0,null,4,1]
[null,null,null,"Ayr 4","Ayr",99,99,99,99,1,null,"Chs",99,99,1,50,0,null,5,1]
[null,null,null,"Ayr 5","Ayr",99,99,99,99,1,null,"Claim",1,50,1,50,0,null,6,0]
{"$rows_left_out":121}
{"sheet":"Tennis","index":2,"n_rows":910,"n_cols":7,"rows_kept":910,"cut":false,"hidden":false,"merged":[]}
["Log","Time","Market","Selection","Profit If Win","Res","P&L"]
["13/05/2016 a","16:17:02","N Djokovic v A Murray - Match Odds","Novak Djokovic",0,0]
["13/05/2016 a","16:17:02","N Djokovic v A Murray - Match Odds","Andy Murray",0,0]
["13/05/2016 a","16:17:13","N Djokovic v A Murray - Match Odds","Novak Djokovic",2.7,0]
["13/05/2016 a","16:17:13","N Djokovic v A Murray - Match Odds","Andy Murray",-5,0]
["13/05/2016 a","16:17:25","N Djokovic v A Murray - Match Odds","Novak Djokovic",2.7,0]
["13/05/2016 a","16:17:25","N Djokovic v A Murray - Match Odds","Andy Murray",-5,0]
["13/05/2016 a","16:17:36","N Djokovic v A Murray - Match Odds","Novak Djokovic",2.7,0]
{"$rows_left_out":903}
{"sheet":"Soccer","index":3,"n_rows":0,"n_cols":0,"rows_kept":0,"cut":false,"hidden":false,"merged":[]}

{"sheet":"Strategy","index":4,"n_rows":2,"n_cols":13,"rows_kept":2,"cut":false,"hidden":false,"merged":[]}
["Course",null,"Run Min","Run Max",null,null,"Lay odds","stake","win","lose","back odds","stake","Win"]
[null,null,null,null,null,"2nd Fav",8,5,{"$f":"H2","v":5},{"$f":"G2*H2","v":40},3,13,{"$f":"L2*K2","v":39}]