{"text_format":"1","workbook":"xlsx","n_sheets":5,"sheets":["Dutch","Tables","Tennis","Soccer","Strategy"],"not_rendered":{"charts":0,"images":0,"macros":0,"external_links":0,"defined_names":76,"comments":0,"pivot_tables":0},"unopened":[],"bounds":{"document_bytes":16777216,"sheet_cells":100000,"rows_first":2000,"rows_last":500,"rows_between":2000,"halvings":0,"cell_chars":16384,"cell_head_chars":4096},"cells_cut":0,"cells_raw":0,"read":"whole","date_system":"1900"}

{"sheet":"Dutch","index":0,"n_rows":52,"n_cols":63,"rows_kept":52,"cut":false,"hidden":false,"merged":[]}
["Log","Time","Race","Horse","Prof","Loss","Res","Run","Win odds","Selection","Crse","CourseName","Charity","PA","Class","Listed","Grd1","Grd2","Grd3","Grp1","Grp2","Grp3","Grp 3","Nov","App","Sell","Mdn","Beg","Claim","Hunt","Hcap ","Cond","XC","Stks","Hrd","Chs","NHF","INHF","Date","Race Type","RaceName","Race Error","blank1","Min win Odds","Max win Odds","Course Min","Course Max","Min Runners","Max Runners","Selection",7,8,"blank2","Bet Min","Bet Max","BetRaceMin","BetRaceMax","LayRaceMin","LayRaceMax","Day","Win Stake","Win Prof","Plce Prof"]
["27/05/2016 14:39:39: [G_Auto] :  £ 5.00 Back bet placed on Majoris at 8.6. Fully matched at 8.6.  Ref: 10005","14:52:02","Hayd 27th May - 14:40 6f Nov Stks","Majoris",28,0,null,14,8.6,{"$f":"IF(C2=C1,J1+1,3)","v":3},{"$f":"IF(C2=\"\",\"\",LEFT(C2,5))","v":"Hayd"},{"$f":"IF($K2=\"\",0,VLOOKUP($K2,Course,2))","v":"Haydock"},{"$f":"IF(ISERROR(SEARCH(\"Charity\",$C2)),\"\",\"Charity\")","v":""},{"$f":"IF(ISERROR(SEARCH(\"PA\",$C2)),\"\",\"PA\")","v":""},{"$f":"IF(ISERROR(SEARCH(\"Class\",$C2)),\"\",\"Class\")","v":""},{"$f":"IF(ISERROR(SEARCH(\"Listed\",$C2)),\"\",\"Listed\")","v":""},{"$f":"IF(ISERROR(SEARCH(\"Grd1\",$C2)),\"\",\"Grd1\")","v":""},{"$f":"IF(ISERROR(SEARCH(\"Grd2\",$C2)),\"\",\"Grd2\")","v":""},{"$f":"IF(ISERROR(SEARCH(\"Grd3\",$C2)),\"\",\"Grd3\")","v":""},{"$f":"IF(ISERROR(SEARCH(\"Grp1\",$C2)),\"\",\"Grp1\")","v":""},{"$f":"IF(ISERROR(SEARCH(\"Grp2\",$C2)),\"\",\"Grp2\")","v":""},{"$f":"IF(ISERROR(SEARCH(\"Grp3\",$C2)),\"\",\"Grp3\")","v":""},{"$f":"IF(ISERROR(SEARCH(\"Grp 3\",$C2)),\"\",\"Grp3\")","v":""},{"$f":"IF(ISERROR(SEARCH(\"Nov\",$C2)),\"\",\"Nov\")","v":"Nov"},{"$f":"IF(ISERROR(SEARCH(\"App\",$C2)),\"\",\"App\")","v":""},{"$f":"IF(ISERROR(SEARCH(\"Sell\",$C2)),\"\",\"Sell\")","v":""},{"$f":"IF(ISERROR(SEARCH(\"Mdn\",$C2)),\"\",\"Mdn\")","v":""},{"$f":"IF(ISERROR(SEARCH(\"Beg\",$C2)),\"\",\"Beg\")","v":""},{"$f":"IF(ISERROR(SEARCH(\"Claim\",$C2)),\"\",\"Claim\")","v":""},{"$f":"IF(ISERROR(SEARCH(\"Hunt\",$C2)),\"\",\"Hunt\")","v":""},{"$f":"IF(ISERROR(SEARCH(\"Hcap\",$C2)),\"\",\"Hcap\")","v":""},{"$f":"IF(ISERROR(SEARCH(\"Cond\",$C2)),\"\",\"Cond\")","v":""},{"$f":"IF(ISERROR(SEARCH(\"XC\",$C2)),\"\",\"XC\")","v":""},{"$f":"IF(ISERROR(SEARCH(\"Stks\",$C2)),\"\",\"Stks\")","v":"Stks"},{"$f":"IF(ISERROR(SEARCH(\"Hrd\",$C2)),\"\",\"Hrd\")","v":""},{"$f":"IF(ISERROR(SEARCH(\"Chs\",$C2)),\"\",\"Chs\")","v":""},{"$f":"IF(ISERROR(SEARCH(\" NHF\",$C2)),\"\",\"NHF\")","v":""},{"$f":"IF(ISERROR(SEARCH(\"INHF\",$C2)),\"\",\"INHF\")","v":""},{"$f":"LEFT(A2,10)","v":"27/05/2016"},{"$f":"CONCATENATE(M2,N2,O2,P2,Q2,R2,S2,T2,U2,V2,W2,X2,Y2,Z2,AB2,AA2,AC2,AD2,AE2,AF2,AG2,AH2,AK2,AL2,AI2,AJ2)","v":"NovStks"},{"$f":"IF($AN2=\"\",0,VLOOKUP($AN2,Race,1))","v":"NovStks"},{"$f":"IF($AN2<>$AO2,1,\"\")","v":""},null,{"$f":"IF($I2=\"\",0,IF($I2<Tables!$T$2,0,1))","v":1},{"$f":"IF($I2=\"\",0,IF($I2>Tables!$U$2,0,1))","v":1},{"$f":"IF($I2=\"\",0,IF($H2<VLOOKUP($K2,Course,3),0,1))","v":1},{"$f":"IF($I2=\"\",0,IF($H2>VLOOKUP($K2,Course,4),0,1))","v":0},{"$f":"IF($AN2=\"\",0,IF($H2<VLOOKUP($AN2,Race,2),0,1))","v":1},{"$f":"IF($AN2=\"\",0,IF($H2>VLOOKUP($AN2,Race,3),0,1))","v":1},{"$f":"IF($J2=\"\",0,VLOOKUP($J2,Selection,2))","v":1},{"$f":"IF(E2=0,0,IF(SUM(AR2:AX2)=$AY$1,1,0))","v":0},{"$f":"IF($AY2<>1,0,IF($G2=1,1,0))","v":0},null,{"$f":"IF($K2=\"\",0,VLOOKUP($K2,Course,3))","v":10},{"$f":"IF($K2=\"\",0,VLOOKUP($K2,Course,4))","v":13},{"$f":"IF($AN2=\"\",0,VLOOKUP($AN2,Race,2))","v":1},{"$f":"IF($AN2=\"\",0,VLOOKUP($AN2,Race,3))","v":50},{"$f":"IF($AN2=\"\",0,VLOOKUP($AN2,Race,4))","v":1},{"$f":"IF($AN2=\"\",0,VLOOKUP($AN2,Race,5))","v":50},{"$f":"WEEKDAY(AM2)","v":6},{"$f":"IF($AY2=1,5,\"\")","v":""},{"$f":"IF($AZ2=1,($I2*$BI2),\"\")","v":""},{"$f":"IF($BG2=1,($J2*$BK2),\"\")","v":""}]
["27/05/2016 14:39:39: [G_Auto] :  £ 5.00 Back bet placed on Waqaas at 11. Fully matched at 11.  Ref: 10006","14:52:02","Hayd 27th May - 14:40 6f Nov Stks","Waqaas",40,0,null,14,11,{"$f":"IF(C3=C2,J2+1,3)","v":4},{"$f":"IF(C3=\"\",\"\",LEFT(C3,5))","v":"Hayd"},{"$f":"IF($K3=\"\",0,VLOOKUP($K3,Course,2))","v":"Haydock"},{"$f":"IF(ISERROR(SEARCH(\"Charity\",$C3)),\"\",\"Charity\")","v":""},{"$f":"IF(ISERROR(SEARCH(\"PA\",$C3)),\"\",\"PA\")","v":""},{"$f":"IF(ISERROR(SEARCH(\"Class\",$C3)),\"\",\"Class\")","v":""},{"$f":"IF(ISERROR(SEARCH(\"Listed\",$C3)),\"\",\"Listed\")","v":""},{"$f":"IF(ISERROR(SEARCH(\"Grd1\",$C3)),\"\",\"Grd1\")","v":""},{"$f":"IF(ISERROR(SEARCH(\"Grd2\",$C3)),\"\",\"Grd2\")","v":""},{"$f":"IF(ISERROR(SEARCH(\"Grd3\",$C3)),\"\",\"Grd3\")","v":""},{"$f":"IF(ISERROR(SEARCH(\"Grp1\",$C3)),\"\",\"Grp1\")","v":""},{"$f":"IF(ISERROR(SEARCH(\"Grp2\",$C3)),\"\",\"Grp2\")","v":""},{"$f":"IF(ISERROR(SEARCH(\"Grp3\",$C3)),\"\",\"Grp3\")","v":""},{"$f":"IF(ISERROR(SEARCH(\"Grp 3\",$C3)),\"\",\"Grp3\")","v":""},{"$f":"IF(ISERROR(SEARCH(\"Nov\",$C3)),\"\",\"Nov\")","v":"Nov"},{"$f":"IF(ISERROR(SEARCH(\"App\",$C3)),\"\",\"App\")","v":""},{"$f":"IF(ISERROR(SEARCH(\"Sell\",$C3)),\"\",\"Sell\")","v":""},{"$f":"IF(ISERROR(SEARCH(\"Mdn\",$C3)),\"\",\"Mdn\")","v":""},{"$f":"IF(ISERROR(SEARCH(\"Beg\",$C3)),\"\",\"Beg\")","v":""},{"$f":"IF(ISERROR(SEARCH(\"Claim\",$C3)),\"\",\"Claim\")","v":""},{"$f":"IF(ISERROR(SEARCH(\"Hunt\",$C3)),\"\",\"Hunt\")","v":""},{"$f":"IF(ISERROR(SEARCH(\"Hcap\",$C3)),\"\",\"Hcap\")","v":""},{"$f":"IF(ISERROR(SEARCH(\"Cond\",$C3)),\"\",\"Cond\")","v":""},{"$f":"IF(ISERROR(SEARCH(\"XC\",$C3)),\"\",\"XC\")","v":""},{"$f":"IF(ISERROR(SEARCH(\"Stks\",$C3)),\"\",\"Stks\")","v":"Stks"},{"$f":"IF(ISERROR(SEARCH(\"Hrd\",$C3)),\"\",\"Hrd\")","v":""},{"$f":"IF(ISERROR(SEARCH(\"Chs\",$C3)),\"\",\"Chs\")","v":""},{"$f":"IF(ISERROR(SEARCH(\" NHF\",$C3)),\"\",\"NHF\")","v":""},{"$f":"IF(ISERROR(SEARCH(\"INHF\",$C3)),\"\",\"INHF\")","v":""},{"$f":"LEFT(A3,10)","v":"27/05/2016"},{"$f":"CONCATENATE(M3,N3,O3,P3,Q3,R3,S3,T3,U3,V3,W3,X3,Y3,Z3,AB3,AA3,AC3,AD3,AE3,AF3,AG3,AH3,AK3,AL3,AI3,AJ3)","v":"NovStks"},{"$f":"IF($AN3=\"\",0,VLOOKUP($AN3,Race,1))","v":"NovStks"},{"$f":"IF($AN3<>$AO3,1,\"\")","v":""},null,{"$f":"IF($I3=\"\",0,IF($I3<Tables!$T$2,0,1))","v":1},{"$f":"IF($I3=\"\",0,IF($I3>Tables!$U$2,0,1))","v":1},{"$f":"IF($I3=\"\",0,IF($H3<VLOOKUP($K3,Course,3),0,1))","v":1},{"$f":"IF($I3=\"\",0,IF($H3>VLOOKUP($K3,Course,4),0,1))","v":0},{"$f":"IF($AN3=\"\",0,IF($H3<VLOOKUP($AN3,Race,2),0,1))","v":1},{"$f":"IF($AN3=\"\",0,IF($H3>VLOOKUP($AN3,Race,3),0,1))","v":1},{"$f":"IF($J3=\"\",0,VLOOKUP($J3,Selection,2))","v":1},{"$f":"IF(E3=0,0,IF(SUM(AR3:AX3)=$AY$1,1,0))","v":0},{"$f":"IF($AY3<>1,0,IF($G3=1,1,0))","v":0},null,{"$f":"IF($K3=\"\",0,VLOOKUP($K3,Course,3))","v":10},{"$f":"IF($K3=\"\",0,VLOOKUP($K3,Course,4))","v":13},{"$f":"IF($AN3=\"\",0,VLOOKUP($AN3,Race,2))","v":1},{"$f":"IF($AN3=\"\",0,VLOOKUP($AN3,Race,3))","v":50},{"$f":"IF($AN3=\"\",0,VLOOKUP($AN3,Race,4))","v":1},{"$f":"IF($AN3=\"\",0,VLOOKUP($AN3,Race,5))","v":50},{"$f":"WEEKDAY(AM3)","v":6},{"$f":"IF($AY3=1,5,\"\")","v":""},{"$f":"IF($AZ3=1,($I3*$BI3),\"\")","v":""},{"$f":"IF($BG3=1,($J3*$BK3),\"\")","v":""}]
["27/05/2016 14:39:39: [G_Auto] :  £ 5.00 Back bet placed on Our Boy at 11.5. Fully matched at 11.5.  Ref: 10007","14:52:02","Hayd 27th May - 14:40 6f Nov Stks","Our Boy",42.5,0,null,14,11.5,{"$f":"IF(C4=C3,J3+1,3)","v":5},{"$f":"IF(C4=\"\",\"\",LEFT(C4,5))","v":"Hayd"},{"$f":"IF($K4=\"\",0,VLOOKUP($K4,Course,2))","v":"Haydock"},{"$f":"IF(ISERROR(SEARCH(\"Charity\",$C4)),\"\",\"Charity\")","v":""},{"$f":"IF(ISERROR(SEARCH(\"PA\",$C4)),\"\",\"PA\")","v":""},{"$f":"IF(ISERROR(SEARCH(\"Class\",$C4)),\"\",\"Class\")","v":""},{"$f":"IF(ISERROR(SEARCH(\"Listed\",$C4)),\"\",\"Listed\")","v":""},{"$f":"IF(ISERROR(SEARCH(\"Grd1\",$C4)),\"\",\"Grd1\")","v":""},{"$f":"IF(ISERROR(SEARCH(\"Grd2\",$C4)),\"\",\"Grd2\")","v":""},{"$f":"IF(ISERROR(SEARCH(\"Grd3\",$C4)),\"\",\"Grd3\")","v":""},{"$f":"IF(ISERROR(SEARCH(\"Grp1\",$C4)),\"\",\"Grp1\")","v":""},{"$f":"IF(ISERROR(SEARCH(\"Grp2\",$C4)),\"\",\"Grp2\")","v":""},{"$f":"IF(ISERROR(SEARCH(\"Grp3\",$C4)),\"\",\"Grp3\")","v":""},{"$f":"IF(ISERROR(SEARCH(\"Grp 3\",$C4)),\"\",\"Grp3\")","v":""},{"$f":"IF(ISERROR(SEARCH(\"Nov\",$C4)),\"\",\"Nov\")","v":"Nov"},{"$f":"IF(ISERROR(SEARCH(\"App\",$C4)),\"\",\"App\")","v":""},{"$f":"IF(ISERROR(SEARCH(\"Sell\",$C4)),\"\",\"Sell\")","v":""},{"$f":"IF(ISERROR(SEARCH(\"Mdn\",$C4)),\"\",\"Mdn\")","v":""},{"$f":"IF(ISERROR(SEARCH(\"Beg\",$C4)),\"\",\"Beg\")","v":""},{"$f":"IF(ISERROR(SEARCH(\"Claim\",$C4)),\"\",\"Claim\")","v":""},{"$f":"IF(ISERROR(SEARCH(\"Hunt\",$C4)),\"\",\"Hunt\")","v":""},{"$f":"IF(ISERROR(SEARCH(\"Hcap\",$C4)),\"\",\"Hcap\")","v":""},{"$f":"IF(ISERROR(SEARCH(\"Cond\",$C4)),\"\",\"Cond\")","v":""},{"$f":"IF(ISERROR(SEARCH(\"XC\",$C4)),\"\",\"XC\")","v":""},{"$f":"IF(ISERROR(SEARCH(\"Stks\",$C4)),\"\",\"Stks\")","v":"Stks"},{"$f":"IF(ISERROR(SEARCH(\"Hrd\",$C4)),\"\",\"Hrd\")","v":""},{"$f":"IF(ISERROR(SEARCH(\"Chs\",$C4)),\"\",\"Chs\")","v":""},{"$f":"IF(ISERROR(SEARCH(\" NHF\",$C4)),\"\",\"NHF\")","v":""},{"$f":"IF(ISERROR(SEARCH(\"INHF\",$C4)),\"\",\"INHF\")","v":""},{"$f":"LEFT(A4,10)","v":"27/05/2016"},{"$f":"CONCATENATE(M4,N4,O4,P4,Q4,R4,S4,T4,U4,V4,W4,X4,Y4,Z4,AB4,AA4,AC4,AD4,AE4,AF4,AG4,AH4,AK4,AL4,AI4,AJ4)","v":"NovStks"},{"$f":"IF($AN4=\"\",0,VLOOKUP($AN4,Race,1))","v":"NovStks"},{"$f":"IF($AN4<>$AO4,1,\"\")","v":""},null,{"$f":"IF($I4=\"\",0,IF($I4<Tables!$T$2,0,1))","v":1},{"$f":"IF($I4=\"\",0,IF($I4>Tables!$U$2,0,1))","v":1},{"$f":"IF($I4=\"\",0,IF($H4<VLOOKUP($K4,Course,3),0,1))","v":1},{"$f":"IF($I4=\"\",0,IF($H4>VLOOKUP($K4,Course,4),0,1))","v":0},{"$f":"IF($AN4=\"\",0,IF($H4<VLOOKUP($AN4,Race,2),0,1))","v":1},{"$f":"IF($AN4=\"\",0,IF($H4>VLOOKUP($AN4,Race,3),0,1))","v":1},{"$f":"IF($J4=\"\",0,VLOOKUP($J4,Selection,2))","v":1},{"$f":"IF(E4=0,0,IF(SUM(AR4:AX4)=$AY$1,1,0))","v":0},{"$f":"IF($AY4<>1,0,IF($G4=1,1,0))","v":0},null,{"$f":"IF($K4=\"\",0,VLOOKUP($K4,Course,3))","v":10},{"$f":"IF($K4=\"\",0,VLOOKUP($K4,Course,4))","v":13},{"$f":"IF($AN4=\"\",0,VLOOKUP($AN4,Race,2))","v":1},{"$f":"IF($AN4=\"\",0,VLOOKUP($AN4,Race,3))","v":50},{"$f":"IF($AN4=\"\",0,VLOOKUP($AN4,Race,4))","v":1},{"$f":"IF($AN4=\"\",0,VLOOKUP($AN4,Race,5))","v":50},{"$f":"WEEKDAY(AM4)","v":6},{"$f":"IF($AY4=1,5,\"\")","v":""},{"$f":"IF($AZ4=1,($I4*$BI4),\"\")","v":""},{"$f":"IF($BG4=1,($J4*$BK4),\"\")","v":""}]
["27/05/2016 14:49:56: [G_Auto] :  £ 5.00 Back bet placed on Al Sailiyah at 5.6. Fully matched at 5.6.  Ref: 10008","14:55:17","Brig 27th May - 14:50 6f Hcap","Al Sailiyah",23,0,null,7,5.6,{"$f":"IF(C5=C4,J4+1,3)","v":3},{"$f":"IF(C5=\"\",\"\",LEFT(C5,5))","v":"Brig"},{"$f":"IF($K5=\"\",0,VLOOKUP($K5,Course,2))","v":"Brighton"},{"$f":"IF(ISERROR(SEARCH(\"Charity\",$C5)),\"\",\"Charity\")","v":""},{"$f":"IF(ISERROR(SEARCH(\"PA\",$C5)),\"\",\"PA\")","v":""},{"$f":"IF(ISERROR(SEARCH(\"Class\",$C5)),\"\",\"Class\")","v":""},{"$f":"IF(ISERROR(SEARCH(\"Listed\",$C5)),\"\",\"Listed\")","v":""},{"$f":"IF(ISERROR(SEARCH(\"Grd1\",$C5)),\"\",\"Grd1\")","v":""},{"$f":"IF(ISERROR(SEARCH(\"Grd2\",$C5)),\"\",\"Grd2\")","v":""},{"$f":"IF(ISERROR(SEARCH(\"Grd3\",$C5)),\"\",\"Grd3\")","v":""},{"$f":"IF(ISERROR(SEARCH(\"Grp1\",$C5)),\"\",\"Grp1\")","v":""},{"$f":"IF(ISERROR(SEARCH(\"Grp2\",$C5)),\"\",\"Grp2\")","v":""},{"$f":"IF(ISERROR(SEARCH(\"Grp3\",$C5)),\"\",\"Grp3\")","v":""},{"$f":"IF(ISERROR(SEARCH(\"Grp 3\",$C5)),\"\",\"Grp3\")","v":""},{"$f":"IF(ISERROR(SEARCH(\"Nov\",$C5)),\"\",\"Nov\")","v":""},{"$f":"IF(ISERROR(SEARCH(\"App\",$C5)),\"\",\"App\")","v":""},{"$f":"IF(ISERROR(SEARCH(\"Sell\",$C5)),\"\",\"Sell\")","v":""},{"$f":"IF(ISERROR(SEARCH(\"Mdn\",$C5)),\"\",\"Mdn\")","v":""},{"$f":"IF(ISERROR(SEARCH(\"Beg\",$C5)),\"\",\"Beg\")","v":""},{"$f":"IF(ISERROR(SEARCH(\"Claim\",$C5)),\"\",\"Claim\")","v":""},{"$f":"IF(ISERROR(SEARCH(\"Hunt\",$C5)),\"\",\"Hunt\")","v":""},{"$f":"IF(ISERROR(SEARCH(\"Hcap\",$C5)),\"\",\"Hcap\")","v":"Hcap"},{"$f":"IF(ISERROR(SEARCH(\"Cond\",$C5)),\"\",\"Cond\")","v":""},{"$f":"IF(ISERROR(SEARCH(\"XC\",$C5)),\"\",\"XC\")","v":""},{"$f":"IF(ISERROR(SEARCH(\"Stks\",$C5)),\"\",\"Stks\")","v":""},{"$f":"IF(ISERROR(SEARCH(\"Hrd\",$C5)),\"\",\"Hrd\")","v":""},{"$f":"IF(ISERROR(SEARCH(\"Chs\",$C5)),\"\",\"Chs\")","v":""},{"$f":"IF(ISERROR(SEARCH(\" NHF\",$C5)),\"\",\"NHF\")","v":""},{"$f":"IF(ISERROR(SEARCH(\"INHF\",$C5)),\"\",\"INHF\")","v":""},{"$f":"LEFT(A5,10)","v":"27/05/2016"},{"$f":"CONCATENATE(M5,N5,O5,P5,Q5,R5,S5,T5,U5,V5,W5,X5,Y5,Z5,AB5,AA5,AC5,AD5,AE5,AF5,AG5,AH5,AK5,AL5,AI5,AJ5)","v":"Hcap"},{"$f":"IF($AN5=\"\",0,VLOOKUP($AN5,Race,1))","v":"Hcap"},{"$f":"IF($AN5<>$AO5,1,\"\")","v":""},null,{"$f":"IF($I5=\"\",0,IF($I5<Tables!$T$2,0,1))","v":1},{"$f":"IF($I5=\"\",0,IF($I5>Tables!$U$2,0,1))","v":1},{"$f":"IF($I5=\"\",0,IF($H5<VLOOKUP($K5,Course,3),0,1))","v":0},{"$f":"IF($I5=\"\",0,IF($H5>VLOOKUP($K5,Course,4),0,1))","v":1},{"$f":"IF($AN5=\"\",0,IF($H5<VLOOKUP($AN5,Race,2),0,1))","v":1},{"$f":"IF($AN5=\"\",0,IF($H5>VLOOKUP($AN5,Race,3),0,1))","v":1},{"$f":"IF($J5=\"\",0,VLOOKUP($J5,Selection,2))","v":1},{"$f":"IF(E5=0,0,IF(SUM(AR5:AX5)=$AY$1,1,0))","v":0},{"$f":"IF($AY5<>1,0,IF($G5=1,1,0))","v":0},null,{"$f":"IF($K5=\"\",0,VLOOKUP($K5,Course,3))","v":99},{"$f":"IF($K5=\"\",0,VLOOKUP($K5,Course,4))","v":99},{"$f":"IF($AN5=\"\",0,VLOOKUP($AN5,Race,2))","v":1},{"$f":"IF($AN5=\"\",0,VLOOKUP($AN5,Race,3))","v":50},{"$f":"IF($AN5=\"\",0,VLOOKUP($AN5,Race,4))","v":1},{"$f":"IF($AN5=\"\",0,VLOOKUP($AN5,Race,5))","v":50},{"$f":"WEEKDAY(AM5)","v":6},{"$f":"IF($AY5=1,5,\"\")","v":""},{"$f":"IF($AZ5=1,($I5*$BI5),\"\")","v":""},{"$f":"IF($BG5=1,($J5*$BK5),\"\")","v":""}]
["27/05/2016 15:49:56: [G_Auto] :  £ 5.00 Back bet placed on Dr Drey at 6.2. Fully matched at 6.2.  Ref: 10012","15:55:22","Brig 27th May - 15:50 1m4f Hcap","Dr Drey",26,0,null,5,6.2,{"$f":"IF(C6=C5,J5+1,3)","v":3},{"$f":"IF(C6=\"\",\"\",LEFT(C6,5))","v":"Brig"},{"$f":"IF($K6=\"\",0,VLOOKUP($K6,Course,2))","v":"Brighton"},{"$f":"IF(ISERROR(SEARCH(\"Charity\",$C6)),\"\",\"Charity\")","v":""},{"$f":"IF(ISERROR(SEARCH(\"PA\",$C6)),\"\",\"PA\")","v":""},{"$f":"IF(ISERROR(SEARCH(\"Class\",$C6)),\"\",\"Class\")","v":""},{"$f":"IF(ISERROR(SEARCH(\"Listed\",$C6)),\"\",\"Listed\")","v":""},{"$f":"IF(ISERROR(SEARCH(\"Grd1\",$C6)),\"\",\"Grd1\")","v":""},{"$f":"IF(ISERROR(SEARCH(\"Grd2\",$C6)),\"\",\"Grd2\")","v":""},{"$f":"IF(ISERROR(SEARCH(\"Grd3\",$C6)),\"\",\"Grd3\")","v":""},{"$f":"IF(ISERROR(SEARCH(\"Grp1\",$C6)),\"\",\"Grp1\")","v":""},{"$f":"IF(ISERROR(SEARCH(\"Grp2\",$C6)),\"\",\"Grp2\")","v":""},{"$f":"IF(ISERROR(SEARCH(\"Grp3\",$C6)),\"\",\"Grp3\")","v":""},{"$f":"IF(ISERROR(SEARCH(\"Grp 3\",$C6)),\"\",\"Grp3\")","v":""},{"$f":"IF(ISERROR(SEARCH(\"Nov\",$C6)),\"\",\"Nov\")","v":""},{"$f":"IF(ISERROR(SEARCH(\"App\",$C6)),\"\",\"App\")","v":""},{"$f":"IF(ISERROR(SEARCH(\"Sell\",$C6)),\"\",\"Sell\")","v":""},{"$f":"IF(ISERROR(SEARCH(\"Mdn\",$C6)),\"\",\"Mdn\")","v":""},{"$f":"IF(ISERROR(SEARCH(\"Beg\",$C6)),\"\",\"Beg\")","v":""},{"$f":"IF(ISERROR(SEARCH(\"Claim\",$C6)),\"\",\"Claim\")","v":""},{"$f":"IF(ISERROR(SEARCH(\"Hunt\",$C6)),\"\",\"Hunt\")","v":""},{"$f":"IF(ISERROR(SEARCH(\"Hcap\",$C6)),\"\",\"Hcap\")","v":"Hcap"},{"$f":"IF(ISERROR(SEARCH(\"Cond\",$C6)),\"\",\"Cond\")","v":""},{"$f":"IF(ISERROR(SEARCH(\"XC\",$C6)),\"\",\"XC\")","v":""},{"$f":"IF(ISERROR(SEARCH(\"Stks\",$C6)),\"\",\"Stks\")","v":""},{"$f":"IF(ISERROR(SEARCH(\"Hrd\",$C6)),\"\",\"Hrd\")","v":""},{"$f":"IF(ISERROR(SEARCH(\"Chs\",$C6)),\"\",\"Chs\")","v":""},{"$f":"IF(ISERROR(SEARCH(\" NHF\",$C6)),\"\",\"NHF\")","v":""},{"$f":"IF(ISERROR(SEARCH(\"INHF\",$C6)),\"\",\"INHF\")","v":""},{"$f":"LEFT(A6,10)","v":"27/05/2016"},{"$f":"CONCATENATE(M6,N6,O6,P6,Q6,R6,S6,T6,U6,V6,W6,X6,Y6,Z6,AB6,AA6,AC6,AD6,AE6,AF6,AG6,AH6,AK6,AL6,AI6,AJ6)","v":"Hcap"},{"$f":"IF($AN6=\"\",0,VLOOKUP($AN6,Race,1))","v":"Hcap"},{"$f":"IF($AN6<>$AO6,1,\"\")","v":""},null,{"$f":"IF($I6=\"\",0,IF($I6<Tables!$T$2,0,1))","v":1},{"$f":"IF($I6=\"\",0,IF($I6>Tables!$U$2,0,1))","v":1},{"$f":"IF($I6=\"\",0,IF($H6<VLOOKUP($K6,Course,3),0,1))","v":0},{"$f":"IF($I6=\"\",0,IF($H6>VLOOKUP($K6,Course,4),0,1))","v":1},{"$f":"IF($AN6=\"\",0,IF($H6<VLOOKUP($AN6,Race,2),0,1))","v":1},{"$f":"IF($AN6=\"\",0,IF($H6>VLOOKUP($AN6,Race,3),0,1))","v":1},{"$f":"IF($J6=\"\",0,VLOOKUP($J6,Selection,2))","v":1},{"$f":"IF(E6=0,0,IF(SUM(AR6:AX6)=$AY$1,1,0))","v":0},{"$f":"IF($AY6<>1,0,IF($G6=1,1,0))","v":0},null,{"$f":"IF($K6=\"\",0,VLOOKUP($K6,Course,3))","v":99},{"$f":"IF($K6=\"\",0,VLOOKUP($K6,Course,4))","v":99},{"$f":"IF($AN6=\"\",0,VLOOKUP($AN6,Race,2))","v":1},{"$f":"IF($AN6=\"\",0,VLOOKUP($AN6,Race,3))","v":50},{"$f":"IF($AN6=\"\",0,VLOOKUP($AN6,Race,4))","v":1},{"$f":"IF($AN6=\"\",0,VLOOKUP($AN6,Race,5))","v":50},{"$f":"WEEKDAY(AM6)","v":6},{"$f":"IF($AY6=1,5,\"\")","v":""},{"$f":"IF($AZ6=1,($I6*$BI6),\"\")","v":""},{"$f":"IF($BG6=1,($J6*$BK6),\"\")","v":""}]
["27/05/2016 16:19:58: [G_Auto] :  £ 5.00 Back bet placed on Pink Ribbon at 9.4. Fully matched at 9.4.  Ref: 10016","16:24:59","Brig 27th May - 16:20 1m2f Hcap","Pink Ribbon",42,0,null,9,9.4,{"$f":"IF(C7=C6,J6+1,3)","v":3},{"$f":"IF(C7=\"\",\"\",LEFT(C7,5))","v":"Brig"},{"$f":"IF($K7=\"\",0,VLOOKUP($K7,Course,2))","v":"Brighton"},{"$f":"IF(ISERROR(SEARCH(\"Charity\",$C7)),\"\",\"Charity\")","v":""},{"$f":"IF(ISERROR(SEARCH(\"PA\",$C7)),\"\",\"PA\")","v":""},{"$f":"IF(ISERROR(SEARCH(\"Class\",$C7)),\"\",\"Class\")","v":""},{"$f":"IF(ISERROR(SEARCH(\"Listed\",$C7)),\"\",\"Listed\")","v":""},{"$f":"IF(ISERROR(SEARCH(\"Grd1\",$C7)),\"\",\"Grd1\")","v":""},{"$f":"IF(ISERROR(SEARCH(\"Grd2\",$C7)),\"\",\"Grd2\")","v":""},{"$f":"IF(ISERROR(SEARCH(\"Grd3\",$C7)),\"\",\"Grd3\")","v":""},{"$f":"IF(ISERROR(SEARCH(\"Grp1\",$C7)),\"\",\"Grp1\")","v":""},{"$f":"IF(ISERROR(SEARCH(\"Grp2\",$C7)),\"\",\"Grp2\")","v":""},{"$f":"IF(ISERROR(SEARCH(\"Grp3\",$C7)),\"\",\"Grp3\")","v":""},{"$f":"IF(ISERROR(SEARCH(\"Grp 3\",$C7)),\"\",\"Grp3\")","v":""},{"$f":"IF(ISERROR(SEARCH(\"Nov\",$C7)),\"\",\"Nov\")","v":""},{"$f":"IF(ISERROR(SEARCH(\"App\",$C7)),\"\",\"App\")","v":""},{"$f":"IF(ISERROR(SEARCH(\"Sell\",$C7)),\"\",\"Sell\")","v":""},{"$f":"IF(ISERROR(SEARCH(\"Mdn\",$C7)),\"\",\"Mdn\")","v":""},{"$f":"IF(ISERROR(SEARCH(\"Beg\",$C7)),\"\",\"Beg\")","v":""},{"$f":"IF(ISERROR(SEARCH(\"Claim\",$C7)),\"\",\"Claim\")","v":""},{"$f":"IF(ISERROR(SEARCH(\"Hunt\",$C7)),\"\",\"Hunt\")","v":""},{"$f":"IF(ISERROR(SEARCH(\"Hcap\",$C7)),\"\",\"Hcap\")","v":"Hcap"},{"$f":"IF(ISERROR(SEARCH(\"Cond\",$C7)),\"\",\"Cond\")","v":""},{"$f":"IF(ISERROR(SEARCH(\"XC\",$C7)),\"\",\"XC\")","v":""},{"$f":"IF(ISERROR(SEARCH(\"Stks\",$C7)),\"\",\"Stks\")","v":""},{"$f":"IF(ISERROR(SEARCH(\"Hrd\",$C7)),\"\",\"Hrd\")","v":""},{"$f":"IF(ISERROR(SEARCH(\"Chs\",$C7)),\"\",\"Chs\")","v":""},{"$f":"IF(ISERROR(SEARCH(\" NHF\",$C7)),\"\",\"NHF\")","v":""},{"$f":"IF(ISERROR(SEARCH(\"INHF\",$C7)),\"\",\"INHF\")","v":""},{"$f":"LEFT(A7,10)","v":"27/05/2016"},{"$f":"CONCATENATE(M7,N7,O7,P7,Q7,R7,S7,T7,U7,V7,W7,X7,Y7,Z7,AB7,AA7,AC7,AD7,AE7,AF7,AG7,AH7,AK7,AL7,AI7,AJ7)","v":"Hcap"},{"$f":"IF($AN7=\"\",0,VLOOKUP($AN7,Race,1))","v":"Hcap"},{"$f":"IF($AN7<>$AO7,1,\"\")","v":""},null,{"$f":"IF($I7=\"\",0,IF($I7<Tables!$T$2,0,1))","v":1},{"$f":"IF($I7=\"\",0,IF($I7>Tables!$U$2,0,1))","v":1},{"$f":"IF($I7=\"\",0,IF($H7<VLOOKUP($K7,Course,3),0,1))","v":0},{"$f":"IF($I7=\"\",0,IF($H7>VLOOKUP($K7,Course,4),0,1))","v":1},{"$f":"IF($AN7=\"\",0,IF($H7<VLOOKUP($AN7,Race,2),0,1))","v":1},{"$f":"IF($AN7=\"\",0,IF($H7>VLOOKUP($AN7,Race,3),0,1))","v":1},{"$f":"IF($J7=\"\",0,VLOOKUP($J7,Selection,2))","v":1},{"$f":"IF(E7=0,0,IF(SUM(AR7:AX7)=$AY$1,1,0))","v":0},{"$f":"IF($AY7<>1,0,IF($G7=1,1,0))","v":0},null,{"$f":"IF($K7=\"\",0,VLOOKUP($K7,Course,3))","v":99},{"$f":"IF($K7=\"\",0,VLOOKUP($K7,Course,4))","v":99},{"$f":"IF($AN7=\"\",0,VLOOKUP($AN7,Race,2))","v":1},{"$f":"IF($AN7=\"\",0,VLOOKUP($AN7,Race,3))","v":50},{"$f":"IF($AN7=\"\",0,VLOOKUP($AN7,Race,4))","v":1},{"$f":"IF($AN7=\"\",0,VLOOKUP($AN7,Race,5))","v":50},{"$f":"WEEKDAY(AM7)","v":6},{"$f":"IF($AY7=1,5,\"\")","v":""},{"$f":"IF($AZ7=1,($I7*$BI7),\"\")","v":""},{"$f":"IF($BG7=1,($J7*$BK7),\"\")","v":""}]
["27/05/2016 16:29:55: [G_Auto] :  £ 5.00 Back bet placed on Cliffs of Dover at 5.8. Fully matched at 5.8.  Ref: 10017","16:39:10","Bath 27th May - 16:30 1m2f Class Stks","Cliffs of Dover",24,0,null,6,5.8,{"$f":"IF(C8=C7,J7+1,3)","v":3},{"$f":"IF(C8=\"\",\"\",LEFT(C8,5))","v":"Bath"},{"$f":"IF($K8=\"\",0,VLOOKUP($K8,Course,2))","v":"Bath"},{"$f":"IF(ISERROR(SEARCH(\"Charity\",$C8)),\"\",\"Charity\")","v":""},{"$f":"IF(ISERROR(SEARCH(\"PA\",$C8)),\"\",\"PA\")","v":""},{"$f":"IF(ISERROR(SEARCH(\"Class\",$C8)),\"\",\"Class\")","v":"Class"},{"$f":"IF(ISERROR(SEARCH(\"Listed\",$C8)),\"\",\"Listed\")","v":""},{"$f":"IF(ISERROR(SEARCH(\"Grd1\",$C8)),\"\",\"Grd1\")","v":""},{"$f":"IF(ISERROR(SEARCH(\"Grd2\",$C8)),\"\",\"Grd2\")","v":""},{"$f":"IF(ISERROR(SEARCH(\"Grd3\",$C8)),\"\",\"Grd3\")","v":""},{"$f":"IF(ISERROR(SEARCH(\"Grp1\",$C8)),\"\",\"Grp1\")","v":""},{"$f":"IF(ISERROR(SEARCH(\"Grp2\",$C8)),\"\",\"Grp2\")","v":""},{"$f":"IF(ISERROR(SEARCH(\"Grp3\",$C8)),\"\",\"Grp3\")","v":""},{"$f":"IF(ISERROR(SEARCH(\"Grp 3\",$C8)),\"\",\"Grp3\")","v":""},{"$f":"IF(ISERROR(SEARCH(\"Nov\",$C8)),\"\",\"Nov\")","v":""},{"$f":"IF(ISERROR(SEARCH(\"App\",$C8)),\"\",\"App\")","v":""},{"$f":"IF(ISERROR(SEARCH(\"Sell\",$C8)),\"\",\"Sell\")","v":""},{"$f":"IF(ISERROR(SEARCH(\"Mdn\",$C8)),\"\",\"Mdn\")","v":""},{"$f":"IF(ISERROR(SEARCH(\"Beg\",$C8)),\"\",\"Beg\")","v":""},{"$f":"IF(ISERROR(SEARCH(\"Claim\",$C8)),\"\",\"Claim\")","v":""},{"$f":"IF(ISERROR(SEARCH(\"Hunt\",$C8)),\"\",\"Hunt\")","v":""},{"$f":"IF(ISERROR(SEARCH(\"Hcap\",$C8)),\"\",\"Hcap\")","v":""},{"$f":"IF(ISERROR(SEARCH(\"Cond\",$C8)),\"\",\"Cond\")","v":""},{"$f":"IF(ISERROR(SEARCH(\"XC\",$C8)),\"\",\"XC\")","v":""},{"$f":"IF(ISERROR(SEARCH(\"Stks\",$C8)),\"\",\"Stks\")","v":"Stks"},{"$f":"IF(ISERROR(SEARCH(\"Hrd\",$C8)),\"\",\"Hrd\")","v":""},{"$f":"IF(ISERROR(SEARCH(\"Chs\",$C8)),\"\",\"Chs\")","v":""},{"$f":"IF(ISERROR(SEARCH(\" NHF\",$C8)),\"\",\"NHF\")","v":""},{"$f":"IF(ISERROR(SEARCH(\"INHF\",$C8)),\"\",\"INHF\")","v":""},{"$f":"LEFT(A8,10)","v":"27/05/2016"},{"$f":"CONCATENATE(M8,N8,O8,P8,Q8,R8,S8,T8,U8,V8,W8,X8,Y8,Z8,AB8,AA8,AC8,AD8,AE8,AF8,AG8,AH8,AK8,AL8,AI8,AJ8)","v":"ClassStks"},{"$f":"IF($AN8=\"\",0,VLOOKUP($AN8,Race,1))","v":"ClassStks"},{"$f":"IF($AN8<>$AO8,1,\"\")","v":""},null,{"$f":"IF($I8=\"\",0,IF($I8<Tables!$T$2,0,1))","v":1},{"$f":"IF($I8=\"\",0,IF($I8>Tables!$U$2,0,1))","v":1},{"$f":"IF($I8=\"\",0,IF($H8<VLOOKUP($K8,Course,3),0,1))","v":0},{"$f":"IF($I8=\"\",0,IF($H8>VLOOKUP($K8,Course,4),0,1))","v":1},{"$f":"IF($AN8=\"\",0,IF($H8<VLOOKUP($AN8,Race,2),0,1))","v":1},{"$f":"IF($AN8=\"\",0,IF($H8>VLOOKUP($AN8,Race,3),0,1))","v":1},{"$f":"IF($J8=\"\",0,VLOOKUP($J8,Selection,2))","v":1},{"$f":"IF(E8=0,0,IF(SUM(AR8:AX8)=$AY$1,1,0))","v":0},{"$f":"IF($AY8<>1,0,IF($G8=1,1,0))","v":0},null,{"$f":"IF($K8=\"\",0,VLOOKUP($K8,Course,3))","v":99},{"$f":"IF($K8=\"\",0,VLOOKUP($K8,Course,4))","v":99},{"$f":"IF($AN8=\"\",0,VLOOKUP($AN8,Race,2))","v":1},{"$f":"IF($AN8=\"\",0,VLOOKUP($AN8,Race,3))","v":50},{"$f":"IF($AN8=\"\",0,VLOOKUP($AN8,Race,4))","v":1},{"$f":"IF($AN8=\"\",0,VLOOKUP($AN8,Race,5))","v":50},{"$f":"WEEKDAY(AM8)","v":6},{"$f":"IF($AY8=1,5,\"\")","v":""},{"$f":"IF($AZ8=1,($I8*$BI8),\"\")","v":""},{"$f":"IF($BG8=1,($J8*$BK8),\"\")","v":""}]
["27/05/2016 16:39:53: [G_Auto] :  £ 5.00 Back bet placed on Asama Blue at 5.2. Fully matched at 5.2.  Ref: 10018","16:49:53","Hayd 27th May - 16:40 1m Mdn Stks","Asama Blue",21,0,1,10,5.2,{"$f":"IF(C9=C8,J8+1,3)","v":3},{"$f":"IF(C9=\"\",\"\",LEFT(C9,5))","v":"Hayd"},{"$f":"IF($K9=\"\",0,VLOOKUP($K9,Course,2))","v":"Haydock"},{"$f":"IF(ISERROR(SEARCH(\"Charity\",$C9)),\"\",\"Charity\")","v":""},{"$f":"IF(ISERROR(SEARCH(\"PA\",$C9)),\"\",\"PA\")","v":""},{"$f":"IF(ISERROR(SEARCH(\"Class\",$C9)),\"\",\"Class\")","v":""},{"$f":"IF(ISERROR(SEARCH(\"Listed\",$C9)),\"\",\"Listed\")","v":""},{"$f":"IF(ISERROR(SEARCH(\"Grd1\",$C9)),\"\",\"Grd1\")","v":""},{"$f":"IF(ISERROR(SEARCH(\"Grd2\",$C9)),\"\",\"Grd2\")","v":""},{"$f":"IF(ISERROR(SEARCH(\"Grd3\",$C9)),\"\",\"Grd3\")","v":""},{"$f":"IF(ISERROR(SEARCH(\"Grp1\",$C9)),\"\",\"Grp1\")","v":""},{"$f":"IF(ISERROR(SEARCH(\"Grp2\",$C9)),\"\",\"Grp2\")","v":""},{"$f":"IF(ISERROR(SEARCH(\"Grp3\",$C9)),\"\",\"Grp3\")","v":""},{"$f":"IF(ISERROR(SEARCH(\"Grp 3\",$C9)),\"\",\"Grp3\")","v":""},{"$f":"IF(ISERROR(SEARCH(\"Nov\",$C9)),\"\",\"Nov\")","v":""},{"$f":"IF(ISERROR(SEARCH(\"App\",$C9)),\"\",\"App\")","v":""},{"$f":"IF(ISERROR(SEARCH(\"Sell\",$C9)),\"\",\"Sell\")","v":""},{"$f":"IF(ISERROR(SEARCH(\"Mdn\",$C9)),\"\",\"Mdn\")","v":"Mdn"},{"$f":"IF(ISERROR(SEARCH(\"Beg\",$C9)),\"\",\"Beg\")","v":""},{"$f":"IF(ISERROR(SEARCH(\"Claim\",$C9)),\"\",\"Claim\")","v":""},{"$f":"IF(ISERROR(SEARCH(\"Hunt\",$C9)),\"\",\"Hunt\")","v":""},{"$f":"IF(ISERROR(SEARCH(\"Hcap\",$C9)),\"\",\"Hcap\")","v":""},{"$f":"IF(ISERROR(SEARCH(\"Cond\",$C9)),\"\",\"Cond\")","v":""},{"$f":"IF(ISERROR(SEARCH(\"XC\",$C9)),\"\",\"XC\")","v":""},{"$f":"IF(ISERROR(SEARCH(\"Stks\",$C9)),\"\",\"Stks\")","v":"Stks"},{"$f":"IF(ISERROR(SEARCH(\"Hrd\",$C9)),\"\",\"Hrd\")","v":""},{"$f":"IF(ISERROR(SEARCH(\"Chs\",$C9)),\"\",\"Chs\")","v":""},{"$f":"IF(ISERROR(SEARCH(\" NHF\",$C9)),\"\",\"NHF\")","v":""},{"$f":"IF(ISERROR(SEARCH(\"INHF\",$C9)),\"\",\"INHF\")","v":""},{"$f":"LEFT(A9,10)","v":"27/05/2016"},{"$f":"CONCATENATE(M9,N9,O9,P9,Q9,R9,S9,T9,U9,V9,W9,X9,Y9,Z9,AB9,AA9,AC9,AD9,AE9,AF9,AG9,AH9,AK9,AL9,AI9,AJ9)","v":"MdnStks"},{"$f":"IF($AN9=\"\",0,VLOOKUP($AN9,Race,1))","v":"MdnStks"},{"$f":"IF($AN9<>$AO9,1,\"\")","v":""},null,{"$f":"IF($I9=\"\",0,IF($I9<Tables!$T$2,0,1))","v":1},{"$f":"IF($I9=\"\",0,IF($I9>Tables!$U$2,0,1))","v":1},{"$f":"IF($I9=\"\",0,IF($H9<VLOOKUP($K9,Course,3),0,1))","v":1},{"$f":"IF($I9=\"\",0,IF($H9>VLOOKUP($K9,Course,4),0,1))","v":1},{"$f":"IF($AN9=\"\",0,IF($H9<VLOOKUP($AN9,Race,2),0,1))","v":1},{"$f":"IF($AN9=\"\",0,IF($H9>VLOOKUP($AN9,Race,3),0,1))","v":1},{"$f":"IF($J9=\"\",0,VLOOKUP($J9,Selection,2))","v":1},{"$f":"IF(E9=0,0,IF(SUM(AR9:AX9)=$AY$1,1,0))","v":1},{"$f":"IF($AY9<>1,0,IF($G9=1,1,0))","v":1},null,{"$f":"IF($K9=\"\",0,VLOOKUP($K9,Course,3))","v":10},{"$f":"IF($K9=\"\",0,VLOOKUP($K9,Course,4))","v":13},{"$f":"IF($AN9=\"\",0,VLOOKUP($AN9,Race,2))","v":1},{"$f":"IF($AN9=\"\",0,VLOOKUP($AN9,Race,3))","v":50},{"$f":"IF($AN9=\"\",0,VLOOKUP($AN9,Race,4))","v":1},{"$f":"IF($AN9=\"\",0,VLOOKUP($AN9,Race,5))","v":50},{"$f":"WEEKDAY(AM9)","v":6},{"$f":"IF($AY9=1,5,\"\")","v":5},{"$f":"IF($AZ9=1,($I9*$BI9),\"\")","v":26},{"$f":"IF($BG9=1,($J9*$BK9),\"\")","v":""}]
["27/05/2016 16:59:53: [G_Auto] :  £ 5.00 Back bet placed on Rain In The Face at 9.8. Fully matched at 9.8.  Ref: 10021","17:08:26","Bath 27th May - 17:00 1m2f Mdn Stks","Rain In The Face",44,0,null,9,9.8,{"$f":"IF(C10=C9,J9+1,3)","v":3},{"$f":"IF(C10=\"\",\"\",LEFT(C10,5))","v":"Bath"},{"$f":"IF($K10=\"\",0,VLOOKUP($K10,Course,2))","v":"Bath"},{"$f":"IF(ISERROR(SEARCH(\"Charity\",$C10)),\"\",\"Charity\")","v":""},{"$f":"IF(ISERROR(SEARCH(\"PA\",$C10)),\"\",\"PA\")","v":""},{"$f":"IF(ISERROR(SEARCH(\"Class\",$C10)),\"\",\"Class\")","v":""},{"$f":"IF(ISERROR(SEARCH(\"Listed\",$C10)),\"\",\"Listed\")","v":""},{"$f":"IF(ISERROR(SEARCH(\"Grd1\",$C10)),\"\",\"Grd1\")","v":""},{"$f":"IF(ISERROR(SEARCH(\"Grd2\",$C10)),\"\",\"Grd2\")","v":""},{"$f":"IF(ISERROR(SEARCH(\"Grd3\",$C10)),\"\",\"Grd3\")","v":""},{"$f":"IF(ISERROR(SEARCH(\"Grp1\",$C10)),\"\",\"Grp1\")","v":""},{"$f":"IF(ISERROR(SEARCH(\"Grp2\",$C10)),\"\",\"Grp2\")","v":""},{"$f":"IF(ISERROR(SEARCH(\"Grp3\",$C10)),\"\",\"Grp3\")","v":""},{"$f":"IF(ISERROR(SEARCH(\"Grp 3\",$C10)),\"\",\"Grp3\")","v":""},{"$f":"IF(ISERROR(SEARCH(\"Nov\",$C10)),\"\",\"Nov\")","v":""},{"$f":"IF(ISERROR(SEARCH(\"App\",$C10)),\"\",\"App\")","v":""},{"$f":"IF(ISERROR(SEARCH(\"Sell\",$C10)),\"\",\"Sell\")","v":""},{"$f":"IF(ISERROR(SEARCH(\"Mdn\",$C10)),\"\",\"Mdn\")","v":"Mdn"},{"$f":"IF(ISERROR(SEARCH(\"Beg\",$C10)),\"\",\"Beg\")","v":""},{"$f":"IF(ISERROR(SEARCH(\"Claim\",$C10)),\"\",\"Claim\")","v":""},{"$f":"IF(ISERROR(SEARCH(\"Hunt\",$C10)),\"\",\"Hunt\")","v":""},{"$f":"IF(ISERROR(SEARCH(\"Hcap\",$C10)),\"\",\"Hcap\")","v":""},{"$f":"IF(ISERROR(SEARCH(\"Cond\",$C10)),\"\",\"Cond\")","v":""},{"$f":"IF(ISERROR(SEARCH(\"XC\",$C10)),\"\",\"XC\")","v":""},{"$f":"IF(ISERROR(SEARCH(\"Stks\",$C10)),\"\",\"Stks\")","v":"Stks"},{"$f":"IF(ISERROR(SEARCH(\"Hrd\",$C10)),\"\",\"Hrd\")","v":""},{"$f":"IF(ISERROR(SEARCH(\"Chs\",$C10)),\"\",\"Chs\")","v":""},{"$f":"IF(ISERROR(SEARCH(\" NHF\",$C10)),\"\",\"NHF\")","v":""},{"$f":"IF(ISERROR(SEARCH(\"INHF\",$C10)),\"\",\"INHF\")","v":""},{"$f":"LEFT(A10,10)","v":"27/05/2016"},{"$f":"CONCATENATE(M10,N10,O10,P10,Q10,R10,S10,T10,U10,V10,W10,X10,Y10,Z10,AB10,AA10,AC10,AD10,AE10,AF10,AG10,AH10,AK10,AL10,AI10,AJ10)","v":"MdnStks"},{"$f":"IF($AN10=\"\",0,VLOOKUP($AN10,Race,1))","v":"MdnStks"},{"$f":"IF($AN10<>$AO10,1,\"\")","v":""},null,{"$f":"IF($I10=\"\",0,IF($I10<Tables!$T$2,0,1))","v":1},{"$f":"IF($I10=\"\",0,IF($I10>Tables!$U$2,0,1))","v":1},{"$f":"IF($I10=\"\",0,IF($H10<VLOOKUP($K10,Course,3),0,1))","v":0},{"$f":"IF($I10=\"\",0,IF($H10>VLOOKUP($K10,Course,4),0,1))","v":1},{"$f":"IF($AN10=\"\",0,IF($H10<VLOOKUP($AN10,Race,2),0,1))","v":1},{"$f":"IF($AN10=\"\",0,IF($H10>VLOOKUP($AN10,Race,3),0,1))","v":1},{"$f":"IF($J10=\"\",0,VLOOKUP($J10,Selection,2))","v":1},{"$f":"IF(E10=0,0,IF(SUM(AR10:AX10)=$AY$1,1,0))","v":0},{"$f":"IF($AY10<>1,0,IF($G10=1,1,0))","v":0},null,{"$f":"IF($K10=\"\",0,VLOOKUP($K10,Course,3))","v":99},{"$f":"IF($K10=\"\",0,VLOOKUP($K10,Course,4))","v":99},{"$f":"IF($AN10=\"\",0,VLOOKUP($AN10,Race,2))","v":1},{"$f":"IF($AN10=\"\",0,VLOOKUP($AN10,Race,3))","v":50},{"$f":"IF($AN10=\"\",0,VLOOKUP($AN10,Race,4))","v":1},{"$f":"IF($AN10=\"\",0,VLOOKUP($AN10,Race,5))","v":50},{"$f":"WEEKDAY(AM10)","v":6},{"$f":"IF($AY10=1,5,\"\")","v":""},{"$f":"IF($AZ10=1,($I10*$BI10),\"\")","v":""},{"$f":"IF($BG10=1,($J10*$BK10),\"\")","v":""}]
["27/05/2016 17:09:57: [G_Auto] :  £ 5.00 Back bet placed on Constantino at 9.2. Fully matched at 9.2.  Ref: 10024","17:18:30","Hayd 27th May - 17:10 1m Hcap","Constantino",41,0,null,13,9.2,{"$f":"IF(C11=C10,J10+1,3)","v":3},{"$f":"IF(C11=\"\",\"\",LEFT(C11,5))","v":"Hayd"},{"$f":"IF($K11=\"\",0,VLOOKUP($K11,Course,2))","v":"Haydock"},{"$f":"IF(ISERROR(SEARCH(\"Charity\",$C11)),\"\",\"Charity\")","v":""},{"$f":"IF(ISERROR(SEARCH(\"PA\",$C11)),\"\",\"PA\")","v":""},{"$f":"IF(ISERROR(SEARCH(\"Class\",$C11)),\"\",\"Class\")","v":""},{"$f":"IF(ISERROR(SEARCH(\"Listed\",$C11)),\"\",\"Listed\")","v":""},{"$f":"IF(ISERROR(SEARCH(\"Grd1\",$C11)),\"\",\"Grd1\")","v":""},{"$f":"IF(ISERROR(SEARCH(\"Grd2\",$C11)),\"\",\"Grd2\")","v":""},{"$f":"IF(ISERROR(SEARCH(\"Grd3\",$C11)),\"\",\"Grd3\")","v":""},{"$f":"IF(ISERROR(SEARCH(\"Grp1\",$C11)),\"\",\"Grp1\")","v":""},{"$f":"IF(ISERROR(SEARCH(\"Grp2\",$C11)),\"\",\"Grp2\")","v":""},{"$f":"IF(ISERROR(SEARCH(\"Grp3\",$C11)),\"\",\"Grp3\")","v":""},{"$f":"IF(ISERROR(SEARCH(\"Grp 3\",$C11)),\"\",\"Grp3\")","v":""},{"$f":"IF(ISERROR(SEARCH(\"Nov\",$C11)),\"\",\"Nov\")","v":""},{"$f":"IF(ISERROR(SEARCH(\"App\",$C11)),\"\",\"App\")","v":""},{"$f":"IF(ISERROR(SEARCH(\"Sell\",$C11)),\"\",\"Sell\")","v":""},{"$f":"IF(ISERROR(SEARCH(\"Mdn\",$C11)),\"\",\"Mdn\")","v":""},{"$f":"IF(ISERROR(SEARCH(\"Beg\",$C11)),\"\",\"Beg\")","v":""},{"$f":"IF(ISERROR(SEARCH(\"Claim\",$C11)),\"\",\"Claim\")","v":""},{"$f":"IF(ISERROR(SEARCH(\"Hunt\",$C11)),\"\",\"Hunt\")","v":""},{"$f":"IF(ISERROR(SEARCH(\"Hcap\",$C11)),\"\",\"Hcap\")","v":"Hcap"},{"$f":"IF(ISERROR(SEARCH(\"Cond\",$C11)),\"\",\"Cond\")","v":""},{"$f":"IF(ISERROR(SEARCH(\"XC\",$C11)),\"\",\"XC\")","v":""},{"$f":"IF(ISERROR(SEARCH(\"Stks\",$C11)),\"\",\"Stks\")","v":""},{"$f":"IF(ISERROR(SEARCH(\"Hrd\",$C11)),\"\",\"Hrd\")","v":""},{"$f":"IF(ISERROR(SEARCH(\"Chs\",$C11)),\"\",\"Chs\")","v":""},{"$f":"IF(ISERROR(SEARCH(\" NHF\",$C11)),\"\",\"NHF\")","v":""},{"$f":"IF(ISERROR(SEARCH(\"INHF\",$C11)),\"\",\"INHF\")","v":""},{"$f":"LEFT(A11,10)","v":"27/05/2016"},{"$f":"CONCATENATE(M11,N11,O11,P11,Q11,R11,S11,T11,U11,V11,W11,X11,Y11,Z11,AB11,AA11,AC11,AD11,AE11,AF11,AG11,AH11,AK11,AL11,AI11,AJ11)","v":"Hcap"},{"$f":"IF($AN11=\"\",0,VLOOKUP($AN11,Race,1))","v":"Hcap"},{"$f":"IF($AN11<>$AO11,1,\"\")","v":""},null,{"$f":"IF($I11=\"\",0,IF($I11<Tables!$T$2,0,1))","v":1},{"$f":"IF($I11=\"\",0,IF($I11>Tables!$U$2,0,1))","v":1},{"$f":"IF($I11=\"\",0,IF($H11<VLOOKUP($K11,Course,3),0,1))","v":1},{"$f":"IF($I11=\"\",0,IF($H11>VLOOKUP($K11,Course,4),0,1))","v":1},{"$f":"IF($AN11=\"\",0,IF($H11<VLOOKUP($AN11,Race,2),0,1))","v":1},{"$f":"IF($AN11=\"\",0,IF($H11>VLOOKUP($AN11,Race,3),0,1))","v":1},{"$f":"IF($J11=\"\",0,VLOOKUP($J11,Selection,2))","v":1},{"$f":"IF(E11=0,0,IF(SUM(AR11:AX11)=$AY$1,1,0))","v":1},{"$f":"IF($AY11<>1,0,IF($G11=1,1,0))","v":0},null,{"$f":"IF($K11=\"\",0,VLOOKUP($K11,Course,3))","v":10},{"$f":"IF($K11=\"\",0,VLOOKUP($K11,Course,4))","v":13},{"$f":"IF($AN11=\"\",0,VLOOKUP($AN11,Race,2))","v":1},{"$f":"IF($AN11=\"\",0,VLOOKUP($AN11,Race,3))","v":50},{"$f":"IF($AN11=\"\",0,VLOOKUP($AN11,Race,4))","v":1},{"$f":"IF($AN11=\"\",0,VLOOKUP($AN11,Race,5))","v":50},{"$f":"WEEKDAY(AM11)","v":6},{"$f":"IF($AY11=1,5,\"\")","v":5},{"$f":"IF($AZ11=1,($I11*$BI11),\"\")","v":""},{"$f":"IF($BG11=1,($J11*$BK11),\"\")","v":""}]
["27/05/2016 17:19:59: [G_Auto] :  £ 5.00 Back bet placed on Harry Bosch at 6. Fully matched at 6.  Ref: 10026","17:24:24","Brig 27th May - 17:20 7f Hcap","Harry Bosch",25,0,null,9,6,{"$f":"IF(C12=C11,J11+1,3)","v":3},{"$f":"IF(C12=\"\",\"\",LEFT(C12,5))","v":"Brig"},{"$f":"IF($K12=\"\",0,VLOOKUP($K12,Course,2))","v":"Brighton"},{"$f":"IF(ISERROR(SEARCH(\"Charity\",$C12)),\"\",\"Charity\")","v":""},{"$f":"IF(ISERROR(SEARCH(\"PA\",$C12)),\"\",\"PA\")","v":""},{"$f":"IF(ISERROR(SEARCH(\"Class\",$C12)),\"\",\"Class\")","v":""},{"$f":"IF(ISERROR(SEARCH(\"Listed\",$C12)),\"\",\"Listed\")","v":""},{"$f":"IF(ISERROR(SEARCH(\"Grd1\",$C12)),\"\",\"Grd1\")","v":""},{"$f":"IF(ISERROR(SEARCH(\"Grd2\",$C12)),\"\",\"Grd2\")","v":""},{"$f":"IF(ISERROR(SEARCH(\"Grd3\",$C12)),\"\",\"Grd3\")","v":""},{"$f":"IF(ISERROR(SEARCH(\"Grp1\",$C12)),\"\",\"Grp1\")","v":""},{"$f":"IF(ISERROR(SEARCH(\"Grp2\",$C12)),\"\",\"Grp2\")","v":""},{"$f":"IF(ISERROR(SEARCH(\"Grp3\",$C12)),\"\",\"Grp3\")","v":""},{"$f":"IF(ISERROR(SEARCH(\"Grp 3\",$C12)),\"\",\"Grp3\")","v":""},{"$f":"IF(ISERROR(SEARCH(\"Nov\",$C12)),\"\",\"Nov\")","v":""},{"$f":"IF(ISERROR(SEARCH(\"App\",$C12)),\"\",\"App\")","v":""},{"$f":"IF(ISERROR(SEARCH(\"Sell\",$C12)),\"\",\"Sell\")","v":""},{"$f":"IF(ISERROR(SEARCH(\"Mdn\",$C12)),\"\",\"Mdn\")","v":""},{"$f":"IF(ISERROR(SEARCH(\"Beg\",$C12)),\"\",\"Beg\")","v":""},{"$f":"IF(ISERROR(SEARCH(\"Claim\",$C12)),\"\",\"Claim\")","v":""},{"$f":"IF(ISERROR(SEARCH(\"Hunt\",$C12)),\"\",\"Hunt\")","v":""},{"$f":"IF(ISERROR(SEARCH(\"Hcap\",$C12)),\"\",\"Hcap\")","v":"Hcap"},{"$f":"IF(ISERROR(SEARCH(\"Cond\",$C12)),\"\",\"Cond\")","v":""},{"$f":"IF(ISERROR(SEARCH(\"XC\",$C12)),\"\",\"XC\")","v":""},{"$f":"IF(ISERROR(SEARCH(\"Stks\",$C12)),\"\",\"Stks\")","v":""},{"$f":"IF(ISERROR(SEARCH(\"Hrd\",$C12)),\"\",\"Hrd\")","v":""},{"$f":"IF(ISERROR(SEARCH(\"Chs\",$C12)),\"\",\"Chs\")","v":""},{"$f":"IF(ISERROR(SEARCH(\" NHF\",$C12)),\"\",\"NHF\")","v":""},{"$f":"IF(ISERROR(SEARCH(\"INHF\",$C12)),\"\",\"INHF\")","v":""},{"$f":"LEFT(A12,10)","v":"27/05/2016"},{"$f":"CONCATENATE(M12,N12,O12,P12,Q12,R12,S12,T12,U12,V12,W12,X12,Y12,Z12,AB12,AA12,AC12,AD12,AE12,AF12,AG12,AH12,AK12,AL12,AI12,AJ12)","v":"Hcap"},{"$f":"IF($AN12=\"\",0,VLOOKUP($AN12,Race,1))","v":"Hcap"},{"$f":"IF($AN12<>$AO12,1,\"\")","v":""},null,{"$f":"IF($I12=\"\",0,IF($I12<Tables!$T$2,0,1))","v":1},{"$f":"IF($I12=\"\",0,IF($I12>Tables!$U$2,0,1))","v":1},{"$f":"IF($I12=\"\",0,IF($H12<VLOOKUP($K12,Course,3),0,1))","v":0},{"$f":"IF($I12=\"\",0,IF($H12>VLOOKUP($K12,Course,4),0,1))","v":1},{"$f":"IF($AN12=\"\",0,IF($H12<VLOOKUP($AN12,Race,2),0,1))","v":1},{"$f":"IF($AN12=\"\",0,IF($H12>VLOOKUP($AN12,Race,3),0,1))","v":1},{"$f":"IF($J12=\"\",0,VLOOKUP($J12,Selection,2))","v":1},{"$f":"IF(E12=0,0,IF(SUM(AR12:AX12)=$AY$1,1,0))","v":0},{"$f":"IF($AY12<>1,0,IF($G12=1,1,0))","v":0},null,{"$f":"IF($K12=\"\",0,VLOOKUP($K12,Course,3))","v":99},{"$f":"IF($K12=\"\",0,VLOOKUP($K12,Course,4))","v":99},{"$f":"IF($AN12=\"\",0,VLOOKUP($AN12,Race,2))","v":1},{"$f":"IF($AN12=\"\",0,VLOOKUP($AN12,Race,3))","v":50},{"$f":"IF($AN12=\"\",0,VLOOKUP($AN12,Race,4))","v":1},{"$f":"IF($AN12=\"\",0,VLOOKUP($AN12,Race,5))","v":50},{"$f":"WEEKDAY(AM12)","v":6},{"$f":"IF($AY12=1,5,\"\")","v":""},{"$f":"IF($AZ12=1,($I12*$BI12),\"\")","v":""},{"$f":"IF($BG12=1,($J12*$BK12),\"\")","v":""}]
["27/05/2016 17:44:57: [G_Auto] :  £ 5.00 Back bet placed on Darrell Rivers at 6. Fully matched at 6.  Ref: 10029","17:48:54","Hayd 27th May - 17:45 7f Hcap","Darrell Rivers",25,0,null,20,6,{"$f":"IF(C13=C12,J12+1,3)","v":3},{"$f":"IF(C13=\"\",\"\",LEFT(C13,5))","v":"Hayd"},{"$f":"IF($K13=\"\",0,VLOOKUP($K13,Course,2))","v":"Haydock"},{"$f":"IF(ISERROR(SEARCH(\"Charity\",$C13)),\"\",\"Charity\")","v":""},{"$f":"IF(ISERROR(SEARCH(\"PA\",$C13)),\"\",\"PA\")","v":""},{"$f":"IF(ISERROR(SEARCH(\"Class\",$C13)),\"\",\"Class\")","v":""},{"$f":"IF(ISERROR(SEARCH(\"Listed\",$C13)),\"\",\"Listed\")","v":""},{"$f":"IF(ISERROR(SEARCH(\"Grd1\",$C13)),\"\",\"Grd1\")","v":""},{"$f":"IF(ISERROR(SEARCH(\"Grd2\",$C13)),\"\",\"Grd2\")","v":""},{"$f":"IF(ISERROR(SEARCH(\"Grd3\",$C13)),\"\",\"Grd3\")","v":""},{"$f":"IF(ISERROR(SEARCH(\"Grp1\",$C13)),\"\",\"Grp1\")","v":""},{"$f":"IF(ISERROR(SEARCH(\"Grp2\",$C13)),\"\",\"Grp2\")","v":""},{"$f":"IF(ISERROR(SEARCH(\"Grp3\",$C13)),\"\",\"Grp3\")","v":""},{"$f":"IF(ISERROR(SEARCH(\"Grp 3\",$C13)),\"\",\"Grp3\")","v":""},{"$f":"IF(ISERROR(SEARCH(\"Nov\",$C13)),\"\",\"Nov\")","v":""},{"$f":"IF(ISERROR(SEARCH(\"App\",$C13)),\"\",\"App\")","v":""},{"$f":"IF(ISERROR(SEARCH(\"Sell\",$C13)),\"\",\"Sell\")","v":""},{"$f":"IF(ISERROR(SEARCH(\"Mdn\",$C13)),\"\",\"Mdn\")","v":""},{"$f":"IF(ISERROR(SEARCH(\"Beg\",$C13)),\"\",\"Beg\")","v":""},{"$f":"IF(ISERROR(SEARCH(\"Claim\",$C13)),\"\",\"Claim\")","v":""},{"$f":"IF(ISERROR(SEARCH(\"Hunt\",$C13)),\"\",\"Hunt\")","v":""},{"$f":"IF(ISERROR(SEARCH(\"Hcap\",$C13)),\"\",\"Hcap\")","v":"Hcap"},{"$f":"IF(ISERROR(SEARCH(\"Cond\",$C13)),\"\",\"Cond\")","v":""},{"$f":"IF(ISERROR(SEARCH(\"XC\",$C13)),\"\",\"XC\")","v":""},{"$f":"IF(ISERROR(SEARCH(\"Stks\",$C13)),\"\",\"Stks\")","v":""},{"$f":"IF(ISERROR(SEARCH(\"Hrd\",$C13)),\"\",\"Hrd\")","v":""},{"$f":"IF(ISERROR(SEARCH(\"Chs\",$C13)),\"\",\"Chs\")","v":""},{"$f":"IF(ISERROR(SEARCH(\" NHF\",$C13)),\"\",\"NHF\")","v":""},{"$f":"IF(ISERROR(SEARCH(\"INHF\",$C13)),\"\",\"INHF\")","v":""},{"$f":"LEFT(A13,10)","v":"27/05/2016"},{"$f":"CONCATENATE(M13,N13,O13,P13,Q13,R13,S13,T13,U13,V13,W13,X13,Y13,Z13,AB13,AA13,AC13,AD13,AE13,AF13,AG13,AH13,AK13,AL13,AI13,AJ13)","v":"Hcap"},{"$f":"IF($AN13=\"\",0,VLOOKUP($AN13,Race,1))","v":"Hcap"},{"$f":"IF($AN13<>$AO13,1,\"\")","v":""},null,{"$f":"IF($I13=\"\",0,IF($I13<Tables!$T$2,0,1))","v":1},{"$f":"IF($I13=\"\",0,IF($I13>Tables!$U$2,0,1))","v":1},{"$f":"IF($I13=\"\",0,IF($H13<VLOOKUP($K13,Course,3),0,1))","v":1},{"$f":"IF($I13=\"\",0,IF($H13>VLOOKUP($K13,Course,4),0,1))","v":0},{"$f":"IF($AN13=\"\",0,IF($H13<VLOOKUP($AN13,Race,2),0,1))","v":1},{"$f":"IF($AN13=\"\",0,IF($H13>VLOOKUP($AN13,Race,3),0,1))","v":1},{"$f":"IF($J13=\"\",0,VLOOKUP($J13,Selection,2))","v":1},{"$f":"IF(E13=0,0,IF(SUM(AR13:AX13)=$AY$1,1,0))","v":0},{"$f":"IF($AY13<>1,0,IF($G13=1,1,0))","v":0},null,{"$f":"IF($K13=\"\",0,VLOOKUP($K13,Course,3))","v":10},{"$f":"IF($K13=\"\",0,VLOOKUP($K13,Course,4))","v":13},{"$f":"IF($AN13=\"\",0,VLOOKUP($AN13,Race,2))","v":1},{"$f":"IF($AN13=\"\",0,VLOOKUP($AN13,Race,3))","v":50},{"$f":"IF($AN13=\"\",0,VLOOKUP($AN13,Race,4))","v":1},{"$f":"IF($AN13=\"\",0,VLOOKUP($AN13,Race,5))","v":50},{"$f":"WEEKDAY(AM13)","v":6},{"$f":"IF($AY13=1,5,\"\")","v":""},{"$f":"IF($AZ13=1,($I13*$BI13),\"\")","v":""},{"$f":"IF($BG13=1,($J13*$BK13),\"\")","v":""}]
["27/05/2016 17:49:52: [G_Auto] :  £ 5.00 Back bet placed on West End at 6.6. Fully matched at 6.6.  Ref: 10030","17:59:31","Worc 27th May - 17:50 2m7f Hunt Chs","West End",28,0,1,9,6.6,{"$f":"IF(C14=C13,J13+1,3)","v":3},{"$f":"IF(C14=\"\",\"\",LEFT(C14,5))","v":"Worc"},{"$f":"IF($K14=\"\",0,VLOOKUP($K14,Course,2))","v":"Worcester"},{"$f":"IF(ISERROR(SEARCH(\"Charity\",$C14)),\"\",\"Charity\")","v":""},{"$f":"IF(ISERROR(SEARCH(\"PA\",$C14)),\"\",\"PA\")","v":""},{"$f":"IF(ISERROR(SEARCH(\"Class\",$C14)),\"\",\"Class\")","v":""},{"$f":"IF(ISERROR(SEARCH(\"Listed\",$C14)),\"\",\"Listed\")","v":""},{"$f":"IF(ISERROR(SEARCH(\"Grd1\",$C14)),\"\",\"Grd1\")","v":""},{"$f":"IF(ISERROR(SEARCH(\"Grd2\",$C14)),\"\",\"Grd2\")","v":""},{"$f":"IF(ISERROR(SEARCH(\"Grd3\",$C14)),\"\",\"Grd3\")","v":""},{"$f":"IF(ISERROR(SEARCH(\"Grp1\",$C14)),\"\",\"Grp1\")","v":""},{"$f":"IF(ISERROR(SEARCH(\"Grp2\",$C14)),\"\",\"Grp2\")","v":""},{"$f":"IF(ISERROR(SEARCH(\"Grp3\",$C14)),\"\",\"Grp3\")","v":""},{"$f":"IF(ISERROR(SEARCH(\"Grp 3\",$C14)),\"\",\"Grp3\")","v":""},{"$f":"IF(ISERROR(SEARCH(\"Nov\",$C14)),\"\",\"Nov\")","v":""},{"$f":"IF(ISERROR(SEARCH(\"App\",$C14)),\"\",\"App\")","v":""},{"$f":"IF(ISERROR(SEARCH(\"Sell\",$C14)),\"\",\"Sell\")","v":""},{"$f":"IF(ISERROR(SEARCH(\"Mdn\",$C14)),\"\",\"Mdn\")","v":""},{"$f":"IF(ISERROR(SEARCH(\"Beg\",$C14)),\"\",\"Beg\")","v":""},{"$f":"IF(ISERROR(SEARCH(\"Claim\",$C14)),\"\",\"Claim\")","v":""},{"$f":"IF(ISERROR(SEARCH(\"Hunt\",$C14)),\"\",\"Hunt\")","v":"Hunt"},{"$f":"IF(ISERROR(SEARCH(\"Hcap\",$C14)),\"\",\"Hcap\")","v":""},{"$f":"IF(ISERROR(SEARCH(\"Cond\",$C14)),\"\",\"Cond\")","v":""},{"$f":"IF(ISERROR(SEARCH(\"XC\",$C14)),\"\",\"XC\")","v":""},{"$f":"IF(ISERROR(SEARCH(\"Stks\",$C14)),\"\",\"Stks\")","v":""},{"$f":"IF(ISERROR(SEARCH(\"Hrd\",$C14)),\"\",\"Hrd\")","v":""},{"$f":"IF(ISERROR(SEARCH(\"Chs\",$C14)),\"\",\"Chs\")","v":"Chs"},{"$f":"IF(ISERROR(SEARCH(\" NHF\",$C14)),\"\",\"NHF\")","v":""},{"$f":"IF(ISERROR(SEARCH(\"INHF\",$C14)),\"\",\"INHF\")","v":""},{"$f":"LEFT(A14,10)","v":"27/05/2016"},{"$f":"CONCATENATE(M14,N14,O14,P14,Q14,R14,S14,T14,U14,V14,W14,X14,Y14,Z14,AB14,AA14,AC14,AD14,AE14,AF14,AG14,AH14,AK14,AL14,AI14,AJ14)","v":"HuntChs"},{"$f":"IF($AN14=\"\",0,VLOOKUP($AN14,Race,1))","v":"HuntChs"},{"$f":"IF($AN14<>$AO14,1,\"\")","v":""},null,{"$f":"IF($I14=\"\",0,IF($I14<Tables!$T$2,0,1))","v":1},{"$f":"IF($I14=\"\",0,IF($I14>Tables!$U$2,0,1))","v":1},{"$f":"IF($I14=\"\",0,IF($H14<VLOOKUP($K14,Course,3),0,1))","v":1},{"$f":"IF($I14=\"\",0,IF($H14>VLOOKUP($K14,Course,4),0,1))","v":1},{"$f":"IF($AN14=\"\",0,IF($H14<VLOOKUP($AN14,Race,2),0,1))","v":1},{"$f":"IF($AN14=\"\",0,IF($H14>VLOOKUP($AN14,Race,3),0,1))","v":1},{"$f":"IF($J14=\"\",0,VLOOKUP($J14,Selection,2))","v":1},{"$f":"IF(E14=0,0,IF(SUM(AR14:AX14)=$AY$1,1,0))","v":1},{"$f":"IF($AY14<>1,0,IF($G14=1,1,0))","v":1},null,{"$f":"IF($K14=\"\",0,VLOOKUP($K14,Course,3))","v":7},{"$f":"IF($K14=\"\",0,VLOOKUP($K14,Course,4))","v":9},{"$f":"IF($AN14=\"\",0,VLOOKUP($AN14,Race,2))","v":1},{"$f":"IF($AN14=\"\",0,VLOOKUP($AN14,Race,3))","v":50},{"$f":"IF($AN14=\"\",0,VLOOKUP($AN14,Race,4))","v":1},{"$f":"IF($AN14=\"\",0,VLOOKUP($AN14,Race,5))","v":50},{"$f":"WEEKDAY(AM14)","v":6},{"$f":"IF($AY14=1,5,\"\")","v":5},{"$f":"IF($AZ14=1,($I14*$BI14),\"\")","v":33},{"$f":"IF($BG14=1,($J14*$BK14),\"\")","v":""}]
["27/05/2016 18:04:54: [G_Auto] :  £ 5.00 Back bet placed on Ardview Boy at 8.6. Fully matched at 8.6.  Ref: 10033","18:13:28","DownR 27th May - 18:05 2m Hcap Hrd","Ardview Boy",38,0,null,9,8.6,{"$f":"IF(C15=C14,J14+1,3)","v":3},{"$f":"IF(C15=\"\",\"\",LEFT(C15,5))","v":"DownR"},{"$f":"IF($K15=\"\",0,VLOOKUP($K15,Course,2))","v":"Down Royal"},{"$f":"IF(ISERROR(SEARCH(\"Charity\",$C15)),\"\",\"Charity\")","v":""},{"$f":"IF(ISERROR(SEARCH(\"PA\",$C15)),\"\",\"PA\")","v":""},{"$f":"IF(ISERROR(SEARCH(\"Class\",$C15)),\"\",\"Class\")","v":""},{"$f":"IF(ISERROR(SEARCH(\"Listed\",$C15)),\"\",\"Listed\")","v":""},{"$f":"IF(ISERROR(SEARCH(\"Grd1\",$C15)),\"\",\"Grd1\")","v":""},{"$f":"IF(ISERROR(SEARCH(\"Grd2\",$C15)),\"\",\"Grd2\")","v":""},{"$f":"IF(ISERROR(SEARCH(\"Grd3\",$C15)),\"\",\"Grd3\")","v":""},{"$f":"IF(ISERROR(SEARCH(\"Grp1\",$C15)),\"\",\"Grp1\")","v":""},{"$f":"IF(ISERROR(SEARCH(\"Grp2\",$C15)),\"\",\"Grp2\")","v":""},{"$f":"IF(ISERROR(SEARCH(\"Grp3\",$C15)),\"\",\"Grp3\")","v":""},{"$f":"IF(ISERROR(SEARCH(\"Grp 3\",$C15)),\"\",\"Grp3\")","v":""},{"$f":"IF(ISERROR(SEARCH(\"Nov\",$C15)),\"\",\"Nov\")","v":""},{"$f":"IF(ISERROR(SEARCH(\"App\",$C15)),\"\",\"App\")","v":""},{"$f":"IF(ISERROR(SEARCH(\"Sell\",$C15)),\"\",\"Sell\")","v":""},{"$f":"IF(ISERROR(SEARCH(\"Mdn\",$C15)),\"\",\"Mdn\")","v":""},{"$f":"IF(ISERROR(SEARCH(\"Beg\",$C15)),\"\",\"Beg\")","v":""},{"$f":"IF(ISERROR(SEARCH(\"Claim\",$C15)),\"\",\"Claim\")","v":""},{"$f":"IF(ISERROR(SEARCH(\"Hunt\",$C15)),\"\",\"Hunt\")","v":""},{"$f":"IF(ISERROR(SEARCH(\"Hcap\",$C15)),\"\",\"Hcap\")","v":"Hcap"},{"$f":"IF(ISERROR(SEARCH(\"Cond\",$C15)),\"\",\"Cond\")","v":""},{"$f":"IF(ISERROR(SEARCH(\"XC\",$C15)),\"\",\"XC\")","v":""},{"$f":"IF(ISERROR(SEARCH(\"Stks\",$C15)),\"\",\"Stks\")","v":""},{"$f":"IF(ISERROR(SEARCH(\"Hrd\",$C15)),\"\",\"Hrd\")","v":"Hrd"},{"$f":"IF(ISERROR(SEARCH(\"Chs\",$C15)),\"\",\"Chs\")","v":""},{"$f":"IF(ISERROR(SEARCH(\" NHF\",$C15)),\"\",\"NHF\")","v":""},{"$f":"IF(ISERROR(SEARCH(\"INHF\",$C15)),\"\",\"INHF\")","v":""},{"$f":"LEFT(A15,10)","v":"27/05/2016"},{"$f":"CONCATENATE(M15,N15,O15,P15,Q15,R15,S15,T15,U15,V15,W15,X15,Y15,Z15,AB15,AA15,AC15,AD15,AE15,AF15,AG15,AH15,AK15,AL15,AI15,AJ15)","v":"HcapHrd"},{"$f":"IF($AN15=\"\",0,VLOOKUP($AN15,Race,1))","v":"HcapHrd"},{"$f":"IF($AN15<>$AO15,1,\"\")","v":""},null,{"$f":"IF($I15=\"\",0,IF($I15<Tables!$T$2,0,1))","v":1},{"$f":"IF($I15=\"\",0,IF($I15>Tables!$U$2,0,1))","v":1},{"$f":"IF($I15=\"\",0,IF($H15<VLOOKUP($K15,Course,3),0,1))","v":0},{"$f":"IF($I15=\"\",0,IF($H15>VLOOKUP($K15,Course,4),0,1))","v":1},{"$f":"IF($AN15=\"\",0,IF($H15<VLOOKUP($AN15,Race,2),0,1))","v":1},{"$f":"IF($AN15=\"\",0,IF($H15>VLOOKUP($AN15,Race,3),0,1))","v":1},{"$f":"IF($J15=\"\",0,VLOOKUP($J15,Selection,2))","v":1},{"$f":"IF(E15=0,0,IF(SUM(AR15:AX15)=$AY$1,1,0))","v":0},{"$f":"IF($AY15<>1,0,IF($G15=1,1,0))","v":0},null,{"$f":"IF($K15=\"\",0,VLOOKUP($K15,Course,3))","v":99},{"$f":"IF($K15=\"\",0,VLOOKUP($K15,Course,4))","v":99},{"$f":"IF($AN15=\"\",0,VLOOKUP($AN15,Race,2))","v":1},{"$f":"IF($AN15=\"\",0,VLOOKUP($AN15,Race,3))","v":50},{"$f":"IF($AN15=\"\",0,VLOOKUP($AN15,Race,4))","v":1},{"$f":"IF($AN15=\"\",0,VLOOKUP($AN15,Race,5))","v":50},{"$f":"WEEKDAY(AM15)","v":6},{"$f":"IF($AY15=1,5,\"\")","v":""},{"$f":"IF($AZ15=1,($I15*$BI15),\"\")","v":""},{"$f":"IF($BG15=1,($J15*$BK15),\"\")","v":""}]
["27/05/2016 18:19:53: [G_Auto] :  £ 5.00 Back bet placed on Just A Normal Day at 8.2. Fully matched at 8.2.  Ref: 10036","18:28:53","Worc 27th May - 18:20 2m7f Nov Chs","Just A Normal Day",36,0,null,4,8.2,{"$f":"IF(C16=C15,J15+1,3)","v":3},{"$f":"IF(C16=\"\",\"\",LEFT(C16,5))","v":"Worc"},{"$f":"IF($K16=\"\",0,VLOOKUP($K16,Course,2))","v":"Worcester"},{"$f":"IF(ISERROR(SEARCH(\"Charity\",$C16)),\"\",\"Charity\")","v":""},{"$f":"IF(ISERROR(SEARCH(\"PA\",$C16)),\"\",\"PA\")","v":""},{"$f":"IF(ISERROR(SEARCH(\"Class\",$C16)),\"\",\"Class\")","v":""},{"$f":"IF(ISERROR(SEARCH(\"Listed\",$C16)),\"\",\"Listed\")","v":""},{"$f":"IF(ISERROR(SEARCH(\"Grd1\",$C16)),\"\",\"Grd1\")","v":""},{"$f":"IF(ISERROR(SEARCH(\"Grd2\",$C16)),\"\",\"Grd2\")","v":""},{"$f":"IF(ISERROR(SEARCH(\"Grd3\",$C16)),\"\",\"Grd3\")","v":""},{"$f":"IF(ISERROR(SEARCH(\"Grp1\",$C16)),\"\",\"Grp1\")","v":""},{"$f":"IF(ISERROR(SEARCH(\"Grp2\",$C16)),\"\",\"Grp2\")","v":""},{"$f":"IF(ISERROR(SEARCH(\"Grp3\",$C16)),\"\",\"Grp3\")","v":""},{"$f":"IF(ISERROR(SEARCH(\"Grp 3\",$C16)),\"\",\"Grp3\")","v":""},{"$f":"IF(ISERROR(SEARCH(\"Nov\",$C16)),\"\",\"Nov\")","v":"Nov"},{"$f":"IF(ISERROR(SEARCH(\"App\",$C16)),\"\",\"App\")","v":""},{"$f":"IF(ISERROR(SEARCH(\"Sell\",$C16)),\"\",\"Sell\")","v":""},{"$f":"IF(ISERROR(SEARCH(\"Mdn\",$C16)),\"\",\"Mdn\")","v":""},{"$f":"IF(ISERROR(SEARCH(\"Beg\",$C16)),\"\",\"Beg\")","v":""},{"$f":"IF(ISERROR(SEARCH(\"Claim\",$C16)),\"\",\"Claim\")","v":""},{"$f":"IF(ISERROR(SEARCH(\"Hunt\",$C16)),\"\",\"Hunt\")","v":""},{"$f":"IF(ISERROR(SEARCH(\"Hcap\",$C16)),\"\",\"Hcap\")","v":""},{"$f":"IF(ISERROR(SEARCH(\"Cond\",$C16)),\"\",\"Cond\")","v":""},{"$f":"IF(ISERROR(SEARCH(\"XC\",$C16)),\"\",\"XC\")","v":""},{"$f":"IF(ISERROR(SEARCH(\"Stks\",$C16)),\"\",\"Stks\")","v":""},{"$f":"IF(ISERROR(SEARCH(\"Hrd\",$C16)),\"\",\"Hrd\")","v":""},{"$f":"IF(ISERROR(SEARCH(\"Chs\",$C16)),\"\",\"Chs\")","v":"Chs"},{"$f":"IF(ISERROR(SEARCH(\" NHF\",$C16)),\"\",\"NHF\")","v":""},{"$f":"IF(ISERROR(SEARCH(\"INHF\",$C16)),\"\",\"INHF\")","v":""},{"$f":"LEFT(A16,10)","v":"27/05/2016"},{"$f":"CONCATENATE(M16,N16,O16,P16,Q16,R16,S16,T16,U16,V16,W16,X16,Y16,Z16,AB16,AA16,AC16,AD16,AE16,AF16,AG16,AH16,AK16,AL16,AI16,AJ16)","v":"NovChs"},{"$f":"IF($AN16=\"\",0,VLOOKUP($AN16,Race,1))","v":"NovChs"},{"$f":"IF($AN16<>$AO16,1,\"\")","v":""},null,{"$f":"IF($I16=\"\",0,IF($I16<Tables!$T$2,0,1))","v":1},{"$f":"IF($I16=\"\",0,IF($I16>Tables!$U$2,0,1))","v":1},{"$f":"IF($I16=\"\",0,IF($H16<VLOOKUP($K16,Course,3),0,1))","v":0},{"$f":"IF($I16=\"\",0,IF($H16>VLOOKUP($K16,Course,4),0,1))","v":1},{"$f":"IF($AN16=\"\",0,IF($H16<VLOOKUP($AN16,Race,2),0,1))","v":1},{"$f":"IF($AN16=\"\",0,IF($H16>VLOOKUP($AN16,Race,3),0,1))","v":1},{"$f":"IF($J16=\"\",0,VLOOKUP($J16,Selection,2))","v":1},{"$f":"IF(E16=0,0,IF(SUM(AR16:AX16)=$AY$1,1,0))","v":0},{"$f":"IF($AY16<>1,0,IF($G16=1,1,0))","v":0},null,{"$f":"IF($K16=\"\",0,VLOOKUP($K16,Course,3))","v":7},{"$f":"IF($K16=\"\",0,VLOOKUP($K16,Course,4))","v":9},{"$f":"IF($AN16=\"\",0,VLOOKUP($AN16,Race,2))","v":1},{"$f":"IF($AN16=\"\",0,VLOOKUP($AN16,Race,3))","v":50},{"$f":"IF($AN16=\"\",0,VLOOKUP($AN16,Race,4))","v":1},{"$f":"IF($AN16=\"\",0,VLOOKUP($AN16,Race,5))","v":50},{"$f":"WEEKDAY(AM16)","v":6},{"$f":"IF($AY16=1,5,\"\")","v":""},{"$f":"IF($AZ16=1,($I16*$BI16),\"\")","v":""},{"$f":"IF($BG16=1,($J16*$BK16),\"\")","v":""}]
["27/05/2016 18:29:54: [G_Auto] :  £ 5.00 Back bet placed on Janaab at 6.6. Fully matched at 6.6.  Ref: 10038","18:35:29","Ponte 27th May - 18:30 1m Hcap","Janaab",28,0,null,11,6.6,{"$f":"IF(C17=C16,J16+1,3)","v":3},{"$f":"IF(C17=\"\",\"\",LEFT(C17,5))","v":"Ponte"},{"$f":"IF($K17=\"\",0,VLOOKUP($K17,Course,2))","v":"Pontefract"},{"$f":"IF(ISERROR(SEARCH(\"Charity\",$C17)),\"\",\"Charity\")","v":""},{"$f":"IF(ISERROR(SEARCH(\"PA\",$C17)),\"\",\"PA\")","v":""},{"$f":"IF(ISERROR(SEARCH(\"Class\",$C17)),\"\",\"Class\")","v":""},{"$f":"IF(ISERROR(SEARCH(\"Listed\",$C17)),\"\",\"Listed\")","v":""},{"$f":"IF(ISERROR(SEARCH(\"Grd1\",$C17)),\"\",\"Grd1\")","v":""},{"$f":"IF(ISERROR(SEARCH(\"Grd2\",$C17)),\"\",\"Grd2\")","v":""},{"$f":"IF(ISERROR(SEARCH(\"Grd3\",$C17)),\"\",\"Grd3\")","v":""},{"$f":"IF(ISERROR(SEARCH(\"Grp1\",$C17)),\"\",\"Grp1\")","v":""},{"$f":"IF(ISERROR(SEARCH(\"Grp2\",$C17)),\"\",\"Grp2\")","v":""},{"$f":"IF(ISERROR(SEARCH(\"Grp3\",$C17)),\"\",\"Grp3\")","v":""},{"$f":"IF(ISERROR(SEARCH(\"Grp 3\",$C17)),\"\",\"Grp3\")","v":""},{"$f":"IF(ISERROR(SEARCH(\"Nov\",$C17)),\"\",\"Nov\")","v":""},{"$f":"IF(ISERROR(SEARCH(\"App\",$C17)),\"\",\"App\")","v":""},{"$f":"IF(ISERROR(SEARCH(\"Sell\",$C17)),\"\",\"Sell\")","v":""},{"$f":"IF(ISERROR(SEARCH(\"Mdn\",$C17)),\"\",\"Mdn\")","v":""},{"$f":"IF(ISERROR(SEARCH(\"Beg\",$C17)),\"\",\"Beg\")","v":""},{"$f":"IF(ISERROR(SEARCH(\"Claim\",$C17)),\"\",\"Claim\")","v":""},{"$f":"IF(ISERROR(SEARCH(\"Hunt\",$C17)),\"\",\"Hunt\")","v":""},{"$f":"IF(ISERROR(SEARCH(\"Hcap\",$C17)),\"\",\"Hcap\")","v":"Hcap"},{"$f":"IF(ISERROR(SEARCH(\"Cond\",$C17)),\"\",\"Cond\")","v":""},{"$f":"IF(ISERROR(SEARCH(\"XC\",$C17)),\"\",\"XC\")","v":""},{"$f":"IF(ISERROR(SEARCH(\"Stks\",$C17)),\"\",\"Stks\")","v":""},{"$f":"IF(ISERROR(SEARCH(\"Hrd\",$C17)),\"\",\"Hrd\")","v":""},{"$f":"IF(ISERROR(SEARCH(\"Chs\",$C17)),\"\",\"Chs\")","v":""},{"$f":"IF(ISERROR(SEARCH(\" NHF\",$C17)),\"\",\"NHF\")","v":""},{"$f":"IF(ISERROR(SEARCH(\"INHF\",$C17)),\"\",\"INHF\")","v":""},{"$f":"LEFT(A17,10)","v":"27/05/2016"},{"$f":"CONCATENATE(M17,N17,O17,P17,Q17,R17,S17,T17,U17,V17,W17,X17,Y17,Z17,AB17,AA17,AC17,AD17,AE17,AF17,AG17,AH17,AK17,AL17,AI17,AJ17)","v":"Hcap"},{"$f":"IF($AN17=\"\",0,VLOOKUP($AN17,Race,1))","v":"Hcap"},{"$f":"IF($AN17<>$AO17,1,\"\")","v":""},null,{"$f":"IF($I17=\"\",0,IF($I17<Tables!$T$2,0,1))","v":1},{"$f":"IF($I17=\"\",0,IF($I17>Tables!$U$2,0,1))","v":1},{"$f":"IF($I17=\"\",0,IF($H17<VLOOKUP($K17,Course,3),0,1))","v":0},{"$f":"IF($I17=\"\",0,IF($H17>VLOOKUP($K17,Course,4),0,1))","v":1},{"$f":"IF($AN17=\"\",0,IF($H17<VLOOKUP($AN17,Race,2),0,1))","v":1},{"$f":"IF($AN17=\"\",0,IF($H17>VLOOKUP($AN17,Race,3),0,1))","v":1},{"$f":"IF($J17=\"\",0,VLOOKUP($J17,Selection,2))","v":1},{"$f":"IF(E17=0,0,IF(SUM(AR17:AX17)=$AY$1,1,0))","v":0},{"$f":"IF($AY17<>1,0,IF($G17=1,1,0))","v":0},null,{"$f":"IF($K17=\"\",0,VLOOKUP($K17,Course,3))","v":99},{"$f":"IF($K17=\"\",0,VLOOKUP($K17,Course,4))","v":99},{"$f":"IF($AN17=\"\",0,VLOOKUP($AN17,Race,2))","v":1},{"$f":"IF($AN17=\"\",0,VLOOKUP($AN17,Race,3))","v":50},{"$f":"IF($AN17=\"\",0,VLOOKUP($AN17,Race,4))","v":1},{"$f":"IF($AN17=\"\",0,VLOOKUP($AN17,Race,5))","v":50},{"$f":"WEEKDAY(AM17)","v":6},{"$f":"IF($AY17=1,5,\"\")","v":""},{"$f":"IF($AZ17=1,($I17*$BI17),\"\")","v":""},{"$f":"IF($BG17=1,($J17*$BK17),\"\")","v":""}]
["27/05/2016 18:34:49: [G_Auto] :  £ 5.00 Back bet placed on By The Banks at 11.5. Fully matched at 11.5.  Ref: 10040","18:46:15","DownR 27th May - 18:35 2m4f Hcap Hrd","By The Banks",52.5,0,null,20,11.5,{"$f":"IF(C18=C17,J17+1,3)","v":3},{"$f":"IF(C18=\"\",\"\",LEFT(C18,5))","v":"DownR"},{"$f":"IF($K18=\"\",0,VLOOKUP($K18,Course,2))","v":"Down Royal"},{"$f":"IF(ISERROR(SEARCH(\"Charity\",$C18)),\"\",\"Charity\")","v":""},{"$f":"IF(ISERROR(SEARCH(\"PA\",$C18)),\"\",\"PA\")","v":""},{"$f":"IF(ISERROR(SEARCH(\"Class\",$C18)),\"\",\"Class\")","v":""},{"$f":"IF(ISERROR(SEARCH(\"Listed\",$C18)),\"\",\"Listed\")","v":""},{"$f":"IF(ISERROR(SEARCH(\"Grd1\",$C18)),\"\",\"Grd1\")","v":""},{"$f":"IF(ISERROR(SEARCH(\"Grd2\",$C18)),\"\",\"Grd2\")","v":""},{"$f":"IF(ISERROR(SEARCH(\"Grd3\",$C18)),\"\",\"Grd3\")","v":""},{"$f":"IF(ISERROR(SEARCH(\"Grp1\",$C18)),\"\",\"Grp1\")","v":""},{"$f":"IF(ISERROR(SEARCH(\"Grp2\",$C18)),\"\",\"Grp2\")","v":""},{"$f":"IF(ISERROR(SEARCH(\"Grp3\",$C18)),\"\",\"Grp3\")","v":""},{"$f":"IF(ISERROR(SEARCH(\"Grp 3\",$C18)),\"\",\"Grp3\")","v":""},{"$f":"IF(ISERROR(SEARCH(\"Nov\",$C18)),\"\",\"Nov\")","v":""},{"$f":"IF(ISERROR(SEARCH(\"App\",$C18)),\"\",\"App\")","v":""},{"$f":"IF(ISERROR(SEARCH(\"Sell\",$C18)),\"\",\"Sell\")","v":""},{"$f":"IF(ISERROR(SEARCH(\"Mdn\",$C18)),\"\",\"Mdn\")","v":""},{"$f":"IF(ISERROR(SEARCH(\"Beg\",$C18)),\"\",\"Beg\")","v":""},{"$f":"IF(ISERROR(SEARCH(\"Claim\",$C18)),\"\",\"Claim\")","v":""},{"$f":"IF(ISERROR(SEARCH(\"Hunt\",$C18)),\"\",\"Hunt\")","v":""},{"$f":"IF(ISERROR(SEARCH(\"Hcap\",$C18)),\"\",\"Hcap\")","v":"Hcap"},{"$f":"IF(ISERROR(SEARCH(\"Cond\",$C18)),\"\",\"Cond\")","v":""},{"$f":"IF(ISERROR(SEARCH(\"XC\",$C18)),\"\",\"XC\")","v":""},{"$f":"IF(ISERROR(SEARCH(\"Stks\",$C18)),\"\",\"Stks\")","v":""},{"$f":"IF(ISERROR(SEARCH(\"Hrd\",$C18)),\"\",\"Hrd\")","v":"Hrd"},{"$f":"IF(ISERROR(SEARCH(\"Chs\",$C18)),\"\",\"Chs\")","v":""},{"$f":"IF(ISERROR(SEARCH(\" NHF\",$C18)),\"\",\"NHF\")","v":""},{"$f":"IF(ISERROR(SEARCH(\"INHF\",$C18)),\"\",\"INHF\")","v":""},{"$f":"LEFT(A18,10)","v":"27/05/2016"},{"$f":"CONCATENATE(M18,N18,O18,P18,Q18,R18,S18,T18,U18,V18,W18,X18,Y18,Z18,AB18,AA18,AC18,AD18,AE18,AF18,AG18,AH18,AK18,AL18,AI18,AJ18)","v":"HcapHrd"},{"$f":"IF($AN18=\"\",0,VLOOKUP($AN18,Race,1))","v":"HcapHrd"},{"$f":"IF($AN18<>$AO18,1,\"\")","v":""},null,{"$f":"IF($I18=\"\",0,IF($I18<Tables!$T$2,0,1))","v":1},{"$f":"IF($I18=\"\",0,IF($I18>Tables!$U$2,0,1))","v":1},{"$f":"IF($I18=\"\",0,IF($H18<VLOOKUP($K18,Course,3),0,1))","v":0},{"$f":"IF($I18=\"\",0,IF($H18>VLOOKUP($K18,Course,4),0,1))","v":1},{"$f":"IF($AN18=\"\",0,IF($H18<VLOOKUP($AN18,Race,2),0,1))","v":1},{"$f":"IF($AN18=\"\",0,IF($H18>VLOOKUP($AN18,Race,3),0,1))","v":1},{"$f":"IF($J18=\"\",0,VLOOKUP($J18,Selection,2))","v":1},{"$f":"IF(E18=0,0,IF(SUM(AR18:AX18)=$AY$1,1,0))","v":0},{"$f":"IF($AY18<>1,0,IF($G18=1,1,0))","v":0},null,{"$f":"IF($K18=\"\",0,VLOOKUP($K18,Course,3))","v":99},{"$f":"IF($K18=\"\",0,VLOOKUP($K18,Course,4))","v":99},{"$f":"IF($AN18=\"\",0,VLOOKUP($AN18,Race,2))","v":1},{"$f":"IF($AN18=\"\",0,VLOOKUP($AN18,Race,3))","v":50},{"$f":"IF($AN18=\"\",0,VLOOKUP($AN18,Race,4))","v":1},{"$f":"IF($AN18=\"\",0,VLOOKUP($AN18,Race,5))","v":50},{"$f":"WEEKDAY(AM18)","v":6},{"$f":"IF($AY18=1,5,\"\")","v":""},{"$f":"IF($AZ18=1,($I18*$BI18),\"\")","v":""},{"$f":"IF($BG18=1,($J18*$BK18),\"\")","v":""}]
["27/05/2016 18:39:46: [G_Auto] :  £ 5.00 Back bet placed on Jammy Moment at 5.1. Fully matched at 5.1.  Ref: 10042","18:49:33","Muss 27th May - 18:40 1m4f Hcap","Jammy Moment",15.5,0,null,8,5.1,{"$f":"IF(C19=C18,J18+1,3)","v":3},{"$f":"IF(C19=\"\",\"\",LEFT(C19,5))","v":"Muss"},{"$f":"IF($K19=\"\",0,VLOOKUP($K19,Course,2))","v":"Musselburgh"},{"$f":"IF(ISERROR(SEARCH(\"Charity\",$C19)),\"\",\"Charity\")","v":""},{"$f":"IF(ISERROR(SEARCH(\"PA\",$C19)),\"\",\"PA\")","v":""},{"$f":"IF(ISERROR(SEARCH(\"Class\",$C19)),\"\",\"Class\")","v":""},{"$f":"IF(ISERROR(SEARCH(\"Listed\",$C19)),\"\",\"Listed\")","v":""},{"$f":"IF(ISERROR(SEARCH(\"Grd1\",$C19)),\"\",\"Grd1\")","v":""},{"$f":"IF(ISERROR(SEARCH(\"Grd2\",$C19)),\"\",\"Grd2\")","v":""},{"$f":"IF(ISERROR(SEARCH(\"Grd3\",$C19)),\"\",\"Grd3\")","v":""},{"$f":"IF(ISERROR(SEARCH(\"Grp1\",$C19)),\"\",\"Grp1\")","v":""},{"$f":"IF(ISERROR(SEARCH(\"Grp2\",$C19)),\"\",\"Grp2\")","v":""},{"$f":"IF(ISERROR(SEARCH(\"Grp3\",$C19)),\"\",\"Grp3\")","v":""},{"$f":"IF(ISERROR(SEARCH(\"Grp 3\",$C19)),\"\",\"Grp3\")","v":""},{"$f":"IF(ISERROR(SEARCH(\"Nov\",$C19)),\"\",\"Nov\")","v":""},{"$f":"IF(ISERROR(SEARCH(\"App\",$C19)),\"\",\"App\")","v":""},{"$f":"IF(ISERROR(SEARCH(\"Sell\",$C19)),\"\",\"Sell\")","v":""},{"$f":"IF(ISERROR(SEARCH(\"Mdn\",$C19)),\"\",\"Mdn\")","v":""},{"$f":"IF(ISERROR(SEARCH(\"Beg\",$C19)),\"\",\"Beg\")","v":""},{"$f":"IF(ISERROR(SEARCH(\"Claim\",$C19)),\"\",\"Claim\")","v":""},{"$f":"IF(ISERROR(SEARCH(\"Hunt\",$C19)),\"\",\"Hunt\")","v":""},{"$f":"IF(ISERROR(SEARCH(\"Hcap\",$C19)),\"\",\"Hcap\")","v":"Hcap"},{"$f":"IF(ISERROR(SEARCH(\"Cond\",$C19)),\"\",\"Cond\")","v":""},{"$f":"IF(ISERROR(SEARCH(\"XC\",$C19)),\"\",\"XC\")","v":""},{"$f":"IF(ISERROR(SEARCH(\"Stks\",$C19)),\"\",\"Stks\")","v":""},{"$f":"IF(ISERROR(SEARCH(\"Hrd\",$C19)),\"\",\"Hrd\")","v":""},{"$f":"IF(ISERROR(SEARCH(\"Chs\",$C19)),\"\",\"Chs\")","v":""},{"$f":"IF(ISERROR(SEARCH(\" NHF\",$C19)),\"\",\"NHF\")","v":""},{"$f":"IF(ISERROR(SEARCH(\"INHF\",$C19)),\"\",\"INHF\")","v":""},{"$f":"LEFT(A19,10)","v":"27/05/2016"},{"$f":"CONCATENATE(M19,N19,O19,P19,Q19,R19,S19,T19,U19,V19,W19,X19,Y19,Z19,AB19,AA19,AC19,AD19,AE19,AF19,AG19,AH19,AK19,AL19,AI19,AJ19)","v":"Hcap"},{"$f":"IF($AN19=\"\",0,VLOOKUP($AN19,Race,1))","v":"Hcap"},{"$f":"IF($AN19<>$AO19,1,\"\")","v":""},null,{"$f":"IF($I19=\"\",0,IF($I19<Tables!$T$2,0,1))","v":1},{"$f":"IF($I19=\"\",0,IF($I19>Tables!$U$2,0,1))","v":1},{"$f":"IF($I19=\"\",0,IF($H19<VLOOKUP($K19,Course,3),0,1))","v":1},{"$f":"IF($I19=\"\",0,IF($H19>VLOOKUP($K19,Course,4),0,1))","v":1},{"$f":"IF($AN19=\"\",0,IF($H19<VLOOKUP($AN19,Race,2),0,1))","v":1},{"$f":"IF($AN19=\"\",0,IF($H19>VLOOKUP($AN19,Race,3),0,1))","v":1},{"$f":"IF($J19=\"\",0,VLOOKUP($J19,Selection,2))","v":1},{"$f":"IF(E19=0,0,IF(SUM(AR19:AX19)=$AY$1,1,0))","v":1},{"$f":"IF($AY19<>1,0,IF($G19=1,1,0))","v":0},null,{"$f":"IF($K19=\"\",0,VLOOKUP($K19,Course,3))","v":7},{"$f":"IF($K19=\"\",0,VLOOKUP($K19,Course,4))","v":8},{"$f":"IF($AN19=\"\",0,VLOOKUP($AN19,Race,2))","v":1},{"$f":"IF($AN19=\"\",0,VLOOKUP($AN19,Race,3))","v":50},{"$f":"IF($AN19=\"\",0,VLOOKUP($AN19,Race,4))","v":1},{"$f":"IF($AN19=\"\",0,VLOOKUP($AN19,Race,5))","v":50},{"$f":"WEEKDAY(AM19)","v":6},{"$f":"IF($AY19=1,5,\"\")","v":5},{"$f":"IF($AZ19=1,($I19*$BI19),\"\")","v":""},{"$f":"IF($BG19=1,($J19*$BK19),\"\")","v":""}]
["27/05/2016 18:39:55: [G_Auto] :  £ 5.00 Back bet placed on Tourtiere at 6.6. Fully matched at 6.6.  Ref: 10044","18:49:33","Muss 27th May - 18:40 1m4f Hcap","Tourtiere",23,0,1,8,6.6,{"$f":"IF(C20=C19,J19+1,3)","v":4},{"$f":"IF(C20=\"\",\"\",LEFT(C20,5))","v":"Muss"},{"$f":"IF($K20=\"\",0,VLOOKUP($K20,Course,2))","v":"Musselburgh"},{"$f":"IF(ISERROR(SEARCH(\"Charity\",$C20)),\"\",\"Charity\")","v":""},{"$f":"IF(ISERROR(SEARCH(\"PA\",$C20)),\"\",\"PA\")","v":""},{"$f":"IF(ISERROR(SEARCH(\"Class\",$C20)),\"\",\"Class\")","v":""},{"$f":"IF(ISERROR(SEARCH(\"Listed\",$C20)),\"\",\"Listed\")","v":""},{"$f":"IF(ISERROR(SEARCH(\"Grd1\",$C20)),\"\",\"Grd1\")","v":""},{"$f":"IF(ISERROR(SEARCH(\"Grd2\",$C20)),\"\",\"Grd2\")","v":""},{"$f":"IF(ISERROR(SEARCH(\"Grd3\",$C20)),\"\",\"Grd3\")","v":""},{"$f":"IF(ISERROR(SEARCH(\"Grp1\",$C20)),\"\",\"Grp1\")","v":""},{"$f":"IF(ISERROR(SEARCH(\"Grp2\",$C20)),\"\",\"Grp2\")","v":""},{"$f":"IF(ISERROR(SEARCH(\"Grp3\",$C20)),\"\",\"Grp3\")","v":""},{"$f":"IF(ISERROR(SEARCH(\"Grp 3\",$C20)),\"\",\"Grp3\")","v":""},{"$f":"IF(ISERROR(SEARCH(\"Nov\",$C20)),\"\",\"Nov\")","v":""},{"$f":"IF(ISERROR(SEARCH(\"App\",$C20)),\"\",\"App\")","v":""},{"$f":"IF(ISERROR(SEARCH(\"Sell\",$C20)),\"\",\"Sell\")","v":""},{"$f":"IF(ISERROR(SEARCH(\"Mdn\",$C20)),\"\",\"Mdn\")","v":""},{"$f":"IF(ISERROR(SEARCH(\"Beg\",$C20)),\"\",\"Beg\")","v":""},{"$f":"IF(ISERROR(SEARCH(\"Claim\",$C20)),\"\",\"Claim\")","v":""},{"$f":"IF(ISERROR(SEARCH(\"Hunt\",$C20)),\"\",\"Hunt\")","v":""},{"$f":"IF(ISERROR(SEARCH(\"Hcap\",$C20)),\"\",\"Hcap\")","v":"Hcap"},{"$f":"IF(ISERROR(SEARCH(\"Cond\",$C20)),\"\",\"Cond\")","v":""},{"$f":"IF(ISERROR(SEARCH(\"XC\",$C20)),\"\",\"XC\")","v":""},{"$f":"IF(ISERROR(SEARCH(\"Stks\",$C20)),\"\",\"Stks\")","v":""},{"$f":"IF(ISERROR(SEARCH(\"Hrd\",$C20)),\"\",\"Hrd\")","v":""},{"$f":"IF(ISERROR(SEARCH(\"Chs\",$C20)),\"\",\"Chs\")","v":""},{"$f":"IF(ISERROR(SEARCH(\" NHF\",$C20)),\"\",\"NHF\")","v":""},{"$f":"IF(ISERROR(SEARCH(\"INHF\",$C20)),\"\",\"INHF\")","v":""},{"$f":"LEFT(A20,10)","v":"27/05/2016"},{"$f":"CONCATENATE(M20,N20,O20,P20,Q20,R20,S20,T20,U20,V20,W20,X20,Y20,Z20,AB20,AA20,AC20,AD20,AE20,AF20,AG20,AH20,AK20,AL20,AI20,AJ20)","v":"Hcap"},{"$f":"IF($AN20=\"\",0,VLOOKUP($AN20,Race,1))","v":"Hcap"},{"$f":"IF($AN20<>$AO20,1,\"\")","v":""},null,{"$f":"IF($I20=\"\",0,IF($I20<Tables!$T$2,0,1))","v":1},{"$f":"IF($I20=\"\",0,IF($I20>Tables!$U$2,0,1))","v":1},{"$f":"IF($I20=\"\",0,IF($H20<VLOOKUP($K20,Course,3),0,1))","v":1},{"$f":"IF($I20=\"\",0,IF($H20>VLOOKUP($K20,Course,4),0,1))","v":1},{"$f":"IF($AN20=\"\",0,IF($H20<VLOOKUP($AN20,Race,2),0,1))","v":1},{"$f":"IF($AN20=\"\",0,IF($H20>VLOOKUP($AN20,Race,3),0,1))","v":1},{"$f":"IF($J20=\"\",0,VLOOKUP($J20,Selection,2))","v":1},{"$f":"IF(E20=0,0,IF(SUM(AR20:AX20)=$AY$1,1,0))","v":1},{"$f":"IF($AY20<>1,0,IF($G20=1,1,0))","v":1},null,{"$f":"IF($K20=\"\",0,VLOOKUP($K20,Course,3))","v":7},{"$f":"IF($K20=\"\",0,VLOOKUP($K20,Course,4))","v":8},{"$f":"IF($AN20=\"\",0,VLOOKUP($AN20,Race,2))","v":1},{"$f":"IF($AN20=\"\",0,VLOOKUP($AN20,Race,3))","v":50},{"$f":"IF($AN20=\"\",0,VLOOKUP($AN20,Race,4))","v":1},{"$f":"IF($AN20=\"\",0,VLOOKUP($AN20,Race,5))","v":50},{"$f":"WEEKDAY(AM20)","v":6},{"$f":"IF($AY20=1,5,\"\")","v":5},{"$f":"IF($AZ20=1,($I20*$BI20),\"\")","v":33},{"$f":"IF($BG20=1,($J20*$BK20),\"\")","v":""}]
["27/05/2016 18:49:50: [G_Auto] :  £ 5.00 Back bet placed on Tara Road at 7. Fully matched at 7.  Ref: 10047","18:59:09","Worc 27th May - 18:50 2m4f Hcap Chs","Tara Road",25,0,null,9,7,{"$f":"IF(C21=C20,J20+1,3)","v":3},{"$f":"IF(C21=\"\",\"\",LEFT(C21,5))","v":"Worc"},{"$f":"IF($K21=\"\",0,VLOOKUP($K21,Course,2))","v":"Worcester"},{"$f":"IF(ISERROR(SEARCH(\"Charity\",$C21)),\"\",\"Charity\")","v":""},{"$f":"IF(ISERROR(SEARCH(\"PA\",$C21)),\"\",\"PA\")","v":""},{"$f":"IF(ISERROR(SEARCH(\"Class\",$C21)),\"\",\"Class\")","v":""},{"$f":"IF(ISERROR(SEARCH(\"Listed\",$C21)),\"\",\"Listed\")","v":""},{"$f":"IF(ISERROR(SEARCH(\"Grd1\",$C21)),\"\",\"Grd1\")","v":""},{"$f":"IF(ISERROR(SEARCH(\"Grd2\",$C21)),\"\",\"Grd2\")","v":""},{"$f":"IF(ISERROR(SEARCH(\"Grd3\",$C21)),\"\",\"Grd3\")","v":""},{"$f":"IF(ISERROR(SEARCH(\"Grp1\",$C21)),\"\",\"Grp1\")","v":""},{"$f":"IF(ISERROR(SEARCH(\"Grp2\",$C21)),\"\",\"Grp2\")","v":""},{"$f":"IF(ISERROR(SEARCH(\"Grp3\",$C21)),\"\",\"Grp3\")","v":""},{"$f":"IF(ISERROR(SEARCH(\"Grp 3\",$C21)),\"\",\"Grp3\")","v":""},{"$f":"IF(ISERROR(SEARCH(\"Nov\",$C21)),\"\",\"Nov\")","v":""},{"$f":"IF(ISERROR(SEARCH(\"App\",$C21)),\"\",\"App\")","v":""},{"$f":"IF(ISERROR(SEARCH(\"Sell\",$C21)),\"\",\"Sell\")","v":""},{"$f":"IF(ISERROR(SEARCH(\"Mdn\",$C21)),\"\",\"Mdn\")","v":""},{"$f":"IF(ISERROR(SEARCH(\"Beg\",$C21)),\"\",\"Beg\")","v":""},{"$f":"IF(ISERROR(SEARCH(\"Claim\",$C21)),\"\",\"Claim\")","v":""},{"$f":"IF(ISERROR(SEARCH(\"Hunt\",$C21)),\"\",\"Hunt\")","v":""},{"$f":"IF(ISERROR(SEARCH(\"Hcap\",$C21)),\"\",\"Hcap\")","v":"Hcap"},{"$f":"IF(ISERROR(SEARCH(\"Cond\",$C21)),\"\",\"Cond\")","v":""},{"$f":"IF(ISERROR(SEARCH(\"XC\",$C21)),\"\",\"XC\")","v":""},{"$f":"IF(ISERROR(SEARCH(\"Stks\",$C21)),\"\",\"Stks\")","v":""},{"$f":"IF(ISERROR(SEARCH(\"Hrd\",$C21)),\"\",\"Hrd\")","v":""},{"$f":"IF(ISERROR(SEARCH(\"Chs\",$C21)),\"\",\"Chs\")","v":"Chs"},{"$f":"IF(ISERROR(SEARCH(\" NHF\",$C21)),\"\",\"NHF\")","v":""},{"$f":"IF(ISERROR(SEARCH(\"INHF\",$C21)),\"\",\"INHF\")","v":""},{"$f":"LEFT(A21,10)","v":"27/05/2016"},{"$f":"CONCATENATE(M21,N21,O21,P21,Q21,R21,S21,T21,U21,V21,W21,X21,Y21,Z21,AB21,AA21,AC21,AD21,AE21,AF21,AG21,AH21,AK21,AL21,AI21,AJ21)","v":"HcapChs"},{"$f":"IF($AN21=\"\",0,VLOOKUP($AN21,Race,1))","v":"HcapChs"},{"$f":"IF($AN21<>$AO21,1,\"\")","v":""},null,{"$f":"IF($I21=\"\",0,IF($I21<Tables!$T$2,0,1))","v":1},{"$f":"IF($I21=\"\",0,IF($I21>Tables!$U$2,0,1))","v":1},{"$f":"IF($I21=\"\",0,IF($H21<VLOOKUP($K21,Course,3),0,1))","v":1},{"$f":"IF($I21=\"\",0,IF($H21>VLOOKUP($K21,Course,4),0,1))","v":1},{"$f":"IF($AN21=\"\",0,IF($H21<VLOOKUP($AN21,Race,2),0,1))","v":1},{"$f":"IF($AN21=\"\",0,IF($H21>VLOOKUP($AN21,Race,3),0,1))","v":1},{"$f":"IF($J21=\"\",0,VLOOKUP($J21,Selection,2))","v":1},{"$f":"IF(E21=0,0,IF(SUM(AR21:AX21)=$AY$1,1,0))","v":1},{"$f":"IF($AY21<>1,0,IF($G21=1,1,0))","v":0},null,{"$f":"IF($K21=\"\",0,VLOOKUP($K21,Course,3))","v":7},{"$f":"IF($K21=\"\",0,VLOOKUP($K21,Course,4))","v":9},{"$f":"IF($AN21=\"\",0,VLOOKUP($AN21,Race,2))","v":1},{"$f":"IF($AN21=\"\",0,VLOOKUP($AN21,Race,3))","v":50},{"$f":"IF($AN21=\"\",0,VLOOKUP($AN21,Race,4))","v":1},{"$f":"IF($AN21=\"\",0,VLOOKUP($AN21,Race,5))","v":50},{"$f":"WEEKDAY(AM21)","v":6},{"$f":"IF($AY21=1,5,\"\")","v":5},{"$f":"IF($AZ21=1,($I21*$BI21),\"\")","v":""},{"$f":"IF($BG21=1,($J21*$BK21),\"\")","v":""}]
["27/05/2016 18:50:00: [G_Auto] :  £ 5.00 Back bet placed on Next Sensation at 7. Fully matched at 7.  Ref: 10049","18:59:09","Worc 27th May - 18:50 2m4f Hcap Chs","Next Sensation",25,0,null,9,7,{"$f":"IF(C22=C21,J21+1,3)","v":4},{"$f":"IF(C22=\"\",\"\",LEFT(C22,5))","v":"Worc"},{"$f":"IF($K22=\"\",0,VLOOKUP($K22,Course,2))","v":"Worcester"},{"$f":"IF(ISERROR(SEARCH(\"Charity\",$C22)),\"\",\"Charity\")","v":""},{"$f":"IF(ISERROR(SEARCH(\"PA\",$C22)),\"\",\"PA\")","v":""},{"$f":"IF(ISERROR(SEARCH(\"Class\",$C22)),\"\",\"Class\")","v":""},{"$f":"IF(ISERROR(SEARCH(\"Listed\",$C22)),\"\",\"Listed\")","v":""},{"$f":"IF(ISERROR(SEARCH(\"Grd1\",$C22)),\"\",\"Grd1\")","v":""},{"$f":"IF(ISERROR(SEARCH(\"Grd2\",$C22)),\"\",\"Grd2\")","v":""},{"$f":"IF(ISERROR(SEARCH(\"Grd3\",$C22)),\"\",\"Grd3\")","v":""},{"$f":"IF(ISERROR(SEARCH(\"Grp1\",$C22)),\"\",\"Grp1\")","v":""},{"$f":"IF(ISERROR(SEARCH(\"Grp2\",$C22)),\"\",\"Grp2\")","v":""},{"$f":"IF(ISERROR(SEARCH(\"Grp3\",$C22)),\"\",\"Grp3\")","v":""},{"$f":"IF(ISERROR(SEARCH(\"Grp 3\",$C22)),\"\",\"Grp3\")","v":""},{"$f":"IF(ISERROR(SEARCH(\"Nov\",$C22)),\"\",\"Nov\")","v":""},{"$f":"IF(ISERROR(SEARCH(\"App\",$C22)),\"\",\"App\")","v":""},{"$f":"IF(ISERROR(SEARCH(\"Sell\",$C22)),\"\",\"Sell\")","v":""},{"$f":"IF(ISERROR(SEARCH(\"Mdn\",$C22)),\"\",\"Mdn\")","v":""},{"$f":"IF(ISERROR(SEARCH(\"Beg\",$C22)),\"\",\"Beg\")","v":""},{"$f":"IF(ISERROR(SEARCH(\"Claim\",$C22)),\"\",\"Claim\")","v":""},{"$f":"IF(ISERROR(SEARCH(\"Hunt\",$C22)),\"\",\"Hunt\")","v":""},{"$f":"IF(ISERROR(SEARCH(\"Hcap\",$C22)),\"\",\"Hcap\")","v":"Hcap"},{"$f":"IF(ISERROR(SEARCH(\"Cond\",$C22)),\"\",\"Cond\")","v":""},{"$f":"IF(ISERROR(SEARCH(\"XC\",$C22)),\"\",\"XC\")","v":""},{"$f":"IF(ISERROR(SEARCH(\"Stks\",$C22)),\"\",\"Stks\")","v":""},{"$f":"IF(ISERROR(SEARCH(\"Hrd\",$C22)),\"\",\"Hrd\")","v":""},{"$f":"IF(ISERROR(SEARCH(\"Chs\",$C22)),\"\",\"Chs\")","v":"Chs"},{"$f":"IF(ISERROR(SEARCH(\" NHF\",$C22)),\"\",\"NHF\")","v":""},{"$f":"IF(ISERROR(SEARCH(\"INHF\",$C22)),\"\",\"INHF\")","v":""},{"$f":"LEFT(A22,10)","v":"27/05/2016"},{"$f":"CONCATENATE(M22,N22,O22,P22,Q22,R22,S22,T22,U22,V22,W22,X22,Y22,Z22,AB22,AA22,AC22,AD22,AE22,AF22,AG22,AH22,AK22,AL22,AI22,AJ22)","v":"HcapChs"},{"$f":"IF($AN22=\"\",0,VLOOKUP($AN22,Race,1))","v":"HcapChs"},{"$f":"IF($AN22<>$AO22,1,\"\")","v":""},null,{"$f":"IF($I22=\"\",0,IF($I22<Tables!$T$2,0,1))","v":1},{"$f":"IF($I22=\"\",0,IF($I22>Tables!$U$2,0,1))","v":1},{"$f":"IF($I22=\"\",0,IF($H22<VLOOKUP($K22,Course,3),0,1))","v":1},{"$f":"IF($I22=\"\",0,IF($H22>VLOOKUP($K22,Course,4),0,1))","v":1},{"$f":"IF($AN22=\"\",0,IF($H22<VLOOKUP($AN22,Race,2),0,1))","v":1},{"$f":"IF($AN22=\"\",0,IF($H22>VLOOKUP($AN22,Race,3),0,1))","v":1},{"$f":"IF($J22=\"\",0,VLOOKUP($J22,Selection,2))","v":1},{"$f":"IF(E22=0,0,IF(SUM(AR22:AX22)=$AY$1,1,0))","v":1},{"$f":"IF($AY22<>1,0,IF($G22=1,1,0))","v":0},null,{"$f":"IF($K22=\"\",0,VLOOKUP($K22,Course,3))","v":7},{"$f":"IF($K22=\"\",0,VLOOKUP($K22,Course,4))","v":9},{"$f":"IF($AN22=\"\",0,VLOOKUP($AN22,Race,2))","v":1},{"$f":"IF($AN22=\"\",0,VLOOKUP($AN22,Race,3))","v":50},{"$f":"IF($AN22=\"\",0,VLOOKUP($AN22,Race,4))","v":1},{"$f":"IF($AN22=\"\",0,VLOOKUP($AN22,Race,5))","v":50},{"$f":"WEEKDAY(AM22)","v":6},{"$f":"IF($AY22=1,5,\"\")","v":5},{"$f":"IF($AZ22=1,($I22*$BI22),\"\")","v":""},{"$f":"IF($BG22=1,($J22*$BK22),\"\")","v":""}]
["27/05/2016 18:59:44: [G_Auto] :  £ 5.00 Back bet placed on Busy Street at 6. Fully matched at 6.  Ref: 10050","19:07:26","Ponte 27th May - 19:00 1m4f Hcap","Busy Street",20,0,null,9,6,{"$f":"IF(C23=C22,J22+1,3)","v":3},{"$f":"IF(C23=\"\",\"\",LEFT(C23,5))","v":"Ponte"},{"$f":"IF($K23=\"\",0,VLOOKUP($K23,Course,2))","v":"Pontefract"},{"$f":"IF(ISERROR(SEARCH(\"Charity\",$C23)),\"\",\"Charity\")","v":""},{"$f":"IF(ISERROR(SEARCH(\"PA\",$C23)),\"\",\"PA\")","v":""},{"$f":"IF(ISERROR(SEARCH(\"Class\",$C23)),\"\",\"Class\")","v":""},{"$f":"IF(ISERROR(SEARCH(\"Listed\",$C23)),\"\",\"Listed\")","v":""},{"$f":"IF(ISERROR(SEARCH(\"Grd1\",$C23)),\"\",\"Grd1\")","v":""},{"$f":"IF(ISERROR(SEARCH(\"Grd2\",$C23)),\"\",\"Grd2\")","v":""},{"$f":"IF(ISERROR(SEARCH(\"Grd3\",$C23)),\"\",\"Grd3\")","v":""},{"$f":"IF(ISERROR(SEARCH(\"Grp1\",$C23)),\"\",\"Grp1\")","v":""},{"$f":"IF(ISERROR(SEARCH(\"Grp2\",$C23)),\"\",\"Grp2\")","v":""},{"$f":"IF(ISERROR(SEARCH(\"Grp3\",$C23)),\"\",\"Grp3\")","v":""},{"$f":"IF(ISERROR(SEARCH(\"Grp 3\",$C23)),\"\",\"Grp3\")","v":""},{"$f":"IF(ISERROR(SEARCH(\"Nov\",$C23)),\"\",\"Nov\")","v":""},{"$f":"IF(ISERROR(SEARCH(\"App\",$C23)),\"\",\"App\")","v":""},{"$f":"IF(ISERROR(SEARCH(\"Sell\",$C23)),\"\",\"Sell\")","v":""},{"$f":"IF(ISERROR(SEARCH(\"Mdn\",$C23)),\"\",\"Mdn\")","v":""},{"$f":"IF(ISERROR(SEARCH(\"Beg\",$C23)),\"\",\"Beg\")","v":""},{"$f":"IF(ISERROR(SEARCH(\"Claim\",$C23)),\"\",\"Claim\")","v":""},{"$f":"IF(ISERROR(SEARCH(\"Hunt\",$C23)),\"\",\"Hunt\")","v":""},{"$f":"IF(ISERROR(SEARCH(\"Hcap\",$C23)),\"\",\"Hcap\")","v":"Hcap"},{"$f":"IF(ISERROR(SEARCH(\"Cond\",$C23)),\"\",\"Cond\")","v":""},{"$f":"IF(ISERROR(SEARCH(\"XC\",$C23)),\"\",\"XC\")","v":""},{"$f":"IF(ISERROR(SEARCH(\"Stks\",$C23)),\"\",\"Stks\")","v":""},{"$f":"IF(ISERROR(SEARCH(\"Hrd\",$C23)),\"\",\"Hrd\")","v":""},{"$f":"IF(ISERROR(SEARCH(\"Chs\",$C23)),\"\",\"Chs\")","v":""},{"$f":"IF(ISERROR(SEARCH(\" NHF\",$C23)),\"\",\"NHF\")","v":""},{"$f":"IF(ISERROR(SEARCH(\"INHF\",$C23)),\"\",\"INHF\")","v":""},{"$f":"LEFT(A23,10)","v":"27/05/2016"},{"$f":"CONCATENATE(M23,N23,O23,P23,Q23,R23,S23,T23,U23,V23,W23,X23,Y23,Z23,AB23,AA23,AC23,AD23,AE23,AF23,AG23,AH23,AK23,AL23,AI23,AJ23)","v":"Hcap"},{"$f":"IF($AN23=\"\",0,VLOOKUP($AN23,Race,1))","v":"Hcap"},{"$f":"IF($AN23<>$AO23,1,\"\")","v":""},null,{"$f":"IF($I23=\"\",0,IF($I23<Tables!$T$2,0,1))","v":1},{"$f":"IF($I23=\"\",0,IF($I23>Tables!$U$2,0,1))","v":1},{"$f":"IF($I23=\"\",0,IF($H23<VLOOKUP($K23,Course,3),0,1))","v":0},{"$f":"IF($I23=\"\",0,IF($H23>VLOOKUP($K23,Course,4),0,1))","v":1},{"$f":"IF($AN23=\"\",0,IF($H23<VLOOKUP($AN23,Race,2),0,1))","v":1},{"$f":"IF($AN23=\"\",0,IF($H23>VLOOKUP($AN23,Race,3),0,1))","v":1},{"$f":"IF($J23=\"\",0,VLOOKUP($J23,Selection,2))","v":1},{"$f":"IF(E23=0,0,IF(SUM(AR23:AX23)=$AY$1,1,0))","v":0},{"$f":"IF($AY23<>1,0,IF($G23=1,1,0))","v":0},null,{"$f":"IF($K23=\"\",0,VLOOKUP($K23,Course,3))","v":99},{"$f":"IF($K23=\"\",0,VLOOKUP($K23,Course,4))","v":99},{"$f":"IF($AN23=\"\",0,VLOOKUP($AN23,Race,2))","v":1},{"$f":"IF($AN23=\"\",0,VLOOKUP($AN23,Race,3))","v":50},{"$f":"IF($AN23=\"\",0,VLOOKUP($AN23,Race,4))","v":1},{"$f":"IF($AN23=\"\",0,VLOOKUP($AN23,Race,5))","v":50},{"$f":"WEEKDAY(AM23)","v":6},{"$f":"IF($AY23=1,5,\"\")","v":""},{"$f":"IF($AZ23=1,($I23*$BI23),\"\")","v":""},{"$f":"IF($BG23=1,($J23*$BK23),\"\")","v":""}]
["27/05/2016 18:59:53: [G_Auto] :  £ 5.00 Back bet placed on Chilworth Bells at 7.8. Fully matched at 7.8.  Ref: 10052","19:07:26","Ponte 27th May - 19:00 1m4f Hcap","Chilworth Bells",29,0,null,9,7.8,{"$f":"IF(C24=C23,J23+1,3)","v":4},{"$f":"IF(C24=\"\",\"\",LEFT(C24,5))","v":"Ponte"},{"$f":"IF($K24=\"\",0,VLOOKUP($K24,Course,2))","v":"Pontefract"},{"$f":"IF(ISERROR(SEARCH(\"Charity\",$C24)),\"\",\"Charity\")","v":""},{"$f":"IF(ISERROR(SEARCH(\"PA\",$C24)),\"\",\"PA\")","v":""},{"$f":"IF(ISERROR(SEARCH(\"Class\",$C24)),\"\",\"Class\")","v":""},{"$f":"IF(ISERROR(SEARCH(\"Listed\",$C24)),\"\",\"Listed\")","v":""},{"$f":"IF(ISERROR(SEARCH(\"Grd1\",$C24)),\"\",\"Grd1\")","v":""},{"$f":"IF(ISERROR(SEARCH(\"Grd2\",$C24)),\"\",\"Grd2\")","v":""},{"$f":"IF(ISERROR(SEARCH(\"Grd3\",$C24)),\"\",\"Grd3\")","v":""},{"$f":"IF(ISERROR(SEARCH(\"Grp1\",$C24)),\"\",\"Grp1\")","v":""},{"$f":"IF(ISERROR(SEARCH(\"Grp2\",$C24)),\"\",\"Grp2\")","v":""},{"$f":"IF(ISERROR(SEARCH(\"Grp3\",$C24)),\"\",\"Grp3\")","v":""},{"$f":"IF(ISERROR(SEARCH(\"Grp 3\",$C24)),\"\",\"Grp3\")","v":""},{"$f":"IF(ISERROR(SEARCH(\"Nov\",$C24)),\"\",\"Nov\")","v":""},{"$f":"IF(ISERROR(SEARCH(\"App\",$C24)),\"\",\"App\")","v":""},{"$f":"IF(ISERROR(SEARCH(\"Sell\",$C24)),\"\",\"Sell\")","v":""},{"$f":"IF(ISERROR(SEARCH(\"Mdn\",$C24)),\"\",\"Mdn\")","v":""},{"$f":"IF(ISERROR(SEARCH(\"Beg\",$C24)),\"\",\"Beg\")","v":""},{"$f":"IF(ISERROR(SEARCH(\"Claim\",$C24)),\"\",\"Claim\")","v":""},{"$f":"IF(ISERROR(SEARCH(\"Hunt\",$C24)),\"\",\"Hunt\")","v":""},{"$f":"IF(ISERROR(SEARCH(\"Hcap\",$C24)),\"\",\"Hcap\")","v":"Hcap"},{"$f":"IF(ISERROR(SEARCH(\"Cond\",$C24)),\"\",\"Cond\")","v":""},{"$f":"IF(ISERROR(SEARCH(\"XC\",$C24)),\"\",\"XC\")","v":""},{"$f":"IF(ISERROR(SEARCH(\"Stks\",$C24)),\"\",\"Stks\")","v":""},{"$f":"IF(ISERROR(SEARCH(\"Hrd\",$C24)),\"\",\"Hrd\")","v":""},{"$f":"IF(ISERROR(SEARCH(\"Chs\",$C24)),\"\",\"Chs\")","v":""},{"$f":"IF(ISERROR(SEARCH(\" NHF\",$C24)),\"\",\"NHF\")","v":""},{"$f":"IF(ISERROR(SEARCH(\"INHF\",$C24)),\"\",\"INHF\")","v":""},{"$f":"LEFT(A24,10)","v":"27/05/2016"},{"$f":"CONCATENATE(M24,N24,O24,P24,Q24,R24,S24,T24,U24,V24,W24,X24,Y24,Z24,AB24,AA24,AC24,AD24,AE24,AF24,AG24,AH24,AK24,AL24,AI24,AJ24)","v":"Hcap"},{"$f":"IF($AN24=\"\",0,VLOOKUP($AN24,Race,1))","v":"Hcap"},{"$f":"IF($AN24<>$AO24,1,\"\")","v":""},null,{"$f":"IF($I24=\"\",0,IF($I24<Tables!$T$2,0,1))","v":1},{"$f":"IF($I24=\"\",0,IF($I24>Tables!$U$2,0,1))","v":1},{"$f":"IF($I24=\"\",0,IF($H24<VLOOKUP($K24,Course,3),0,1))","v":0},{"$f":"IF($I24=\"\",0,IF($H24>VLOOKUP($K24,Course,4),0,1))","v":1},{"$f":"IF($AN24=\"\",0,IF($H24<VLOOKUP($AN24,Race,2),0,1))","v":1},{"$f":"IF($AN24=\"\",0,IF($H24>VLOOKUP($AN24,Race,3),0,1))","v":1},{"$f":"IF($J24=\"\",0,VLOOKUP($J24,Selection,2))","v":1},{"$f":"IF(E24=0,0,IF(SUM(AR24:AX24)=$AY$1,1,0))","v":0},{"$f":"IF($AY24<>1,0,IF($G24=1,1,0))","v":0},null,{"$f":"IF($K24=\"\",0,VLOOKUP($K24,Course,3))","v":99},{"$f":"IF($K24=\"\",0,VLOOKUP($K24,Course,4))","v":99},{"$f":"IF($AN24=\"\",0,VLOOKUP($AN24,Race,2))","v":1},{"$f":"IF($AN24=\"\",0,VLOOKUP($AN24,Race,3))","v":50},{"$f":"IF($AN24=\"\",0,VLOOKUP($AN24,Race,4))","v":1},{"$f":"IF($AN24=\"\",0,VLOOKUP($AN24,Race,5))","v":50},{"$f":"WEEKDAY(AM24)","v":6},{"$f":"IF($AY24=1,5,\"\")","v":""},{"$f":"IF($AZ24=1,($I24*$BI24),\"\")","v":""},{"$f":"IF($BG24=1,($J24*$BK24),\"\")","v":""}]
["27/05/2016 19:09:46: [G_Auto] :  £ 5.00 Back bet placed on Glengarry at 5.5. Fully matched at 5.5.  Ref: 10057","19:18:06","Muss 27th May - 19:10 7f Mdn Stks","Glengarry",17.5,0,null,7,5.5,{"$f":"IF(C25=C24,J24+1,3)","v":3},{"$f":"IF(C25=\"\",\"\",LEFT(C25,5))","v":"Muss"},{"$f":"IF($K25=\"\",0,VLOOKUP($K25,Course,2))","v":"Musselburgh"},{"$f":"IF(ISERROR(SEARCH(\"Charity\",$C25)),\"\",\"Charity\")","v":""},{"$f":"IF(ISERROR(SEARCH(\"PA\",$C25)),\"\",\"PA\")","v":""},{"$f":"IF(ISERROR(SEARCH(\"Class\",$C25)),\"\",\"Class\")","v":""},{"$f":"IF(ISERROR(SEARCH(\"Listed\",$C25)),\"\",\"Listed\")","v":""},{"$f":"IF(ISERROR(SEARCH(\"Grd1\",$C25)),\"\",\"Grd1\")","v":""},{"$f":"IF(ISERROR(SEARCH(\"Grd2\",$C25)),\"\",\"Grd2\")","v":""},{"$f":"IF(ISERROR(SEARCH(\"Grd3\",$C25)),\"\",\"Grd3\")","v":""},{"$f":"IF(ISERROR(SEARCH(\"Grp1\",$C25)),\"\",\"Grp1\")","v":""},{"$f":"IF(ISERROR(SEARCH(\"Grp2\",$C25)),\"\",\"Grp2\")","v":""},{"$f":"IF(ISERROR(SEARCH(\"Grp3\",$C25)),\"\",\"Grp3\")","v":""},{"$f":"IF(ISERROR(SEARCH(\"Grp 3\",$C25)),\"\",\"Grp3\")","v":""},{"$f":"IF(ISERROR(SEARCH(\"Nov\",$C25)),\"\",\"Nov\")","v":""},{"$f":"IF(ISERROR(SEARCH(\"App\",$C25)),\"\",\"App\")","v":""},{"$f":"IF(ISERROR(SEARCH(\"Sell\",$C25)),\"\",\"Sell\")","v":""},{"$f":"IF(ISERROR(SEARCH(\"Mdn\",$C25)),\"\",\"Mdn\")","v":"Mdn"},{"$f":"IF(ISERROR(SEARCH(\"Beg\",$C25)),\"\",\"Beg\")","v":""},{"$f":"IF(ISERROR(SEARCH(\"Claim\",$C25)),\"\",\"Claim\")","v":""},{"$f":"IF(ISERROR(SEARCH(\"Hunt\",$C25)),\"\",\"Hunt\")","v":""},{"$f":"IF(ISERROR(SEARCH(\"Hcap\",$C25)),\"\",\"Hcap\")","v":""},{"$f":"IF(ISERROR(SEARCH(\"Cond\",$C25)),\"\",\"Cond\")","v":""},{"$f":"IF(ISERROR(SEARCH(\"XC\",$C25)),\"\",\"XC\")","v":""},{"$f":"IF(ISERROR(SEARCH(\"Stks\",$C25)),\"\",\"Stks\")","v":"Stks"},{"$f":"IF(ISERROR(SEARCH(\"Hrd\",$C25)),\"\",\"Hrd\")","v":""},{"$f":"IF(ISERROR(SEARCH(\"Chs\",$C25)),\"\",\"Chs\")","v":""},{"$f":"IF(ISERROR(SEARCH(\" NHF\",$C25)),\"\",\"NHF\")","v":""},{"$f":"IF(ISERROR(SEARCH(\"INHF\",$C25)),\"\",\"INHF\")","v":""},{"$f":"LEFT(A25,10)","v":"27/05/2016"},{"$f":"CONCATENATE(M25,N25,O25,P25,Q25,R25,S25,T25,U25,V25,W25,X25,Y25,Z25,AB25,AA25,AC25,AD25,AE25,AF25,AG25,AH25,AK25,AL25,AI25,AJ25)","v":"MdnStks"},{"$f":"IF($AN25=\"\",0,VLOOKUP($AN25,Race,1))","v":"MdnStks"},{"$f":"IF($AN25<>$AO25,1,\"\")","v":""},null,{"$f":"IF($I25=\"\",0,IF($I25<Tables!$T$2,0,1))","v":1},{"$f":"IF($I25=\"\",0,IF($I25>Tables!$U$2,0,1))","v":1},{"$f":"IF($I25=\"\",0,IF($H25<VLOOKUP($K25,Course,3),0,1))","v":1},{"$f":"IF($I25=\"\",0,IF($H25>VLOOKUP($K25,Course,4),0,1))","v":1},{"$f":"IF($AN25=\"\",0,IF($H25<VLOOKUP($AN25,Race,2),0,1))","v":1},{"$f":"IF($AN25=\"\",0,IF($H25>VLOOKUP($AN25,Race,3),0,1))","v":1},{"$f":"IF($J25=\"\",0,VLOOKUP($J25,Selection,2))","v":1},{"$f":"IF(E25=0,0,IF(SUM(AR25:AX25)=$AY$1,1,0))","v":1},{"$f":"IF($AY25<>1,0,IF($G25=1,1,0))","v":0},null,{"$f":"IF($K25=\"\",0,VLOOKUP($K25,Course,3))","v":7},{"$f":"IF($K25=\"\",0,VLOOKUP($K25,Course,4))","v":8},{"$f":"IF($AN25=\"\",0,VLOOKUP($AN25,Race,2))","v":1},{"$f":"IF($AN25=\"\",0,VLOOKUP($AN25,Race,3))","v":50},{"$f":"IF($AN25=\"\",0,VLOOKUP($AN25,Race,4))","v":1},{"$f":"IF($AN25=\"\",0,VLOOKUP($AN25,Race,5))","v":50},{"$f":"WEEKDAY(AM25)","v":6},{"$f":"IF($AY25=1,5,\"\")","v":5},{"$f":"IF($AZ25=1,($I25*$BI25),\"\")","v":""},{"$f":"IF($BG25=1,($J25*$BK25),\"\")","v":""}]
["27/05/2016 19:09:54: [G_Auto] :  £ 5.00 Back bet placed on Dark Forest at 10.5. Fully matched at 10.5.  Ref: 10059","19:18:06","Muss 27th May - 19:10 7f Mdn Stks","Dark Forest",42.5,0,null,7,10.5,{"$f":"IF(C26=C25,J25+1,3)","v":4},{"$f":"IF(C26=\"\",\"\",LEFT(C26,5))","v":"Muss"},{"$f":"IF($K26=\"\",0,VLOOKUP($K26,Course,2))","v":"Musselburgh"},{"$f":"IF(ISERROR(SEARCH(\"Charity\",$C26)),\"\",\"Charity\")","v":""},{"$f":"IF(ISERROR(SEARCH(\"PA\",$C26)),\"\",\"PA\")","v":""},{"$f":"IF(ISERROR(SEARCH(\"Class\",$C26)),\"\",\"Class\")","v":""},{"$f":"IF(ISERROR(SEARCH(\"Listed\",$C26)),\"\",\"Listed\")","v":""},{"$f":"IF(ISERROR(SEARCH(\"Grd1\",$C26)),\"\",\"Grd1\")","v":""},{"$f":"IF(ISERROR(SEARCH(\"Grd2\",$C26)),\"\",\"Grd2\")","v":""},{"$f":"IF(ISERROR(SEARCH(\"Grd3\",$C26)),\"\",\"Grd3\")","v":""},{"$f":"IF(ISERROR(SEARCH(\"Grp1\",$C26)),\"\",\"Grp1\")","v":""},{"$f":"IF(ISERROR(SEARCH(\"Grp2\",$C26)),\"\",\"Grp2\")","v":""},{"$f":"IF(ISERROR(SEARCH(\"Grp3\",$C26)),\"\",\"Grp3\")","v":""},{"$f":"IF(ISERROR(SEARCH(\"Grp 3\",$C26)),\"\",\"Grp3\")","v":""},{"$f":"IF(ISERROR(SEARCH(\"Nov\",$C26)),\"\",\"Nov\")","v":""},{"$f":"IF(ISERROR(SEARCH(\"App\",$C26)),\"\",\"App\")","v":""},{"$f":"IF(ISERROR(SEARCH(\"Sell\",$C26)),\"\",\"Sell\")","v":""},{"$f":"IF(ISERROR(SEARCH(\"Mdn\",$C26)),\"\",\"Mdn\")","v":"Mdn"},{"$f":"IF(ISERROR(SEARCH(\"Beg\",$C26)),\"\",\"Beg\")","v":""},{"$f":"IF(ISERROR(SEARCH(\"Claim\",$C26)),\"\",\"Claim\")","v":""},{"$f":"IF(ISERROR(SEARCH(\"Hunt\",$C26)),\"\",\"Hunt\")","v":""},{"$f":"IF(ISERROR(SEARCH(\"Hcap\",$C26)),\"\",\"Hcap\")","v":""},{"$f":"IF(ISERROR(SEARCH(\"Cond\",$C26)),\"\",\"Cond\")","v":""},{"$f":"IF(ISERROR(SEARCH(\"XC\",$C26)),\"\",\"XC\")","v":""},{"$f":"IF(ISERROR(SEARCH(\"Stks\",$C26)),\"\",\"Stks\")","v":"Stks"},{"$f":"IF(ISERROR(SEARCH(\"Hrd\",$C26)),\"\",\"Hrd\")","v":""},{"$f":"IF(ISERROR(SEARCH(\"Chs\",$C26)),\"\",\"Chs\")","v":""},{"$f":"IF(ISERROR(SEARCH(\" NHF\",$C26)),\"\",\"NHF\")","v":""},{"$f":"IF(ISERROR(SEARCH(\"INHF\",$C26)),\"\",\"INHF\")","v":""},{"$f":"LEFT(A26,10)","v":"27/05/2016"},{"$f":"CONCATENATE(M26,N26,O26,P26,Q26,R26,S26,T26,U26,V26,W26,X26,Y26,Z26,AB26,AA26,AC26,AD26,AE26,AF26,AG26,AH26,AK26,AL26,AI26,AJ26)","v":"MdnStks"},{"$f":"IF($AN26=\"\",0,VLOOKUP($AN26,Race,1))","v":"MdnStks"},{"$f":"IF($AN26<>$AO26,1,\"\")","v":""},null,{"$f":"IF($I26=\"\",0,IF($I26<Tables!$T$2,0,1))","v":1},{"$f":"IF($I26=\"\",0,IF($I26>Tables!$U$2,0,1))","v":1},{"$f":"IF($I26=\"\",0,IF($H26<VLOOKUP($K26,Course,3),0,1))","v":1},{"$f":"IF($I26=\"\",0,IF($H26>VLOOKUP($K26,Course,4),0,1))","v":1},{"$f":"IF($AN26=\"\",0,IF($H26<VLOOKUP($AN26,Race,2),0,1))","v":1},{"$f":"IF($AN26=\"\",0,IF($H26>VLOOKUP($AN26,Race,3),0,1))","v":1},{"$f":"IF($J26=\"\",0,VLOOKUP($J26,Selection,2))","v":1},{"$f":"IF(E26=0,0,IF(SUM(AR26:AX26)=$AY$1,1,0))","v":1},{"$f":"IF($AY26<>1,0,IF($G26=1,1,0))","v":0},null,{"$f":"IF($K26=\"\",0,VLOOKUP($K26,Course,3))","v":7},{"$f":"IF($K26=\"\",0,VLOOKUP($K26,Course,4))","v":8},{"$f":"IF($AN26=\"\",0,VLOOKUP($AN26,Race,2))","v":1},{"$f":"IF($AN26=\"\",0,VLOOKUP($AN26,Race,3))","v":50},{"$f":"IF($AN26=\"\",0,VLOOKUP($AN26,Race,4))","v":1},{"$f":"IF($AN26=\"\",0,VLOOKUP($AN26,Race,5))","v":50},{"$f":"WEEKDAY(AM26)","v":6},{"$f":"IF($AY26=1,5,\"\")","v":5},{"$f":"IF($AZ26=1,($I26*$BI26),\"\")","v":""},{"$f":"IF($BG26=1,($J26*$BK26),\"\")","v":""}]
["27/05/2016 19:19:44: [G_Auto] :  £ 5.00 Back bet placed on Inner Loop at 8.6. Fully matched at 8.6.  Ref: 10060","19:26:32","Worc 27th May - 19:20 2m NHF","Inner Loop",33,0,null,6,8.6,{"$f":"IF(C27=C26,J26+1,3)","v":3},{"$f":"IF(C27=\"\",\"\",LEFT(C27,5))","v":"Worc"},{"$f":"IF($K27=\"\",0,VLOOKUP($K27,Course,2))","v":"Worcester"},{"$f":"IF(ISERROR(SEARCH(\"Charity\",$C27)),\"\",\"Charity\")","v":""},{"$f":"IF(ISERROR(SEARCH(\"PA\",$C27)),\"\",\"PA\")","v":""},{"$f":"IF(ISERROR(SEARCH(\"Class\",$C27)),\"\",\"Class\")","v":""},{"$f":"IF(ISERROR(SEARCH(\"Listed\",$C27)),\"\",\"Listed\")","v":""},{"$f":"IF(ISERROR(SEARCH(\"Grd1\",$C27)),\"\",\"Grd1\")","v":""},{"$f":"IF(ISERROR(SEARCH(\"Grd2\",$C27)),\"\",\"Grd2\")","v":""},{"$f":"IF(ISERROR(SEARCH(\"Grd3\",$C27)),\"\",\"Grd3\")","v":""},{"$f":"IF(ISERROR(SEARCH(\"Grp1\",$C27)),\"\",\"Grp1\")","v":""},{"$f":"IF(ISERROR(SEARCH(\"Grp2\",$C27)),\"\",\"Grp2\")","v":""},{"$f":"IF(ISERROR(SEARCH(\"Grp3\",$C27)),\"\",\"Grp3\")","v":""},{"$f":"IF(ISERROR(SEARCH(\"Grp 3\",$C27)),\"\",\"Grp3\")","v":""},{"$f":"IF(ISERROR(SEARCH(\"Nov\",$C27)),\"\",\"Nov\")","v":""},{"$f":"IF(ISERROR(SEARCH(\"App\",$C27)),\"\",\"App\")","v":""},{"$f":"IF(ISERROR(SEARCH(\"Sell\",$C27)),\"\",\"Sell\")","v":""},{"$f":"IF(ISERROR(SEARCH(\"Mdn\",$C27)),\"\",\"Mdn\")","v":""},{"$f":"IF(ISERROR(SEARCH(\"Beg\",$C27)),\"\",\"Beg\")","v":""},{"$f":"IF(ISERROR(SEARCH(\"Claim\",$C27)),\"\",\"Claim\")","v":""},{"$f":"IF(ISERROR(SEARCH(\"Hunt\",$C27)),\"\",\"Hunt\")","v":""},{"$f":"IF(ISERROR(SEARCH(\"Hcap\",$C27)),\"\",\"Hcap\")","v":""},{"$f":"IF(ISERROR(SEARCH(\"Cond\",$C27)),\"\",\"Cond\")","v":""},{"$f":"IF(ISERROR(SEARCH(\"XC\",$C27)),\"\",\"XC\")","v":""},{"$f":"IF(ISERROR(SEARCH(\"Stks\",$C27)),\"\",\"Stks\")","v":""},{"$f":"IF(ISERROR(SEARCH(\"Hrd\",$C27)),\"\",\"Hrd\")","v":""},{"$f":"IF(ISERROR(SEARCH(\"Chs\",$C27)),\"\",\"Chs\")","v":""},{"$f":"IF(ISERROR(SEARCH(\" NHF\",$C27)),\"\",\"NHF\")","v":"NHF"},{"$f":"IF(ISERROR(SEARCH(\"INHF\",$C27)),\"\",\"INHF\")","v":""},{"$f":"LEFT(A27,10)","v":"27/05/2016"},{"$f":"CONCATENATE(M27,N27,O27,P27,Q27,R27,S27,T27,U27,V27,W27,X27,Y27,Z27,AB27,AA27,AC27,AD27,AE27,AF27,AG27,AH27,AK27,AL27,AI27,AJ27)","v":"NHF"},{"$f":"IF($AN27=\"\",0,VLOOKUP($AN27,Race,1))","v":"NHF"},{"$f":"IF($AN27<>$AO27,1,\"\")","v":""},null,{"$f":"IF($I27=\"\",0,IF($I27<Tables!$T$2,0,1))","v":1},{"$f":"IF($I27=\"\",0,IF($I27>Tables!$U$2,0,1))","v":1},{"$f":"IF($I27=\"\",0,IF($H27<VLOOKUP($K27,Course,3),0,1))","v":0},{"$f":"IF($I27=\"\",0,IF($H27>VLOOKUP($K27,Course,4),0,1))","v":1},{"$f":"IF($AN27=\"\",0,IF($H27<VLOOKUP($AN27,Race,2),0,1))","v":1},{"$f":"IF($AN27=\"\",0,IF($H27>VLOOKUP($AN27,Race,3),0,1))","v":1},{"$f":"IF($J27=\"\",0,VLOOKUP($J27,Selection,2))","v":1},{"$f":"IF(E27=0,0,IF(SUM(AR27:AX27)=$AY$1,1,0))","v":0},{"$f":"IF($AY27<>1,0,IF($G27=1,1,0))","v":0},null,{"$f":"IF($K27=\"\",0,VLOOKUP($K27,Course,3))","v":7},{"$f":"IF($K27=\"\",0,VLOOKUP($K27,Course,4))","v":9},{"$f":"IF($AN27=\"\",0,VLOOKUP($AN27,Race,2))","v":1},{"$f":"IF($AN27=\"\",0,VLOOKUP($AN27,Race,3))","v":50},{"$f":"IF($AN27=\"\",0,VLOOKUP($AN27,Race,4))","v":1},{"$f":"IF($AN27=\"\",0,VLOOKUP($AN27,Race,5))","v":50},{"$f":"WEEKDAY(AM27)","v":6},{"$f":"IF($AY27=1,5,\"\")","v":""},{"$f":"IF($AZ27=1,($I27*$BI27),\"\")","v":""},{"$f":"IF($BG27=1,($J27*$BK27),\"\")","v":""}]
["27/05/2016 19:19:52: [G_Auto] :  £ 5.00 Back bet placed on Miliair at 11. Fully matched at 11.  Ref: 10062","19:26:32","Worc 27th May - 19:20 2m NHF","Miliair",45,0,null,6,11,{"$f":"IF(C28=C27,J27+1,3)","v":4},{"$f":"IF(C28=\"\",\"\",LEFT(C28,5))","v":"Worc"},{"$f":"IF($K28=\"\",0,VLOOKUP($K28,Course,2))","v":"Worcester"},{"$f":"IF(ISERROR(SEARCH(\"Charity\",$C28)),\"\",\"Charity\")","v":""},{"$f":"IF(ISERROR(SEARCH(\"PA\",$C28)),\"\",\"PA\")","v":""},{"$f":"IF(ISERROR(SEARCH(\"Class\",$C28)),\"\",\"Class\")","v":""},{"$f":"IF(ISERROR(SEARCH(\"Listed\",$C28)),\"\",\"Listed\")","v":""},{"$f":"IF(ISERROR(SEARCH(\"Grd1\",$C28)),\"\",\"Grd1\")","v":""},{"$f":"IF(ISERROR(SEARCH(\"Grd2\",$C28)),\"\",\"Grd2\")","v":""},{"$f":"IF(ISERROR(SEARCH(\"Grd3\",$C28)),\"\",\"Grd3\")","v":""},{"$f":"IF(ISERROR(SEARCH(\"Grp1\",$C28)),\"\",\"Grp1\")","v":""},{"$f":"IF(ISERROR(SEARCH(\"Grp2\",$C28)),\"\",\"Grp2\")","v":""},{"$f":"IF(ISERROR(SEARCH(\"Grp3\",$C28)),\"\",\"Grp3\")","v":""},{"$f":"IF(ISERROR(SEARCH(\"Grp 3\",$C28)),\"\",\"Grp3\")","v":""},{"$f":"IF(ISERROR(SEARCH(\"Nov\",$C28)),\"\",\"Nov\")","v":""},{"$f":"IF(ISERROR(SEARCH(\"App\",$C28)),\"\",\"App\")","v":""},{"$f":"IF(ISERROR(SEARCH(\"Sell\",$C28)),\"\",\"Sell\")","v":""},{"$f":"IF(ISERROR(SEARCH(\"Mdn\",$C28)),\"\",\"Mdn\")","v":""},{"$f":"IF(ISERROR(SEARCH(\"Beg\",$C28)),\"\",\"Beg\")","v":""},{"$f":"IF(ISERROR(SEARCH(\"Claim\",$C28)),\"\",\"Claim\")","v":""},{"$f":"IF(ISERROR(SEARCH(\"Hunt\",$C28)),\"\",\"Hunt\")","v":""},{"$f":"IF(ISERROR(SEARCH(\"Hcap\",$C28)),\"\",\"Hcap\")","v":""},{"$f":"IF(ISERROR(SEARCH(\"Cond\",$C28)),\"\",\"Cond\")","v":""},{"$f":"IF(ISERROR(SEARCH(\"XC\",$C28)),\"\",\"XC\")","v":""},{"$f":"IF(ISERROR(SEARCH(\"Stks\",$C28)),\"\",\"Stks\")","v":""},{"$f":"IF(ISERROR(SEARCH(\"Hrd\",$C28)),\"\",\"Hrd\")","v":""},{"$f":"IF(ISERROR(SEARCH(\"Chs\",$C28)),\"\",\"Chs\")","v":""},{"$f":"IF(ISERROR(SEARCH(\" NHF\",$C28)),\"\",\"NHF\")","v":"NHF"},{"$f":"IF(ISERROR(SEARCH(\"INHF\",$C28)),\"\",\"INHF\")","v":""},{"$f":"LEFT(A28,10)","v":"27/05/2016"},{"$f":"CONCATENATE(M28,N28,O28,P28,Q28,R28,S28,T28,U28,V28,W28,X28,Y28,Z28,AB28,AA28,AC28,AD28,AE28,AF28,AG28,AH28,AK28,AL28,AI28,AJ28)","v":"NHF"},{"$f":"IF($AN28=\"\",0,VLOOKUP($AN28,Race,1))","v":"NHF"},{"$f":"IF($AN28<>$AO28,1,\"\")","v":""},null,{"$f":"IF($I28=\"\",0,IF($I28<Tables!$T$2,0,1))","v":1},{"$f":"IF($I28=\"\",0,IF($I28>Tables!$U$2,0,1))","v":1},{"$f":"IF($I28=\"\",0,IF($H28<VLOOKUP($K28,Course,3),0,1))","v":0},{"$f":"IF($I28=\"\",0,IF($H28>VLOOKUP($K28,Course,4),0,1))","v":1},{"$f":"IF($AN28=\"\",0,IF($H28<VLOOKUP($AN28,Race,2),0,1))","v":1},{"$f":"IF($AN28=\"\",0,IF($H28>VLOOKUP($AN28,Race,3),0,1))","v":1},{"$f":"IF($J28=\"\",0,VLOOKUP($J28,Selection,2))","v":1},{"$f":"IF(E28=0,0,IF(SUM(AR28:AX28)=$AY$1,1,0))","v":0},{"$f":"IF($AY28<>1,0,IF($G28=1,1,0))","v":0},null,{"$f":"IF($K28=\"\",0,VLOOKUP($K28,Course,3))","v":7},{"$f":"IF($K28=\"\",0,VLOOKUP($K28,Course,4))","v":9},{"$f":"IF($AN28=\"\",0,VLOOKUP($AN28,Race,2))","v":1},{"$f":"IF($AN28=\"\",0,VLOOKUP($AN28,Race,3))","v":50},{"$f":"IF($AN28=\"\",0,VLOOKUP($AN28,Race,4))","v":1},{"$f":"IF($AN28=\"\",0,VLOOKUP($AN28,Race,5))","v":50},{"$f":"WEEKDAY(AM28)","v":6},{"$f":"IF($AY28=1,5,\"\")","v":""},{"$f":"IF($AZ28=1,($I28*$BI28),\"\")","v":""},{"$f":"IF($BG28=1,($J28*$BK28),\"\")","v":""}]
["27/05/2016 19:29:45: [G_Auto] :  £ 5.00 Back bet placed on Wedding Dress at 11.5. Fully matched at 11.5.  Ref: 10064","19:32:57","Ponte 27th May - 19:30 6f Cond Stks","Wedding Dress",52.5,0,null,4,11.5,{"$f":"IF(C29=C28,J28+1,3)","v":3},{"$f":"IF(C29=\"\",\"\",LEFT(C29,5))","v":"Ponte"},{"$f":"IF($K29=\"\",0,VLOOKUP($K29,Course,2))","v":"Pontefract"},{"$f":"IF(ISERROR(SEARCH(\"Charity\",$C29)),\"\",\"Charity\")","v":""},{"$f":"IF(ISERROR(SEARCH(\"PA\",$C29)),\"\",\"PA\")","v":""},{"$f":"IF(ISERROR(SEARCH(\"Class\",$C29)),\"\",\"Class\")","v":""},{"$f":"IF(ISERROR(SEARCH(\"Listed\",$C29)),\"\",\"Listed\")","v":""},{"$f":"IF(ISERROR(SEARCH(\"Grd1\",$C29)),\"\",\"Grd1\")","v":""},{"$f":"IF(ISERROR(SEARCH(\"Grd2\",$C29)),\"\",\"Grd2\")","v":""},{"$f":"IF(ISERROR(SEARCH(\"Grd3\",$C29)),\"\",\"Grd3\")","v":""},{"$f":"IF(ISERROR(SEARCH(\"Grp1\",$C29)),\"\",\"Grp1\")","v":""},{"$f":"IF(ISERROR(SEARCH(\"Grp2\",$C29)),\"\",\"Grp2\")","v":""},{"$f":"IF(ISERROR(SEARCH(\"Grp3\",$C29)),\"\",\"Grp3\")","v":""},{"$f":"IF(ISERROR(SEARCH(\"Grp 3\",$C29)),\"\",\"Grp3\")","v":""},{"$f":"IF(ISERROR(SEARCH(\"Nov\",$C29)),\"\",\"Nov\")","v":""},{"$f":"IF(ISERROR(SEARCH(\"App\",$C29)),\"\",\"App\")","v":""},{"$f":"IF(ISERROR(SEARCH(\"Sell\",$C29)),\"\",\"Sell\")","v":""},{"$f":"IF(ISERROR(SEARCH(\"Mdn\",$C29)),\"\",\"Mdn\")","v":""},{"$f":"IF(ISERROR(SEARCH(\"Beg\",$C29)),\"\",\"Beg\")","v":""},{"$f":"IF(ISERROR(SEARCH(\"Claim\",$C29)),\"\",\"Claim\")","v":""},{"$f":"IF(ISERROR(SEARCH(\"Hunt\",$C29)),\"\",\"Hunt\")","v":""},{"$f":"IF(ISERROR(SEARCH(\"Hcap\",$C29)),\"\",\"Hcap\")","v":""},{"$f":"IF(ISERROR(SEARCH(\"Cond\",$C29)),\"\",\"Cond\")","v":"Cond"},{"$f":"IF(ISERROR(SEARCH(\"XC\",$C29)),\"\",\"XC\")","v":""},{"$f":"IF(ISERROR(SEARCH(\"Stks\",$C29)),\"\",\"Stks\")","v":"Stks"},{"$f":"IF(ISERROR(SEARCH(\"Hrd\",$C29)),\"\",\"Hrd\")","v":""},{"$f":"IF(ISERROR(SEARCH(\"Chs\",$C29)),\"\",\"Chs\")","v":""},{"$f":"IF(ISERROR(SEARCH(\" NHF\",$C29)),\"\",\"NHF\")","v":""},{"$f":"IF(ISERROR(SEARCH(\"INHF\",$C29)),\"\",\"INHF\")","v":""},{"$f":"LEFT(A29,10)","v":"27/05/2016"},{"$f":"CONCATENATE(M29,N29,O29,P29,Q29,R29,S29,T29,U29,V29,W29,X29,Y29,Z29,AB29,AA29,AC29,AD29,AE29,AF29,AG29,AH29,AK29,AL29,AI29,AJ29)","v":"CondStks"},{"$f":"IF($AN29=\"\",0,VLOOKUP($AN29,Race,1))","v":"CondStks"},{"$f":"IF($AN29<>$AO29,1,\"\")","v":""},null,{"$f":"IF($I29=\"\",0,IF($I29<Tables!$T$2,0,1))","v":1},{"$f":"IF($I29=\"\",0,IF($I29>Tables!$U$2,0,1))","v":1},{"$f":"IF($I29=\"\",0,IF($H29<VLOOKUP($K29,Course,3),0,1))","v":0},{"$f":"IF($I29=\"\",0,IF($H29>VLOOKUP($K29,Course,4),0,1))","v":1},{"$f":"IF($AN29=\"\",0,IF($H29<VLOOKUP($AN29,Race,2),0,1))","v":1},{"$f":"IF($AN29=\"\",0,IF($H29>VLOOKUP($AN29,Race,3),0,1))","v":1},{"$f":"IF($J29=\"\",0,VLOOKUP($J29,Selection,2))","v":1},{"$f":"IF(E29=0,0,IF(SUM(AR29:AX29)=$AY$1,1,0))","v":0},{"$f":"IF($AY29<>1,0,IF($G29=1,1,0))","v":0},null,{"$f":"IF($K29=\"\",0,VLOOKUP($K29,Course,3))","v":99},{"$f":"IF($K29=\"\",0,VLOOKUP($K29,Course,4))","v":99},{"$f":"IF($AN29=\"\",0,VLOOKUP($AN29,Race,2))","v":1},{"$f":"IF($AN29=\"\",0,VLOOKUP($AN29,Race,3))","v":50},{"$f":"IF($AN29=\"\",0,VLOOKUP($AN29,Race,4))","v":1},{"$f":"IF($AN29=\"\",0,VLOOKUP($AN29,Race,5))","v":50},{"$f":"WEEKDAY(AM29)","v":6},{"$f":"IF($AY29=1,5,\"\")","v":""},{"$f":"IF($AZ29=1,($I29*$BI29),\"\")","v":""},{"$f":"IF($BG29=1,($J29*$BK29),\"\")","v":""}]
["27/05/2016 19:04:52: [G_Auto] :  £ 5.00 Back bet placed on Misdflight at 5.5. Fully matched at 5.5.  Ref: 10055","19:37:24","DownR 27th May - 19:05 3m Hcap Hrd","Misdflight",22.5,0,null,14,5.5,{"$f":"IF(C30=C29,J29+1,3)","v":3},{"$f":"IF(C30=\"\",\"\",LEFT(C30,5))","v":"DownR"},{"$f":"IF($K30=\"\",0,VLOOKUP($K30,Course,2))","v":"Down Royal"},{"$f":"IF(ISERROR(SEARCH(\"Charity\",$C30)),\"\",\"Charity\")","v":""},{"$f":"IF(ISERROR(SEARCH(\"PA\",$C30)),\"\",\"PA\")","v":""},{"$f":"IF(ISERROR(SEARCH(\"Class\",$C30)),\"\",\"Class\")","v":""},{"$f":"IF(ISERROR(SEARCH(\"Listed\",$C30)),\"\",\"Listed\")","v":""},{"$f":"IF(ISERROR(SEARCH(\"Grd1\",$C30)),\"\",\"Grd1\")","v":""},{"$f":"IF(ISERROR(SEARCH(\"Grd2\",$C30)),\"\",\"Grd2\")","v":""},{"$f":"IF(ISERROR(SEARCH(\"Grd3\",$C30)),\"\",\"Grd3\")","v":""},{"$f":"IF(ISERROR(SEARCH(\"Grp1\",$C30)),\"\",\"Grp1\")","v":""},{"$f":"IF(ISERROR(SEARCH(\"Grp2\",$C30)),\"\",\"Grp2\")","v":""},{"$f":"IF(ISERROR(SEARCH(\"Grp3\",$C30)),\"\",\"Grp3\")","v":""},{"$f":"IF(ISERROR(SEARCH(\"Grp 3\",$C30)),\"\",\"Grp3\")","v":""},{"$f":"IF(ISERROR(SEARCH(\"Nov\",$C30)),\"\",\"Nov\")","v":""},{"$f":"IF(ISERROR(SEARCH(\"App\",$C30)),\"\",\"App\")","v":""},{"$f":"IF(ISERROR(SEARCH(\"Sell\",$C30)),\"\",\"Sell\")","v":""},{"$f":"IF(ISERROR(SEARCH(\"Mdn\",$C30)),\"\",\"Mdn\")","v":""},{"$f":"IF(ISERROR(SEARCH(\"Beg\",$C30)),\"\",\"Beg\")","v":""},{"$f":"IF(ISERROR(SEARCH(\"Claim\",$C30)),\"\",\"Claim\")","v":""},{"$f":"IF(ISERROR(SEARCH(\"Hunt\",$C30)),\"\",\"Hunt\")","v":""},{"$f":"IF(ISERROR(SEARCH(\"Hcap\",$C30)),\"\",\"Hcap\")","v":"Hcap"},{"$f":"IF(ISERROR(SEARCH(\"Cond\",$C30)),\"\",\"Cond\")","v":""},{"$f":"IF(ISERROR(SEARCH(\"XC\",$C30)),\"\",\"XC\")","v":""},{"$f":"IF(ISERROR(SEARCH(\"Stks\",$C30)),\"\",\"Stks\")","v":""},{"$f":"IF(ISERROR(SEARCH(\"Hrd\",$C30)),\"\",\"Hrd\")","v":"Hrd"},{"$f":"IF(ISERROR(SEARCH(\"Chs\",$C30)),\"\",\"Chs\")","v":""},{"$f":"IF(ISERROR(SEARCH(\" NHF\",$C30)),\"\",\"NHF\")","v":""},{"$f":"IF(ISERROR(SEARCH(\"INHF\",$C30)),\"\",\"INHF\")","v":""},{"$f":"LEFT(A30,10)","v":"27/05/2016"},{"$f":"CONCATENATE(M30,N30,O30,P30,Q30,R30,S30,T30,U30,V30,W30,X30,Y30,Z30,AB30,AA30,AC30,AD30,AE30,AF30,AG30,AH30,AK30,AL30,AI30,AJ30)","v":"HcapHrd"},{"$f":"IF($AN30=\"\",0,VLOOKUP($AN30,Race,1))","v":"HcapHrd"},{"$f":"IF($AN30<>$AO30,1,\"\")","v":""},null,{"$f":"IF($I30=\"\",0,IF($I30<Tables!$T$2,0,1))","v":1},{"$f":"IF($I30=\"\",0,IF($I30>Tables!$U$2,0,1))","v":1},{"$f":"IF($I30=\"\",0,IF($H30<VLOOKUP($K30,Course,3),0,1))","v":0},{"$f":"IF($I30=\"\",0,IF($H30>VLOOKUP($K30,Course,4),0,1))","v":1},{"$f":"IF($AN30=\"\",0,IF($H30<VLOOKUP($AN30,Race,2),0,1))","v":1},{"$f":"IF($AN30=\"\",0,IF($H30>VLOOKUP($AN30,Race,3),0,1))","v":1},{"$f":"IF($J30=\"\",0,VLOOKUP($J30,Selection,2))","v":1},{"$f":"IF(E30=0,0,IF(SUM(AR30:AX30)=$AY$1,1,0))","v":0},{"$f":"IF($AY30<>1,0,IF($G30=1,1,0))","v":0},null,{"$f":"IF($K30=\"\",0,VLOOKUP($K30,Course,3))","v":99},{"$f":"IF($K30=\"\",0,VLOOKUP($K30,Course,4))","v":99},{"$f":"IF($AN30=\"\",0,VLOOKUP($AN30,Race,2))","v":1},{"$f":"IF($AN30=\"\",0,VLOOKUP($AN30,Race,3))","v":50},{"$f":"IF($AN30=\"\",0,VLOOKUP($AN30,Race,4))","v":1},{"$f":"IF($AN30=\"\",0,VLOOKUP($AN30,Race,5))","v":50},{"$f":"WEEKDAY(AM30)","v":6},{"$f":"IF($AY30=1,5,\"\")","v":""},{"$f":"IF($AZ30=1,($I30*$BI30),\"\")","v":""},{"$f":"IF($BG30=1,($J30*$BK30),\"\")","v":""}]
["27/05/2016 19:39:45: [G_Auto] :  £ 5.00 Back bet placed on El Astronaute at 6.8. Fully matched at 6.8.  Ref: 10070","19:45:44","Muss 27th May - 19:40 5f Hcap","El Astronaute",19,0,null,9,6.8,{"$f":"IF(C31=C30,J30+1,3)","v":3},{"$f":"IF(C31=\"\",\"\",LEFT(C31,5))","v":"Muss"},{"$f":"IF($K31=\"\",0,VLOOKUP($K31,Course,2))","v":"Musselburgh"},{"$f":"IF(ISERROR(SEARCH(\"Charity\",$C31)),\"\",\"Charity\")","v":""},{"$f":"IF(ISERROR(SEARCH(\"PA\",$C31)),\"\",\"PA\")","v":""},{"$f":"IF(ISERROR(SEARCH(\"Class\",$C31)),\"\",\"Class\")","v":""},{"$f":"IF(ISERROR(SEARCH(\"Listed\",$C31)),\"\",\"Listed\")","v":""},{"$f":"IF(ISERROR(SEARCH(\"Grd1\",$C31)),\"\",\"Grd1\")","v":""},{"$f":"IF(ISERROR(SEARCH(\"Grd2\",$C31)),\"\",\"Grd2\")","v":""},{"$f":"IF(ISERROR(SEARCH(\"Grd3\",$C31)),\"\",\"Grd3\")","v":""},{"$f":"IF(ISERROR(SEARCH(\"Grp1\",$C31)),\"\",\"Grp1\")","v":""},{"$f":"IF(ISERROR(SEARCH(\"Grp2\",$C31)),\"\",\"Grp2\")","v":""},{"$f":"IF(ISERROR(SEARCH(\"Grp3\",$C31)),\"\",\"Grp3\")","v":""},{"$f":"IF(ISERROR(SEARCH(\"Grp 3\",$C31)),\"\",\"Grp3\")","v":""},{"$f":"IF(ISERROR(SEARCH(\"Nov\",$C31)),\"\",\"Nov\")","v":""},{"$f":"IF(ISERROR(SEARCH(\"App\",$C31)),\"\",\"App\")","v":""},{"$f":"IF(ISERROR(SEARCH(\"Sell\",$C31)),\"\",\"Sell\")","v":""},{"$f":"IF(ISERROR(SEARCH(\"Mdn\",$C31)),\"\",\"Mdn\")","v":""},{"$f":"IF(ISERROR(SEARCH(\"Beg\",$C31)),\"\",\"Beg\")","v":""},{"$f":"IF(ISERROR(SEARCH(\"Claim\",$C31)),\"\",\"Claim\")","v":""},{"$f":"IF(ISERROR(SEARCH(\"Hunt\",$C31)),\"\",\"Hunt\")","v":""},{"$f":"IF(ISERROR(SEARCH(\"Hcap\",$C31)),\"\",\"Hcap\")","v":"Hcap"},{"$f":"IF(ISERROR(SEARCH(\"Cond\",$C31)),\"\",\"Cond\")","v":""},{"$f":"IF(ISERROR(SEARCH(\"XC\",$C31)),\"\",\"XC\")","v":""},{"$f":"IF(ISERROR(SEARCH(\"Stks\",$C31)),\"\",\"Stks\")","v":""},{"$f":"IF(ISERROR(SEARCH(\"Hrd\",$C31)),\"\",\"Hrd\")","v":""},{"$f":"IF(ISERROR(SEARCH(\"Chs\",$C31)),\"\",\"Chs\")","v":""},{"$f":"IF(ISERROR(SEARCH(\" NHF\",$C31)),\"\",\"NHF\")","v":""},{"$f":"IF(ISERROR(SEARCH(\"INHF\",$C31)),\"\",\"INHF\")","v":""},{"$f":"LEFT(A31,10)","v":"27/05/2016"},{"$f":"CONCATENATE(M31,N31,O31,P31,Q31,R31,S31,T31,U31,V31,W31,X31,Y31,Z31,AB31,AA31,AC31,AD31,AE31,AF31,AG31,AH31,AK31,AL31,AI31,AJ31)","v":"Hcap"},{"$f":"IF($AN31=\"\",0,VLOOKUP($AN31,Race,1))","v":"Hcap"},{"$f":"IF($AN31<>$AO31,1,\"\")","v":""},null,{"$f":"IF($I31=\"\",0,IF($I31<Tables!$T$2,0,1))","v":1},{"$f":"IF($I31=\"\",0,IF($I31>Tables!$U$2,0,1))","v":1},{"$f":"IF($I31=\"\",0,IF($H31<VLOOKUP($K31,Course,3),0,1))","v":1},{"$f":"IF($I31=\"\",0,IF($H31>VLOOKUP($K31,Course,4),0,1))","v":0},{"$f":"IF($AN31=\"\",0,IF($H31<VLOOKUP($AN31,Race,2),0,1))","v":1},{"$f":"IF($AN31=\"\",0,IF($H31>VLOOKUP($AN31,Race,3),0,1))","v":1},{"$f":"IF($J31=\"\",0,VLOOKUP($J31,Selection,2))","v":1},{"$f":"IF(E31=0,0,IF(SUM(AR31:AX31)=$AY$1,1,0))","v":0},{"$f":"IF($AY31<>1,0,IF($G31=1,1,0))","v":0},null,{"$f":"IF($K31=\"\",0,VLOOKUP($K31,Course,3))","v":7},{"$f":"IF($K31=\"\",0,VLOOKUP($K31,Course,4))","v":8},{"$f":"IF($AN31=\"\",0,VLOOKUP($AN31,Race,2))","v":1},{"$f":"IF($AN31=\"\",0,VLOOKUP($AN31,Race,3))","v":50},{"$f":"IF($AN31=\"\",0,VLOOKUP($AN31,Race,4))","v":1},{"$f":"IF($AN31=\"\",0,VLOOKUP($AN31,Race,5))","v":50},{"$f":"WEEKDAY(AM31)","v":6},{"$f":"IF($AY31=1,5,\"\")","v":""},{"$f":"IF($AZ31=1,($I31*$BI31),\"\")","v":""},{"$f":"IF($BG31=1,($J31*$BK31),\"\")","v":""}]
["27/05/2016 19:39:57: [G_Auto] :  £ 5.00 Back bet placed on Olivia Fallow at 9.4. Fully matched at 9.4.  Ref: 10074","19:45:44","Muss 27th May - 19:40 5f Hcap","Olivia Fallow",32,0,null,9,9.4,{"$f":"IF(C32=C31,J31+1,3)","v":4},{"$f":"IF(C32=\"\",\"\",LEFT(C32,5))","v":"Muss"},{"$f":"IF($K32=\"\",0,VLOOKUP($K32,Course,2))","v":"Musselburgh"},{"$f":"IF(ISERROR(SEARCH(\"Charity\",$C32)),\"\",\"Charity\")","v":""},{"$f":"IF(ISERROR(SEARCH(\"PA\",$C32)),\"\",\"PA\")","v":""},{"$f":"IF(ISERROR(SEARCH(\"Class\",$C32)),\"\",\"Class\")","v":""},{"$f":"IF(ISERROR(SEARCH(\"Listed\",$C32)),\"\",\"Listed\")","v":""},{"$f":"IF(ISERROR(SEARCH(\"Grd1\",$C32)),\"\",\"Grd1\")","v":""},{"$f":"IF(ISERROR(SEARCH(\"Grd2\",$C32)),\"\",\"Grd2\")","v":""},{"$f":"IF(ISERROR(SEARCH(\"Grd3\",$C32)),\"\",\"Grd3\")","v":""},{"$f":"IF(ISERROR(SEARCH(\"Grp1\",$C32)),\"\",\"Grp1\")","v":""},{"$f":"IF(ISERROR(SEARCH(\"Grp2\",$C32)),\"\",\"Grp2\")","v":""},{"$f":"IF(ISERROR(SEARCH(\"Grp3\",$C32)),\"\",\"Grp3\")","v":""},{"$f":"IF(ISERROR(SEARCH(\"Grp 3\",$C32)),\"\",\"Grp3\")","v":""},{"$f":"IF(ISERROR(SEARCH(\"Nov\",$C32)),\"\",\"Nov\")","v":""},{"$f":"IF(ISERROR(SEARCH(\"App\",$C32)),\"\",\"App\")","v":""},{"$f":"IF(ISERROR(SEARCH(\"Sell\",$C32)),\"\",\"Sell\")","v":""},{"$f":"IF(ISERROR(SEARCH(\"Mdn\",$C32)),\"\",\"Mdn\")","v":""},{"$f":"IF(ISERROR(SEARCH(\"Beg\",$C32)),\"\",\"Beg\")","v":""},{"$f":"IF(ISERROR(SEARCH(\"Claim\",$C32)),\"\",\"Claim\")","v":""},{"$f":"IF(ISERROR(SEARCH(\"Hunt\",$C32)),\"\",\"Hunt\")","v":""},{"$f":"IF(ISERROR(SEARCH(\"Hcap\",$C32)),\"\",\"Hcap\")","v":"Hcap"},{"$f":"IF(ISERROR(SEARCH(\"Cond\",$C32)),\"\",\"Cond\")","v":""},{"$f":"IF(ISERROR(SEARCH(\"XC\",$C32)),\"\",\"XC\")","v":""},{"$f":"IF(ISERROR(SEARCH(\"Stks\",$C32)),\"\",\"Stks\")","v":""},{"$f":"IF(ISERROR(SEARCH(\"Hrd\",$C32)),\"\",\"Hrd\")","v":""},{"$f":"IF(ISERROR(SEARCH(\"Chs\",$C32)),\"\",\"Chs\")","v":""},{"$f":"IF(ISERROR(SEARCH(\" NHF\",$C32)),\"\",\"NHF\")","v":""},{"$f":"IF(ISERROR(SEARCH(\"INHF\",$C32)),\"\",\"INHF\")","v":""},{"$f":"LEFT(A32,10)","v":"27/05/2016"},{"$f":"CONCATENATE(M32,N32,O32,P32,Q32,R32,S32,T32,U32,V32,W32,X32,Y32,Z32,AB32,AA32,AC32,AD32,AE32,AF32,AG32,AH32,AK32,AL32,AI32,AJ32)","v":"Hcap"},{"$f":"IF($AN32=\"\",0,VLOOKUP($AN32,Race,1))","v":"Hcap"},{"$f":"IF($AN32<>$AO32,1,\"\")","v":""},null,{"$f":"IF($I32=\"\",0,IF($I32<Tables!$T$2,0,1))","v":1},{"$f":"IF($I32=\"\",0,IF($I32>Tables!$U$2,0,1))","v":1},{"$f":"IF($I32=\"\",0,IF($H32<VLOOKUP($K32,Course,3),0,1))","v":1},{"$f":"IF($I32=\"\",0,IF($H32>VLOOKUP($K32,Course,4),0,1))","v":0},{"$f":"IF($AN32=\"\",0,IF($H32<VLOOKUP($AN32,Race,2),0,1))","v":1},{"$f":"IF($AN32=\"\",0,IF($H32>VLOOKUP($AN32,Race,3),0,1))","v":1},{"$f":"IF($J32=\"\",0,VLOOKUP($J32,Selection,2))","v":1},{"$f":"IF(E32=0,0,IF(SUM(AR32:AX32)=$AY$1,1,0))","v":0},{"$f":"IF($AY32<>1,0,IF($G32=1,1,0))","v":0},null,{"$f":"IF($K32=\"\",0,VLOOKUP($K32,Course,3))","v":7},{"$f":"IF($K32=\"\",0,VLOOKUP($K32,Course,4))","v":8},{"$f":"IF($AN32=\"\",0,VLOOKUP($AN32,Race,2))","v":1},{"$f":"IF($AN32=\"\",0,VLOOKUP($AN32,Race,3))","v":50},{"$f":"IF($AN32=\"\",0,VLOOKUP($AN32,Race,4))","v":1},{"$f":"IF($AN32=\"\",0,VLOOKUP($AN32,Race,5))","v":50},{"$f":"WEEKDAY(AM32)","v":6},{"$f":"IF($AY32=1,5,\"\")","v":""},{"$f":"IF($AZ32=1,($I32*$BI32),\"\")","v":""},{"$f":"IF($BG32=1,($J32*$BK32),\"\")","v":""}]
["27/05/2016 19:39:51: [G_Auto] :  £ 5.00 Back bet placed on Distant Past at 8.8. Fully matched at 8.8.  Ref: 10072","19:45:44","Muss 27th May - 19:40 5f Hcap","Distant Past",29,0,null,9,8.8,{"$f":"IF(C33=C32,J32+1,3)","v":5},{"$f":"IF(C33=\"\",\"\",LEFT(C33,5))","v":"Muss"},{"$f":"IF($K33=\"\",0,VLOOKUP($K33,Course,2))","v":"Musselburgh"},{"$f":"IF(ISERROR(SEARCH(\"Charity\",$C33)),\"\",\"Charity\")","v":""},{"$f":"IF(ISERROR(SEARCH(\"PA\",$C33)),\"\",\"PA\")","v":""},{"$f":"IF(ISERROR(SEARCH(\"Class\",$C33)),\"\",\"Class\")","v":""},{"$f":"IF(ISERROR(SEARCH(\"Listed\",$C33)),\"\",\"Listed\")","v":""},{"$f":"IF(ISERROR(SEARCH(\"Grd1\",$C33)),\"\",\"Grd1\")","v":""},{"$f":"IF(ISERROR(SEARCH(\"Grd2\",$C33)),\"\",\"Grd2\")","v":""},{"$f":"IF(ISERROR(SEARCH(\"Grd3\",$C33)),\"\",\"Grd3\")","v":""},{"$f":"IF(ISERROR(SEARCH(\"Grp1\",$C33)),\"\",\"Grp1\")","v":""},{"$f":"IF(ISERROR(SEARCH(\"Grp2\",$C33)),\"\",\"Grp2\")","v":""},{"$f":"IF(ISERROR(SEARCH(\"Grp3\",$C33)),\"\",\"Grp3\")","v":""},{"$f":"IF(ISERROR(SEARCH(\"Grp 3\",$C33)),\"\",\"Grp3\")","v":""},{"$f":"IF(ISERROR(SEARCH(\"Nov\",$C33)),\"\",\"Nov\")","v":""},{"$f":"IF(ISERROR(SEARCH(\"App\",$C33)),\"\",\"App\")","v":""},{"$f":"IF(ISERROR(SEARCH(\"Sell\",$C33)),\"\",\"Sell\")","v":""},{"$f":"IF(ISERROR(SEARCH(\"Mdn\",$C33)),\"\",\"Mdn\")","v":""},{"$f":"IF(ISERROR(SEARCH(\"Beg\",$C33)),\"\",\"Beg\")","v":""},{"$f":"IF(ISERROR(SEARCH(\"Claim\",$C33)),\"\",\"Claim\")","v":""},{"$f":"IF(ISERROR(SEARCH(\"Hunt\",$C33)),\"\",\"Hunt\")","v":""},{"$f":"IF(ISERROR(SEARCH(\"Hcap\",$C33)),\"\",\"Hcap\")","v":"Hcap"},{"$f":"IF(ISERROR(SEARCH(\"Cond\",$C33)),\"\",\"Cond\")","v":""},{"$f":"IF(ISERROR(SEARCH(\"XC\",$C33)),\"\",\"XC\")","v":""},{"$f":"IF(ISERROR(SEARCH(\"Stks\",$C33)),\"\",\"Stks\")","v":""},{"$f":"IF(ISERROR(SEARCH(\"Hrd\",$C33)),\"\",\"Hrd\")","v":""},{"$f":"IF(ISERROR(SEARCH(\"Chs\",$C33)),\"\",\"Chs\")","v":""},{"$f":"IF(ISERROR(SEARCH(\" NHF\",$C33)),\"\",\"NHF\")","v":""},{"$f":"IF(ISERROR(SEARCH(\"INHF\",$C33)),\"\",\"INHF\")","v":""},{"$f":"LEFT(A33,10)","v":"27/05/2016"},{"$f":"CONCATENATE(M33,N33,O33,P33,Q33,R33,S33,T33,U33,V33,W33,X33,Y33,Z33,AB33,AA33,AC33,AD33,AE33,AF33,AG33,AH33,AK33,AL33,AI33,AJ33)","v":"Hcap"},{"$f":"IF($AN33=\"\",0,VLOOKUP($AN33,Race,1))","v":"Hcap"},{"$f":"IF($AN33<>$AO33,1,\"\")","v":""},null,{"$f":"IF($I33=\"\",0,IF($I33<Tables!$T$2,0,1))","v":1},{"$f":"IF($I33=\"\",0,IF($I33>Tables!$U$2,0,1))","v":1},{"$f":"IF($I33=\"\",0,IF($H33<VLOOKUP($K33,Course,3),0,1))","v":1},{"$f":"IF($I33=\"\",0,IF($H33>VLOOKUP($K33,Course,4),0,1))","v":0},{"$f":"IF($AN33=\"\",0,IF($H33<VLOOKUP($AN33,Race,2),0,1))","v":1},{"$f":"IF($AN33=\"\",0,IF($H33>VLOOKUP($AN33,Race,3),0,1))","v":1},{"$f":"IF($J33=\"\",0,VLOOKUP($J33,Selection,2))","v":1},{"$f":"IF(E33=0,0,IF(SUM(AR33:AX33)=$AY$1,1,0))","v":0},{"$f":"IF($AY33<>1,0,IF($G33=1,1,0))","v":0},null,{"$f":"IF($K33=\"\",0,VLOOKUP($K33,Course,3))","v":7},{"$f":"IF($K33=\"\",0,VLOOKUP($K33,Course,4))","v":8},{"$f":"IF($AN33=\"\",0,VLOOKUP($AN33,Race,2))","v":1},{"$f":"IF($AN33=\"\",0,VLOOKUP($AN33,Race,3))","v":50},{"$f":"IF($AN33=\"\",0,VLOOKUP($AN33,Race,4))","v":1},{"$f":"IF($AN33=\"\",0,VLOOKUP($AN33,Race,5))","v":50},{"$f":"WEEKDAY(AM33)","v":6},{"$f":"IF($AY33=1,5,\"\")","v":""},{"$f":"IF($AZ33=1,($I33*$BI33),\"\")","v":""},{"$f":"IF($BG33=1,($J33*$BK33),\"\")","v":""}]
["27/05/2016 19:49:44: [G_Auto] :  £ 5.00 Back bet placed on Deciding Moment at 5.2. Fully matched at 5.2.  Ref: 10076","20:03:47","Worc 27th May - 19:50 2m7f Nov Hrd","Deciding Moment",16,0,1,7,5.2,{"$f":"IF(C34=C33,J33+1,3)","v":3},{"$f":"IF(C34=\"\",\"\",LEFT(C34,5))","v":"Worc"},{"$f":"IF($K34=\"\",0,VLOOKUP($K34,Course,2))","v":"Worcester"},{"$f":"IF(ISERROR(SEARCH(\"Charity\",$C34)),\"\",\"Charity\")","v":""},{"$f":"IF(ISERROR(SEARCH(\"PA\",$C34)),\"\",\"PA\")","v":""},{"$f":"IF(ISERROR(SEARCH(\"Class\",$C34)),\"\",\"Class\")","v":""},{"$f":"IF(ISERROR(SEARCH(\"Listed\",$C34)),\"\",\"Listed\")","v":""},{"$f":"IF(ISERROR(SEARCH(\"Grd1\",$C34)),\"\",\"Grd1\")","v":""},{"$f":"IF(ISERROR(SEARCH(\"Grd2\",$C34)),\"\",\"Grd2\")","v":""},{"$f":"IF(ISERROR(SEARCH(\"Grd3\",$C34)),\"\",\"Grd3\")","v":""},{"$f":"IF(ISERROR(SEARCH(\"Grp1\",$C34)),\"\",\"Grp1\")","v":""},{"$f":"IF(ISERROR(SEARCH(\"Grp2\",$C34)),\"\",\"Grp2\")","v":""},{"$f":"IF(ISERROR(SEARCH(\"Grp3\",$C34)),\"\",\"Grp3\")","v":""},{"$f":"IF(ISERROR(SEARCH(\"Grp 3\",$C34)),\"\",\"Grp3\")","v":""},{"$f":"IF(ISERROR(SEARCH(\"Nov\",$C34)),\"\",\"Nov\")","v":"Nov"},{"$f":"IF(ISERROR(SEARCH(\"App\",$C34)),\"\",\"App\")","v":""},{"$f":"IF(ISERROR(SEARCH(\"Sell\",$C34)),\"\",\"Sell\")","v":""},{"$f":"IF(ISERROR(SEARCH(\"Mdn\",$C34)),\"\",\"Mdn\")","v":""},{"$f":"IF(ISERROR(SEARCH(\"Beg\",$C34)),\"\",\"Beg\")","v":""},{"$f":"IF(ISERROR(SEARCH(\"Claim\",$C34)),\"\",\"Claim\")","v":""},{"$f":"IF(ISERROR(SEARCH(\"Hunt\",$C34)),\"\",\"Hunt\")","v":""},{"$f":"IF(ISERROR(SEARCH(\"Hcap\",$C34)),\"\",\"Hcap\")","v":""},{"$f":"IF(ISERROR(SEARCH(\"Cond\",$C34)),\"\",\"Cond\")","v":""},{"$f":"IF(ISERROR(SEARCH(\"XC\",$C34)),\"\",\"XC\")","v":""},{"$f":"IF(ISERROR(SEARCH(\"Stks\",$C34)),\"\",\"Stks\")","v":""},{"$f":"IF(ISERROR(SEARCH(\"Hrd\",$C34)),\"\",\"Hrd\")","v":"Hrd"},{"$f":"IF(ISERROR(SEARCH(\"Chs\",$C34)),\"\",\"Chs\")","v":""},{"$f":"IF(ISERROR(SEARCH(\" NHF\",$C34)),\"\",\"NHF\")","v":""},{"$f":"IF(ISERROR(SEARCH(\"INHF\",$C34)),\"\",\"INHF\")","v":""},{"$f":"LEFT(A34,10)","v":"27/05/2016"},{"$f":"CONCATENATE(M34,N34,O34,P34,Q34,R34,S34,T34,U34,V34,W34,X34,Y34,Z34,AB34,AA34,AC34,AD34,AE34,AF34,AG34,AH34,AK34,AL34,AI34,AJ34)","v":"NovHrd"},{"$f":"IF($AN34=\"\",0,VLOOKUP($AN34,Race,1))","v":"NovHrd"},{"$f":"IF($AN34<>$AO34,1,\"\")","v":""},null,{"$f":"IF($I34=\"\",0,IF($I34<Tables!$T$2,0,1))","v":1},{"$f":"IF($I34=\"\",0,IF($I34>Tables!$U$2,0,1))","v":1},{"$f":"IF($I34=\"\",0,IF($H34<VLOOKUP($K34,Course,3),0,1))","v":1},{"$f":"IF($I34=\"\",0,IF($H34>VLOOKUP($K34,Course,4),0,1))","v":1},{"$f":"IF($AN34=\"\",0,IF($H34<VLOOKUP($AN34,Race,2),0,1))","v":1},{"$f":"IF($AN34=\"\",0,IF($H34>VLOOKUP($AN34,Race,3),0,1))","v":1},{"$f":"IF($J34=\"\",0,VLOOKUP($J34,Selection,2))","v":1},{"$f":"IF(E34=0,0,IF(SUM(AR34:AX34)=$AY$1,1,0))","v":1},{"$f":"IF($AY34<>1,0,IF($G34=1,1,0))","v":1},null,{"$f":"IF($K34=\"\",0,VLOOKUP($K34,Course,3))","v":7},{"$f":"IF($K34=\"\",0,VLOOKUP($K34,Course,4))","v":9},{"$f":"IF($AN34=\"\",0,VLOOKUP($AN34,Race,2))","v":1},{"$f":"IF($AN34=\"\",0,VLOOKUP($AN34,Race,3))","v":50},{"$f":"IF($AN34=\"\",0,VLOOKUP($AN34,Race,4))","v":1},{"$f":"IF($AN34=\"\",0,VLOOKUP($AN34,Race,5))","v":50},{"$f":"WEEKDAY(AM34)","v":6},{"$f":"IF($AY34=1,5,\"\")","v":5},{"$f":"IF($AZ34=1,($I34*$BI34),\"\")","v":26},{"$f":"IF($BG34=1,($J34*$BK34),\"\")","v":""}]
["27/05/2016 19:49:49: [G_Auto] :  £ 5.00 Back bet placed on Babeny Bridge at 5. Fully matched at 5.  Ref: 10077","20:03:47","Worc 27th May - 19:50 2m7f Nov Hrd","Babeny Bridge",15,0,null,7,5,{"$f":"IF(C35=C34,J34+1,3)","v":4},{"$f":"IF(C35=\"\",\"\",LEFT(C35,5))","v":"Worc"},{"$f":"IF($K35=\"\",0,VLOOKUP($K35,Course,2))","v":"Worcester"},{"$f":"IF(ISERROR(SEARCH(\"Charity\",$C35)),\"\",\"Charity\")","v":""},{"$f":"IF(ISERROR(SEARCH(\"PA\",$C35)),\"\",\"PA\")","v":""},{"$f":"IF(ISERROR(SEARCH(\"Class\",$C35)),\"\",\"Class\")","v":""},{"$f":"IF(ISERROR(SEARCH(\"Listed\",$C35)),\"\",\"Listed\")","v":""},{"$f":"IF(ISERROR(SEARCH(\"Grd1\",$C35)),\"\",\"Grd1\")","v":""},{"$f":"IF(ISERROR(SEARCH(\"Grd2\",$C35)),\"\",\"Grd2\")","v":""},{"$f":"IF(ISERROR(SEARCH(\"Grd3\",$C35)),\"\",\"Grd3\")","v":""},{"$f":"IF(ISERROR(SEARCH(\"Grp1\",$C35)),\"\",\"Grp1\")","v":""},{"$f":"IF(ISERROR(SEARCH(\"Grp2\",$C35)),\"\",\"Grp2\")","v":""},{"$f":"IF(ISERROR(SEARCH(\"Grp3\",$C35)),\"\",\"Grp3\")","v":""},{"$f":"IF(ISERROR(SEARCH(\"Grp 3\",$C35)),\"\",\"Grp3\")","v":""},{"$f":"IF(ISERROR(SEARCH(\"Nov\",$C35)),\"\",\"Nov\")","v":"Nov"},{"$f":"IF(ISERROR(SEARCH(\"App\",$C35)),\"\",\"App\")","v":""},{"$f":"IF(ISERROR(SEARCH(\"Sell\",$C35)),\"\",\"Sell\")","v":""},{"$f":"IF(ISERROR(SEARCH(\"Mdn\",$C35)),\"\",\"Mdn\")","v":""},{"$f":"IF(ISERROR(SEARCH(\"Beg\",$C35)),\"\",\"Beg\")","v":""},{"$f":"IF(ISERROR(SEARCH(\"Claim\",$C35)),\"\",\"Claim\")","v":""},{"$f":"IF(ISERROR(SEARCH(\"Hunt\",$C35)),\"\",\"Hunt\")","v":""},{"$f":"IF(ISERROR(SEARCH(\"Hcap\",$C35)),\"\",\"Hcap\")","v":""},{"$f":"IF(ISERROR(SEARCH(\"Cond\",$C35)),\"\",\"Cond\")","v":""},{"$f":"IF(ISERROR(SEARCH(\"XC\",$C35)),\"\",\"XC\")","v":""},{"$f":"IF(ISERROR(SEARCH(\"Stks\",$C35)),\"\",\"Stks\")","v":""},{"$f":"IF(ISERROR(SEARCH(\"Hrd\",$C35)),\"\",\"Hrd\")","v":"Hrd"},{"$f":"IF(ISERROR(SEARCH(\"Chs\",$C35)),\"\",\"Chs\")","v":""},{"$f":"IF(ISERROR(SEARCH(\" NHF\",$C35)),\"\",\"NHF\")","v":""},{"$f":"IF(ISERROR(SEARCH(\"INHF\",$C35)),\"\",\"INHF\")","v":""},{"$f":"LEFT(A35,10)","v":"27/05/2016"},{"$f":"CONCATENATE(M35,N35,O35,P35,Q35,R35,S35,T35,U35,V35,W35,X35,Y35,Z35,AB35,AA35,AC35,AD35,AE35,AF35,AG35,AH35,AK35,AL35,AI35,AJ35)","v":"NovHrd"},{"$f":"IF($AN35=\"\",0,VLOOKUP($AN35,Race,1))","v":"NovHrd"},{"$f":"IF($AN35<>$AO35,1,\"\")","v":""},null,{"$f":"IF($I35=\"\",0,IF($I35<Tables!$T$2,0,1))","v":1},{"$f":"IF($I35=\"\",0,IF($I35>Tables!$U$2,0,1))","v":1},{"$f":"IF($I35=\"\",0,IF($H35<VLOOKUP($K35,Course,3),0,1))","v":1},{"$f":"IF($I35=\"\",0,IF($H35>VLOOKUP($K35,Course,4),0,1))","v":1},{"$f":"IF($AN35=\"\",0,IF($H35<VLOOKUP($AN35,Race,2),0,1))","v":1},{"$f":"IF($AN35=\"\",0,IF($H35>VLOOKUP($AN35,Race,3),0,1))","v":1},{"$f":"IF($J35=\"\",0,VLOOKUP($J35,Selection,2))","v":1},{"$f":"IF(E35=0,0,IF(SUM(AR35:AX35)=$AY$1,1,0))","v":1},{"$f":"IF($AY35<>1,0,IF($G35=1,1,0))","v":0},null,{"$f":"IF($K35=\"\",0,VLOOKUP($K35,Course,3))","v":7},{"$f":"IF($K35=\"\",0,VLOOKUP($K35,Course,4))","v":9},{"$f":"IF($AN35=\"\",0,VLOOKUP($AN35,Race,2))","v":1},{"$f":"IF($AN35=\"\",0,VLOOKUP($AN35,Race,3))","v":50},{"$f":"IF($AN35=\"\",0,VLOOKUP($AN35,Race,4))","v":1},{"$f":"IF($AN35=\"\",0,VLOOKUP($AN35,Race,5))","v":50},{"$f":"WEEKDAY(AM35)","v":6},{"$f":"IF($AY35=1,5,\"\")","v":5},{"$f":"IF($AZ35=1,($I35*$BI35),\"\")","v":""},{"$f":"IF($BG35=1,($J35*$BK35),\"\")","v":""}]
["27/05/2016 19:59:48: [G_Auto] :  £ 5.00 Back bet placed on Master Bond at 8.6. Fully matched at 8.6.  Ref: 10080","20:07:54","Ponte 27th May - 20:00 5f Hcap","Master Bond",23,0,null,11,8.6,{"$f":"IF(C36=C35,J35+1,3)","v":3},{"$f":"IF(C36=\"\",\"\",LEFT(C36,5))","v":"Ponte"},{"$f":"IF($K36=\"\",0,VLOOKUP($K36,Course,2))","v":"Pontefract"},{"$f":"IF(ISERROR(SEARCH(\"Charity\",$C36)),\"\",\"Charity\")","v":""},{"$f":"IF(ISERROR(SEARCH(\"PA\",$C36)),\"\",\"PA\")","v":""},{"$f":"IF(ISERROR(SEARCH(\"Class\",$C36)),\"\",\"Class\")","v":""},{"$f":"IF(ISERROR(SEARCH(\"Listed\",$C36)),\"\",\"Listed\")","v":""},{"$f":"IF(ISERROR(SEARCH(\"Grd1\",$C36)),\"\",\"Grd1\")","v":""},{"$f":"IF(ISERROR(SEARCH(\"Grd2\",$C36)),\"\",\"Grd2\")","v":""},{"$f":"IF(ISERROR(SEARCH(\"Grd3\",$C36)),\"\",\"Grd3\")","v":""},{"$f":"IF(ISERROR(SEARCH(\"Grp1\",$C36)),\"\",\"Grp1\")","v":""},{"$f":"IF(ISERROR(SEARCH(\"Grp2\",$C36)),\"\",\"Grp2\")","v":""},{"$f":"IF(ISERROR(SEARCH(\"Grp3\",$C36)),\"\",\"Grp3\")","v":""},{"$f":"IF(ISERROR(SEARCH(\"Grp 3\",$C36)),\"\",\"Grp3\")","v":""},{"$f":"IF(ISERROR(SEARCH(\"Nov\",$C36)),\"\",\"Nov\")","v":""},{"$f":"IF(ISERROR(SEARCH(\"App\",$C36)),\"\",\"App\")","v":""},{"$f":"IF(ISERROR(SEARCH(\"Sell\",$C36)),\"\",\"Sell\")","v":""},{"$f":"IF(ISERROR(SEARCH(\"Mdn\",$C36)),\"\",\"Mdn\")","v":""},{"$f":"IF(ISERROR(SEARCH(\"Beg\",$C36)),\"\",\"Beg\")","v":""},{"$f":"IF(ISERROR(SEARCH(\"Claim\",$C36)),\"\",\"Claim\")","v":""},{"$f":"IF(ISERROR(SEARCH(\"Hunt\",$C36)),\"\",\"Hunt\")","v":""},{"$f":"IF(ISERROR(SEARCH(\"Hcap\",$C36)),\"\",\"Hcap\")","v":"Hcap"},{"$f":"IF(ISERROR(SEARCH(\"Cond\",$C36)),\"\",\"Cond\")","v":""},{"$f":"IF(ISERROR(SEARCH(\"XC\",$C36)),\"\",\"XC\")","v":""},{"$f":"IF(ISERROR(SEARCH(\"Stks\",$C36)),\"\",\"Stks\")","v":""},{"$f":"IF(ISERROR(SEARCH(\"Hrd\",$C36)),\"\",\"Hrd\")","v":""},{"$f":"IF(ISERROR(SEARCH(\"Chs\",$C36)),\"\",\"Chs\")","v":""},{"$f":"IF(ISERROR(SEARCH(\" NHF\",$C36)),\"\",\"NHF\")","v":""},{"$f":"IF(ISERROR(SEARCH(\"INHF\",$C36)),\"\",\"INHF\")","v":""},{"$f":"LEFT(A36,10)","v":"27/05/2016"},{"$f":"CONCATENATE(M36,N36,O36,P36,Q36,R36,S36,T36,U36,V36,W36,X36,Y36,Z36,AB36,AA36,AC36,AD36,AE36,AF36,AG36,AH36,AK36,AL36,AI36,AJ36)","v":"Hcap"},{"$f":"IF($AN36=\"\",0,VLOOKUP($AN36,Race,1))","v":"Hcap"},{"$f":"IF($AN36<>$AO36,1,\"\")","v":""},null,{"$f":"IF($I36=\"\",0,IF($I36<Tables!$T$2,0,1))","v":1},{"$f":"IF($I36=\"\",0,IF($I36>Tables!$U$2,0,1))","v":1},{"$f":"IF($I36=\"\",0,IF($H36<VLOOKUP($K36,Course,3),0,1))","v":0},{"$f":"IF($I36=\"\",0,IF($H36>VLOOKUP($K36,Course,4),0,1))","v":1},{"$f":"IF($AN36=\"\",0,IF($H36<VLOOKUP($AN36,Race,2),0,1))","v":1},{"$f":"IF($AN36=\"\",0,IF($H36>VLOOKUP($AN36,Race,3),0,1))","v":1},{"$f":"IF($J36=\"\",0,VLOOKUP($J36,Selection,2))","v":1},{"$f":"IF(E36=0,0,IF(SUM(AR36:AX36)=$AY$1,1,0))","v":0},{"$f":"IF($AY36<>1,0,IF($G36=1,1,0))","v":0},null,{"$f":"IF($K36=\"\",0,VLOOKUP($K36,Course,3))","v":99},{"$f":"IF($K36=\"\",0,VLOOKUP($K36,Course,4))","v":99},{"$f":"IF($AN36=\"\",0,VLOOKUP($AN36,Race,2))","v":1},{"$f":"IF($AN36=\"\",0,VLOOKUP($AN36,Race,3))","v":50},{"$f":"IF($AN36=\"\",0,VLOOKUP($AN36,Race,4))","v":1},{"$f":"IF($AN36=\"\",0,VLOOKUP($AN36,Race,5))","v":50},{"$f":"WEEKDAY(AM36)","v":6},{"$f":"IF($AY36=1,5,\"\")","v":""},{"$f":"IF($AZ36=1,($I36*$BI36),\"\")","v":""},{"$f":"IF($BG36=1,($J36*$BK36),\"\")","v":""}]
["27/05/2016 19:59:53: [G_Auto] :  £ 5.00 Back bet placed on Desert Ace at 10. Fully matched at 10.  Ref: 10082","20:07:54","Ponte 27th May - 20:00 5f Hcap","Desert Ace",30,0,null,11,10,{"$f":"IF(C37=C36,J36+1,3)","v":4},{"$f":"IF(C37=\"\",\"\",LEFT(C37,5))","v":"Ponte"},{"$f":"IF($K37=\"\",0,VLOOKUP($K37,Course,2))","v":"Pontefract"},{"$f":"IF(ISERROR(SEARCH(\"Charity\",$C37)),\"\",\"Charity\")","v":""},{"$f":"IF(ISERROR(SEARCH(\"PA\",$C37)),\"\",\"PA\")","v":""},{"$f":"IF(ISERROR(SEARCH(\"Class\",$C37)),\"\",\"Class\")","v":""},{"$f":"IF(ISERROR(SEARCH(\"Listed\",$C37)),\"\",\"Listed\")","v":""},{"$f":"IF(ISERROR(SEARCH(\"Grd1\",$C37)),\"\",\"Grd1\")","v":""},{"$f":"IF(ISERROR(SEARCH(\"Grd2\",$C37)),\"\",\"Grd2\")","v":""},{"$f":"IF(ISERROR(SEARCH(\"Grd3\",$C37)),\"\",\"Grd3\")","v":""},{"$f":"IF(ISERROR(SEARCH(\"Grp1\",$C37)),\"\",\"Grp1\")","v":""},{"$f":"IF(ISERROR(SEARCH(\"Grp2\",$C37)),\"\",\"Grp2\")","v":""},{"$f":"IF(ISERROR(SEARCH(\"Grp3\",$C37)),\"\",\"Grp3\")","v":""},{"$f":"IF(ISERROR(SEARCH(\"Grp 3\",$C37)),\"\",\"Grp3\")","v":""},{"$f":"IF(ISERROR(SEARCH(\"Nov\",$C37)),\"\",\"Nov\")","v":""},{"$f":"IF(ISERROR(SEARCH(\"App\",$C37)),\"\",\"App\")","v":""},{"$f":"IF(ISERROR(SEARCH(\"Sell\",$C37)),\"\",\"Sell\")","v":""},{"$f":"IF(ISERROR(SEARCH(\"Mdn\",$C37)),\"\",\"Mdn\")","v":""},{"$f":"IF(ISERROR(SEARCH(\"Beg\",$C37)),\"\",\"Beg\")","v":""},{"$f":"IF(ISERROR(SEARCH(\"Claim\",$C37)),\"\",\"Claim\")","v":""},{"$f":"IF(ISERROR(SEARCH(\"Hunt\",$C37)),\"\",\"Hunt\")","v":""},{"$f":"IF(ISERROR(SEARCH(\"Hcap\",$C37)),\"\",\"Hcap\")","v":"Hcap"},{"$f":"IF(ISERROR(SEARCH(\"Cond\",$C37)),\"\",\"Cond\")","v":""},{"$f":"IF(ISERROR(SEARCH(\"XC\",$C37)),\"\",\"XC\")","v":""},{"$f":"IF(ISERROR(SEARCH(\"Stks\",$C37)),\"\",\"Stks\")","v":""},{"$f":"IF(ISERROR(SEARCH(\"Hrd\",$C37)),\"\",\"Hrd\")","v":""},{"$f":"IF(ISERROR(SEARCH(\"Chs\",$C37)),\"\",\"Chs\")","v":""},{"$f":"IF(ISERROR(SEARCH(\" NHF\",$C37)),\"\",\"NHF\")","v":""},{"$f":"IF(ISERROR(SEARCH(\"INHF\",$C37)),\"\",\"INHF\")","v":""},{"$f":"LEFT(A37,10)","v":"27/05/2016"},{"$f":"CONCATENATE(M37,N37,O37,P37,Q37,R37,S37,T37,U37,V37,W37,X37,Y37,Z37,AB37,AA37,AC37,AD37,AE37,AF37,AG37,AH37,AK37,AL37,AI37,AJ37)","v":"Hcap"},{"$f":"IF($AN37=\"\",0,VLOOKUP($AN37,Race,1))","v":"Hcap"},{"$f":"IF($AN37<>$AO37,1,\"\")","v":""},null,{"$f":"IF($I37=\"\",0,IF($I37<Tables!$T$2,0,1))","v":1},{"$f":"IF($I37=\"\",0,IF($I37>Tables!$U$2,0,1))","v":1},{"$f":"IF($I37=\"\",0,IF($H37<VLOOKUP($K37,Course,3),0,1))","v":0},{"$f":"IF($I37=\"\",0,IF($H37>VLOOKUP($K37,Course,4),0,1))","v":1},{"$f":"IF($AN37=\"\",0,IF($H37<VLOOKUP($AN37,Race,2),0,1))","v":1},{"$f":"IF($AN37=\"\",0,IF($H37>VLOOKUP($AN37,Race,3),0,1))","v":1},{"$f":"IF($J37=\"\",0,VLOOKUP($J37,Selection,2))","v":1},{"$f":"IF(E37=0,0,IF(SUM(AR37:AX37)=$AY$1,1,0))","v":0},{"$f":"IF($AY37<>1,0,IF($G37=1,1,0))","v":0},null,{"$f":"IF($K37=\"\",0,VLOOKUP($K37,Course,3))","v":99},{"$f":"IF($K37=\"\",0,VLOOKUP($K37,Course,4))","v":99},{"$f":"IF($AN37=\"\",0,VLOOKUP($AN37,Race,2))","v":1},{"$f":"IF($AN37=\"\",0,VLOOKUP($AN37,Race,3))","v":50},{"$f":"IF($AN37=\"\",0,VLOOKUP($AN37,Race,4))","v":1},{"$f":"IF($AN37=\"\",0,VLOOKUP($AN37,Race,5))","v":50},{"$f":"WEEKDAY(AM37)","v":6},{"$f":"IF($AY37=1,5,\"\")","v":""},{"$f":"IF($AZ37=1,($I37*$BI37),\"\")","v":""},{"$f":"IF($BG37=1,($J37*$BK37),\"\")","v":""}]
["27/05/2016 19:59:42: [G_Auto] :  £ 5.00 Back bet placed on Kibaar at 8. Fully matched at 8.  Ref: 10078","20:07:54","Ponte 27th May - 20:00 5f Hcap","Kibaar",20,0,null,11,8,{"$f":"IF(C38=C37,J37+1,3)","v":5},{"$f":"IF(C38=\"\",\"\",LEFT(C38,5))","v":"Ponte"},{"$f":"IF($K38=\"\",0,VLOOKUP($K38,Course,2))","v":"Pontefract"},{"$f":"IF(ISERROR(SEARCH(\"Charity\",$C38)),\"\",\"Charity\")","v":""},{"$f":"IF(ISERROR(SEARCH(\"PA\",$C38)),\"\",\"PA\")","v":""},{"$f":"IF(ISERROR(SEARCH(\"Class\",$C38)),\"\",\"Class\")","v":""},{"$f":"IF(ISERROR(SEARCH(\"Listed\",$C38)),\"\",\"Listed\")","v":""},{"$f":"IF(ISERROR(SEARCH(\"Grd1\",$C38)),\"\",\"Grd1\")","v":""},{"$f":"IF(ISERROR(SEARCH(\"Grd2\",$C38)),\"\",\"Grd2\")","v":""},{"$f":"IF(ISERROR(SEARCH(\"Grd3\",$C38)),\"\",\"Grd3\")","v":""},{"$f":"IF(ISERROR(SEARCH(\"Grp1\",$C38)),\"\",\"Grp1\")","v":""},{"$f":"IF(ISERROR(SEARCH(\"Grp2\",$C38)),\"\",\"Grp2\")","v":""},{"$f":"IF(ISERROR(SEARCH(\"Grp3\",$C38)),\"\",\"Grp3\")","v":""},{"$f":"IF(ISERROR(SEARCH(\"Grp 3\",$C38)),\"\",\"Grp3\")","v":""},{"$f":"IF(ISERROR(SEARCH(\"Nov\",$C38)),\"\",\"Nov\")","v":""},{"$f":"IF(ISERROR(SEARCH(\"App\",$C38)),\"\",\"App\")","v":""},{"$f":"IF(ISERROR(SEARCH(\"Sell\",$C38)),\"\",\"Sell\")","v":""},{"$f":"IF(ISERROR(SEARCH(\"Mdn\",$C38)),\"\",\"Mdn\")","v":""},{"$f":"IF(ISERROR(SEARCH(\"Beg\",$C38)),\"\",\"Beg\")","v":""},{"$f":"IF(ISERROR(SEARCH(\"Claim\",$C38)),\"\",\"Claim\")","v":""},{"$f":"IF(ISERROR(SEARCH(\"Hunt\",$C38)),\"\",\"Hunt\")","v":""},{"$f":"IF(ISERROR(SEARCH(\"Hcap\",$C38)),\"\",\"Hcap\")","v":"Hcap"},{"$f":"IF(ISERROR(SEARCH(\"Cond\",$C38)),\"\",\"Cond\")","v":""},{"$f":"IF(ISERROR(SEARCH(\"XC\",$C38)),\"\",\"XC\")","v":""},{"$f":"IF(ISERROR(SEARCH(\"Stks\",$C38)),\"\",\"Stks\")","v":""},{"$f":"IF(ISERROR(SEARCH(\"Hrd\",$C38)),\"\",\"Hrd\")","v":""},{"$f":"IF(ISERROR(SEARCH(\"Chs\",$C38)),\"\",\"Chs\")","v":""},{"$f":"IF(ISERROR(SEARCH(\" NHF\",$C38)),\"\",\"NHF\")","v":""},{"$f":"IF(ISERROR(SEARCH(\"INHF\",$C38)),\"\",\"INHF\")","v":""},{"$f":"LEFT(A38,10)","v":"27/05/2016"},{"$f":"CONCATENATE(M38,N38,O38,P38,Q38,R38,S38,T38,U38,V38,W38,X38,Y38,Z38,AB38,AA38,AC38,AD38,AE38,AF38,AG38,AH38,AK38,AL38,AI38,AJ38)","v":"Hcap"},{"$f":"IF($AN38=\"\",0,VLOOKUP($AN38,Race,1))","v":"Hcap"},{"$f":"IF($AN38<>$AO38,1,\"\")","v":""},null,{"$f":"IF($I38=\"\",0,IF($I38<Tables!$T$2,0,1))","v":1},{"$f":"IF($I38=\"\",0,IF($I38>Tables!$U$2,0,1))","v":1},{"$f":"IF($I38=\"\",0,IF($H38<VLOOKUP($K38,Course,3),0,1))","v":0},{"$f":"IF($I38=\"\",0,IF($H38>VLOOKUP($K38,Course,4),0,1))","v":1},{"$f":"IF($AN38=\"\",0,IF($H38<VLOOKUP($AN38,Race,2),0,1))","v":1},{"$f":"IF($AN38=\"\",0,IF($H38>VLOOKUP($AN38,Race,3),0,1))","v":1},{"$f":"IF($J38=\"\",0,VLOOKUP($J38,Selection,2))","v":1},{"$f":"IF(E38=0,0,IF(SUM(AR38:AX38)=$AY$1,1,0))","v":0},{"$f":"IF($AY38<>1,0,IF($G38=1,1,0))","v":0},null,{"$f":"IF($K38=\"\",0,VLOOKUP($K38,Course,3))","v":99},{"$f":"IF($K38=\"\",0,VLOOKUP($K38,Course,4))","v":99},{"$f":"IF($AN38=\"\",0,VLOOKUP($AN38,Race,2))","v":1},{"$f":"IF($AN38=\"\",0,VLOOKUP($AN38,Race,3))","v":50},{"$f":"IF($AN38=\"\",0,VLOOKUP($AN38,Race,4))","v":1},{"$f":"IF($AN38=\"\",0,VLOOKUP($AN38,Race,5))","v":50},{"$f":"WEEKDAY(AM38)","v":6},{"$f":"IF($AY38=1,5,\"\")","v":""},{"$f":"IF($AZ38=1,($I38*$BI38),\"\")","v":""},{"$f":"IF($BG38=1,($J38*$BK38),\"\")","v":""}]
["27/05/2016 19:59:59: [G_Auto] :  £ 5.00 Back bet placed on Alpha Delphini at 12. Fully matched at 12.  Ref: 10084","20:07:54","Ponte 27th May - 20:00 5f Hcap","Alpha Delphini",40,0,null,11,12,{"$f":"IF(C39=C38,J38+1,3)","v":6},{"$f":"IF(C39=\"\",\"\",LEFT(C39,5))","v":"Ponte"},{"$f":"IF($K39=\"\",0,VLOOKUP($K39,Course,2))","v":"Pontefract"},{"$f":"IF(ISERROR(SEARCH(\"Charity\",$C39)),\"\",\"Charity\")","v":""},{"$f":"IF(ISERROR(SEARCH(\"PA\",$C39)),\"\",\"PA\")","v":""},{"$f":"IF(ISERROR(SEARCH(\"Class\",$C39)),\"\",\"Class\")","v":""},{"$f":"IF(ISERROR(SEARCH(\"Listed\",$C39)),\"\",\"Listed\")","v":""},{"$f":"IF(ISERROR(SEARCH(\"Grd1\",$C39)),\"\",\"Grd1\")","v":""},{"$f":"IF(ISERROR(SEARCH(\"Grd2\",$C39)),\"\",\"Grd2\")","v":""},{"$f":"IF(ISERROR(SEARCH(\"Grd3\",$C39)),\"\",\"Grd3\")","v":""},{"$f":"IF(ISERROR(SEARCH(\"Grp1\",$C39)),\"\",\"Grp1\")","v":""},{"$f":"IF(ISERROR(SEARCH(\"Grp2\",$C39)),\"\",\"Grp2\")","v":""},{"$f":"IF(ISERROR(SEARCH(\"Grp3\",$C39)),\"\",\"Grp3\")","v":""},{"$f":"IF(ISERROR(SEARCH(\"Grp 3\",$C39)),\"\",\"Grp3\")","v":""},{"$f":"IF(ISERROR(SEARCH(\"Nov\",$C39)),\"\",\"Nov\")","v":""},{"$f":"IF(ISERROR(SEARCH(\"App\",$C39)),\"\",\"App\")","v":""},{"$f":"IF(ISERROR(SEARCH(\"Sell\",$C39)),\"\",\"Sell\")","v":""},{"$f":"IF(ISERROR(SEARCH(\"Mdn\",$C39)),\"\",\"Mdn\")","v":""},{"$f":"IF(ISERROR(SEARCH(\"Beg\",$C39)),\"\",\"Beg\")","v":""},{"$f":"IF(ISERROR(SEARCH(\"Claim\",$C39)),\"\",\"Claim\")","v":""},{"$f":"IF(ISERROR(SEARCH(\"Hunt\",$C39)),\"\",\"Hunt\")","v":""},{"$f":"IF(ISERROR(SEARCH(\"Hcap\",$C39)),\"\",\"Hcap\")","v":"Hcap"},{"$f":"IF(ISERROR(SEARCH(\"Cond\",$C39)),\"\",\"Cond\")","v":""},{"$f":"IF(ISERROR(SEARCH(\"XC\",$C39)),\"\",\"XC\")","v":""},{"$f":"IF(ISERROR(SEARCH(\"Stks\",$C39)),\"\",\"Stks\")","v":""},{"$f":"IF(ISERROR(SEARCH(\"Hrd\",$C39)),\"\",\"Hrd\")","v":""},{"$f":"IF(ISERROR(SEARCH(\"Chs\",$C39)),\"\",\"Chs\")","v":""},{"$f":"IF(ISERROR(SEARCH(\" NHF\",$C39)),\"\",\"NHF\")","v":""},{"$f":"IF(ISERROR(SEARCH(\"INHF\",$C39)),\"\",\"INHF\")","v":""},{"$f":"LEFT(A39,10)","v":"27/05/2016"},{"$f":"CONCATENATE(M39,N39,O39,P39,Q39,R39,S39,T39,U39,V39,W39,X39,Y39,Z39,AB39,AA39,AC39,AD39,AE39,AF39,AG39,AH39,AK39,AL39,AI39,AJ39)","v":"Hcap"},{"$f":"IF($AN39=\"\",0,VLOOKUP($AN39,Race,1))","v":"Hcap"},{"$f":"IF($AN39<>$AO39,1,\"\")","v":""},null,{"$f":"IF($I39=\"\",0,IF($I39<Tables!$T$2,0,1))","v":1},{"$f":"IF($I39=\"\",0,IF($I39>Tables!$U$2,0,1))","v":1},{"$f":"IF($I39=\"\",0,IF($H39<VLOOKUP($K39,Course,3),0,1))","v":0},{"$f":"IF($I39=\"\",0,IF($H39>VLOOKUP($K39,Course,4),0,1))","v":1},{"$f":"IF($AN39=\"\",0,IF($H39<VLOOKUP($AN39,Race,2),0,1))","v":1},{"$f":"IF($AN39=\"\",0,IF($H39>VLOOKUP($AN39,Race,3),0,1))","v":1},{"$f":"IF($J39=\"\",0,VLOOKUP($J39,Selection,2))","v":0},{"$f":"IF(E39=0,0,IF(SUM(AR39:AX39)=$AY$1,1,0))","v":0},{"$f":"IF($AY39<>1,0,IF($G39=1,1,0))","v":0},null,{"$f":"IF($K39=\"\",0,VLOOKUP($K39,Course,3))","v":99},{"$f":"IF($K39=\"\",0,VLOOKUP($K39,Course,4))","v":99},{"$f":"IF($AN39=\"\",0,VLOOKUP($AN39,Race,2))","v":1},{"$f":"IF($AN39=\"\",0,VLOOKUP($AN39,Race,3))","v":50},{"$f":"IF($AN39=\"\",0,VLOOKUP($AN39,Race,4))","v":1},{"$f":"IF($AN39=\"\",0,VLOOKUP($AN39,Race,5))","v":50},{"$f":"WEEKDAY(AM39)","v":6},{"$f":"IF($AY39=1,5,\"\")","v":""},{"$f":"IF($AZ39=1,($I39*$BI39),\"\")","v":""},{"$f":"IF($BG39=1,($J39*$BK39),\"\")","v":""}]
["27/05/2016 20:04:44: [G_Auto] :  £ 5.00 Back bet placed on Futuramic at 6. Fully matched at 6.  Ref: 10086","20:17:18","DownR 27th May - 20:05 2m4f Hcap Chs","Futuramic",15,0,null,9,6,{"$f":"IF(C40=C39,J39+1,3)","v":3},{"$f":"IF(C40=\"\",\"\",LEFT(C40,5))","v":"DownR"},{"$f":"IF($K40=\"\",0,VLOOKUP($K40,Course,2))","v":"Down Royal"},{"$f":"IF(ISERROR(SEARCH(\"Charity\",$C40)),\"\",\"Charity\")","v":""},{"$f":"IF(ISERROR(SEARCH(\"PA\",$C40)),\"\",\"PA\")","v":""},{"$f":"IF(ISERROR(SEARCH(\"Class\",$C40)),\"\",\"Class\")","v":""},{"$f":"IF(ISERROR(SEARCH(\"Listed\",$C40)),\"\",\"Listed\")","v":""},{"$f":"IF(ISERROR(SEARCH(\"Grd1\",$C40)),\"\",\"Grd1\")","v":""},{"$f":"IF(ISERROR(SEARCH(\"Grd2\",$C40)),\"\",\"Grd2\")","v":""},{"$f":"IF(ISERROR(SEARCH(\"Grd3\",$C40)),\"\",\"Grd3\")","v":""},{"$f":"IF(ISERROR(SEARCH(\"Grp1\",$C40)),\"\",\"Grp1\")","v":""},{"$f":"IF(ISERROR(SEARCH(\"Grp2\",$C40)),\"\",\"Grp2\")","v":""},{"$f":"IF(ISERROR(SEARCH(\"Grp3\",$C40)),\"\",\"Grp3\")","v":""},{"$f":"IF(ISERROR(SEARCH(\"Grp 3\",$C40)),\"\",\"Grp3\")","v":""},{"$f":"IF(ISERROR(SEARCH(\"Nov\",$C40)),\"\",\"Nov\")","v":""},{"$f":"IF(ISERROR(SEARCH(\"App\",$C40)),\"\",\"App\")","v":""},{"$f":"IF(ISERROR(SEARCH(\"Sell\",$C40)),\"\",\"Sell\")","v":""},{"$f":"IF(ISERROR(SEARCH(\"Mdn\",$C40)),\"\",\"Mdn\")","v":""},{"$f":"IF(ISERROR(SEARCH(\"Beg\",$C40)),\"\",\"Beg\")","v":""},{"$f":"IF(ISERROR(SEARCH(\"Claim\",$C40)),\"\",\"Claim\")","v":""},{"$f":"IF(ISERROR(SEARCH(\"Hunt\",$C40)),\"\",\"Hunt\")","v":""},{"$f":"IF(ISERROR(SEARCH(\"Hcap\",$C40)),\"\",\"Hcap\")","v":"Hcap"},{"$f":"IF(ISERROR(SEARCH(\"Cond\",$C40)),\"\",\"Cond\")","v":""},{"$f":"IF(ISERROR(SEARCH(\"XC\",$C40)),\"\",\"XC\")","v":""},{"$f":"IF(ISERROR(SEARCH(\"Stks\",$C40)),\"\",\"Stks\")","v":""},{"$f":"IF(ISERROR(SEARCH(\"Hrd\",$C40)),\"\",\"Hrd\")","v":""},{"$f":"IF(ISERROR(SEARCH(\"Chs\",$C40)),\"\",\"Chs\")","v":"Chs"},{"$f":"IF(ISERROR(SEARCH(\" NHF\",$C40)),\"\",\"NHF\")","v":""},{"$f":"IF(ISERROR(SEARCH(\"INHF\",$C40)),\"\",\"INHF\")","v":""},{"$f":"LEFT(A40,10)","v":"27/05/2016"},{"$f":"CONCATENATE(M40,N40,O40,P40,Q40,R40,S40,T40,U40,V40,W40,X40,Y40,Z40,AB40,AA40,AC40,AD40,AE40,AF40,AG40,AH40,AK40,AL40,AI40,AJ40)","v":"HcapChs"},{"$f":"IF($AN40=\"\",0,VLOOKUP($AN40,Race,1))","v":"HcapChs"},{"$f":"IF($AN40<>$AO40,1,\"\")","v":""},null,{"$f":"IF($I40=\"\",0,IF($I40<Tables!$T$2,0,1))","v":1},{"$f":"IF($I40=\"\",0,IF($I40>Tables!$U$2,0,1))","v":1},{"$f":"IF($I40=\"\",0,IF($H40<VLOOKUP($K40,Course,3),0,1))","v":0},{"$f":"IF($I40=\"\",0,IF($H40>VLOOKUP($K40,Course,4),0,1))","v":1},{"$f":"IF($AN40=\"\",0,IF($H40<VLOOKUP($AN40,Race,2),0,1))","v":1},{"$f":"IF($AN40=\"\",0,IF($H40>VLOOKUP($AN40,Race,3),0,1))","v":1},{"$f":"IF($J40=\"\",0,VLOOKUP($J40,Selection,2))","v":1},{"$f":"IF(E40=0,0,IF(SUM(AR40:AX40)=$AY$1,1,0))","v":0},{"$f":"IF($AY40<>1,0,IF($G40=1,1,0))","v":0},null,{"$f":"IF($K40=\"\",0,VLOOKUP($K40,Course,3))","v":99},{"$f":"IF($K40=\"\",0,VLOOKUP($K40,Course,4))","v":99},{"$f":"IF($AN40=\"\",0,VLOOKUP($AN40,Race,2))","v":1},{"$f":"IF($AN40=\"\",0,VLOOKUP($AN40,Race,3))","v":50},{"$f":"IF($AN40=\"\",0,VLOOKUP($AN40,Race,4))","v":1},{"$f":"IF($AN40=\"\",0,VLOOKUP($AN40,Race,5))","v":50},{"$f":"WEEKDAY(AM40)","v":6},{"$f":"IF($AY40=1,5,\"\")","v":""},{"$f":"IF($AZ40=1,($I40*$BI40),\"\")","v":""},{"$f":"IF($BG40=1,($J40*$BK40),\"\")","v":""}]
["27/05/2016 20:04:49: [G_Auto] :  £ 5.00 Back bet placed on The Doorman at 7.4. Fully matched at 7.4.  Ref: 10088","20:17:18","DownR 27th May - 20:05 2m4f Hcap Chs","The Doorman",22,0,null,9,7.4,{"$f":"IF(C41=C40,J40+1,3)","v":4},{"$f":"IF(C41=\"\",\"\",LEFT(C41,5))","v":"DownR"},{"$f":"IF($K41=\"\",0,VLOOKUP($K41,Course,2))","v":"Down Royal"},{"$f":"IF(ISERROR(SEARCH(\"Charity\",$C41)),\"\",\"Charity\")","v":""},{"$f":"IF(ISERROR(SEARCH(\"PA\",$C41)),\"\",\"PA\")","v":""},{"$f":"IF(ISERROR(SEARCH(\"Class\",$C41)),\"\",\"Class\")","v":""},{"$f":"IF(ISERROR(SEARCH(\"Listed\",$C41)),\"\",\"Listed\")","v":""},{"$f":"IF(ISERROR(SEARCH(\"Grd1\",$C41)),\"\",\"Grd1\")","v":""},{"$f":"IF(ISERROR(SEARCH(\"Grd2\",$C41)),\"\",\"Grd2\")","v":""},{"$f":"IF(ISERROR(SEARCH(\"Grd3\",$C41)),\"\",\"Grd3\")","v":""},{"$f":"IF(ISERROR(SEARCH(\"Grp1\",$C41)),\"\",\"Grp1\")","v":""},{"$f":"IF(ISERROR(SEARCH(\"Grp2\",$C41)),\"\",\"Grp2\")","v":""},{"$f":"IF(ISERROR(SEARCH(\"Grp3\",$C41)),\"\",\"Grp3\")","v":""},{"$f":"IF(ISERROR(SEARCH(\"Grp 3\",$C41)),\"\",\"Grp3\")","v":""},{"$f":"IF(ISERROR(SEARCH(\"Nov\",$C41)),\"\",\"Nov\")","v":""},{"$f":"IF(ISERROR(SEARCH(\"App\",$C41)),\"\",\"App\")","v":""},{"$f":"IF(ISERROR(SEARCH(\"Sell\",$C41)),\"\",\"Sell\")","v":""},{"$f":"IF(ISERROR(SEARCH(\"Mdn\",$C41)),\"\",\"Mdn\")","v":""},{"$f":"IF(ISERROR(SEARCH(\"Beg\",$C41)),\"\",\"Beg\")","v":""},{"$f":"IF(ISERROR(SEARCH(\"Claim\",$C41)),\"\",\"Claim\")","v":""},{"$f":"IF(ISERROR(SEARCH(\"Hunt\",$C41)),\"\",\"Hunt\")","v":""},{"$f":"IF(ISERROR(SEARCH(\"Hcap\",$C41)),\"\",\"Hcap\")","v":"Hcap"},{"$f":"IF(ISERROR(SEARCH(\"Cond\",$C41)),\"\",\"Cond\")","v":""},{"$f":"IF(ISERROR(SEARCH(\"XC\",$C41)),\"\",\"XC\")","v":""},{"$f":"IF(ISERROR(SEARCH(\"Stks\",$C41)),\"\",\"Stks\")","v":""},{"$f":"IF(ISERROR(SEARCH(\"Hrd\",$C41)),\"\",\"Hrd\")","v":""},{"$f":"IF(ISERROR(SEARCH(\"Chs\",$C41)),\"\",\"Chs\")","v":"Chs"},{"$f":"IF(ISERROR(SEARCH(\" NHF\",$C41)),\"\",\"NHF\")","v":""},{"$f":"IF(ISERROR(SEARCH(\"INHF\",$C41)),\"\",\"INHF\")","v":""},{"$f":"LEFT(A41,10)","v":"27/05/2016"},{"$f":"CONCATENATE(M41,N41,O41,P41,Q41,R41,S41,T41,U41,V41,W41,X41,Y41,Z41,AB41,AA41,AC41,AD41,AE41,AF41,AG41,AH41,AK41,AL41,AI41,AJ41)","v":"HcapChs"},{"$f":"IF($AN41=\"\",0,VLOOKUP($AN41,Race,1))","v":"HcapChs"},{"$f":"IF($AN41<>$AO41,1,\"\")","v":""},null,{"$f":"IF($I41=\"\",0,IF($I41<Tables!$T$2,0,1))","v":1},{"$f":"IF($I41=\"\",0,IF($I41>Tables!$U$2,0,1))","v":1},{"$f":"IF($I41=\"\",0,IF($H41<VLOOKUP($K41,Course,3),0,1))","v":0},{"$f":"IF($I41=\"\",0,IF($H41>VLOOKUP($K41,Course,4),0,1))","v":1},{"$f":"IF($AN41=\"\",0,IF($H41<VLOOKUP($AN41,Race,2),0,1))","v":1},{"$f":"IF($AN41=\"\",0,IF($H41>VLOOKUP($AN41,Race,3),0,1))","v":1},{"$f":"IF($J41=\"\",0,VLOOKUP($J41,Selection,2))","v":1},{"$f":"IF(E41=0,0,IF(SUM(AR41:AX41)=$AY$1,1,0))","v":0},{"$f":"IF($AY41<>1,0,IF($G41=1,1,0))","v":0},null,{"$f":"IF($K41=\"\",0,VLOOKUP($K41,Course,3))","v":99},{"$f":"IF($K41=\"\",0,VLOOKUP($K41,Course,4))","v":99},{"$f":"IF($AN41=\"\",0,VLOOKUP($AN41,Race,2))","v":1},{"$f":"IF($AN41=\"\",0,VLOOKUP($AN41,Race,3))","v":50},{"$f":"IF($AN41=\"\",0,VLOOKUP($AN41,Race,4))","v":1},{"$f":"IF($AN41=\"\",0,VLOOKUP($AN41,Race,5))","v":50},{"$f":"WEEKDAY(AM41)","v":6},{"$f":"IF($AY41=1,5,\"\")","v":""},{"$f":"IF($AZ41=1,($I41*$BI41),\"\")","v":""},{"$f":"IF($BG41=1,($J41*$BK41),\"\")","v":""}]
["27/05/2016 20:04:54: [G_Auto] :  £ 5.00 Back bet placed on Kylestyle at 9.2. Fully matched at 9.2.  Ref: 10090","20:17:18","DownR 27th May - 20:05 2m4f Hcap Chs","Kylestyle",31,0,1,9,9.2,{"$f":"IF(C42=C41,J41+1,3)","v":5},{"$f":"IF(C42=\"\",\"\",LEFT(C42,5))","v":"DownR"},{"$f":"IF($K42=\"\",0,VLOOKUP($K42,Course,2))","v":"Down Royal"},{"$f":"IF(ISERROR(SEARCH(\"Charity\",$C42)),\"\",\"Charity\")","v":""},{"$f":"IF(ISERROR(SEARCH(\"PA\",$C42)),\"\",\"PA\")","v":""},{"$f":"IF(ISERROR(SEARCH(\"Class\",$C42)),\"\",\"Class\")","v":""},{"$f":"IF(ISERROR(SEARCH(\"Listed\",$C42)),\"\",\"Listed\")","v":""},{"$f":"IF(ISERROR(SEARCH(\"Grd1\",$C42)),\"\",\"Grd1\")","v":""},{"$f":"IF(ISERROR(SEARCH(\"Grd2\",$C42)),\"\",\"Grd2\")","v":""},{"$f":"IF(ISERROR(SEARCH(\"Grd3\",$C42)),\"\",\"Grd3\")","v":""},{"$f":"IF(ISERROR(SEARCH(\"Grp1\",$C42)),\"\",\"Grp1\")","v":""},{"$f":"IF(ISERROR(SEARCH(\"Grp2\",$C42)),\"\",\"Grp2\")","v":""},{"$f":"IF(ISERROR(SEARCH(\"Grp3\",$C42)),\"\",\"Grp3\")","v":""},{"$f":"IF(ISERROR(SEARCH(\"Grp 3\",$C42)),\"\",\"Grp3\")","v":""},{"$f":"IF(ISERROR(SEARCH(\"Nov\",$C42)),\"\",\"Nov\")","v":""},{"$f":"IF(ISERROR(SEARCH(\"App\",$C42)),\"\",\"App\")","v":""},{"$f":"IF(ISERROR(SEARCH(\"Sell\",$C42)),\"\",\"Sell\")","v":""},{"$f":"IF(ISERROR(SEARCH(\"Mdn\",$C42)),\"\",\"Mdn\")","v":""},{"$f":"IF(ISERROR(SEARCH(\"Beg\",$C42)),\"\",\"Beg\")","v":""},{"$f":"IF(ISERROR(SEARCH(\"Claim\",$C42)),\"\",\"Claim\")","v":""},{"$f":"IF(ISERROR(SEARCH(\"Hunt\",$C42)),\"\",\"Hunt\")","v":""},{"$f":"IF(ISERROR(SEARCH(\"Hcap\",$C42)),\"\",\"Hcap\")","v":"Hcap"},{"$f":"IF(ISERROR(SEARCH(\"Cond\",$C42)),\"\",\"Cond\")","v":""},{"$f":"IF(ISERROR(SEARCH(\"XC\",$C42)),\"\",\"XC\")","v":""},{"$f":"IF(ISERROR(SEARCH(\"Stks\",$C42)),\"\",\"Stks\")","v":""},{"$f":"IF(ISERROR(SEARCH(\"Hrd\",$C42)),\"\",\"Hrd\")","v":""},{"$f":"IF(ISERROR(SEARCH(\"Chs\",$C42)),\"\",\"Chs\")","v":"Chs"},{"$f":"IF(ISERROR(SEARCH(\" NHF\",$C42)),\"\",\"NHF\")","v":""},{"$f":"IF(ISERROR(SEARCH(\"INHF\",$C42)),\"\",\"INHF\")","v":""},{"$f":"LEFT(A42,10)","v":"27/05/2016"},{"$f":"CONCATENATE(M42,N42,O42,P42,Q42,R42,S42,T42,U42,V42,W42,X42,Y42,Z42,AB42,AA42,AC42,AD42,AE42,AF42,AG42,AH42,AK42,AL42,AI42,AJ42)","v":"HcapChs"},{"$f":"IF($AN42=\"\",0,VLOOKUP($AN42,Race,1))","v":"HcapChs"},{"$f":"IF($AN42<>$AO42,1,\"\")","v":""},null,{"$f":"IF($I42=\"\",0,IF($I42<Tables!$T$2,0,1))","v":1},{"$f":"IF($I42=\"\",0,IF($I42>Tables!$U$2,0,1))","v":1},{"$f":"IF($I42=\"\",0,IF($H42<VLOOKUP($K42,Course,3),0,1))","v":0},{"$f":"IF($I42=\"\",0,IF($H42>VLOOKUP($K42,Course,4),0,1))","v":1},{"$f":"IF($AN42=\"\",0,IF($H42<VLOOKUP($AN42,Race,2),0,1))","v":1},{"$f":"IF($AN42=\"\",0,IF($H42>VLOOKUP($AN42,Race,3),0,1))","v":1},{"$f":"IF($J42=\"\",0,VLOOKUP($J42,Selection,2))","v":1},{"$f":"IF(E42=0,0,IF(SUM(AR42:AX42)=$AY$1,1,0))","v":0},{"$f":"IF($AY42<>1,0,IF($G42=1,1,0))","v":0},null,{"$f":"IF($K42=\"\",0,VLOOKUP($K42,Course,3))","v":99},{"$f":"IF($K42=\"\",0,VLOOKUP($K42,Course,4))","v":99},{"$f":"IF($AN42=\"\",0,VLOOKUP($AN42,Race,2))","v":1},{"$f":"IF($AN42=\"\",0,VLOOKUP($AN42,Race,3))","v":50},{"$f":"IF($AN42=\"\",0,VLOOKUP($AN42,Race,4))","v":1},{"$f":"IF($AN42=\"\",0,VLOOKUP($AN42,Race,5))","v":50},{"$f":"WEEKDAY(AM42)","v":6},{"$f":"IF($AY42=1,5,\"\")","v":""},{"$f":"IF($AZ42=1,($I42*$BI42),\"\")","v":""},{"$f":"IF($BG42=1,($J42*$BK42),\"\")","v":""}]
["27/05/2016 20:09:41: [G_Auto] :  £ 5.00 Back bet placed on Dominada at 7.4. Fully matched at 7.4.  Ref: 10092","20:17:19","Muss 27th May - 20:10 1m6f Hcap","Dominada",32,0,1,7,7.4,{"$f":"IF(C43=C42,J42+1,3)","v":3},{"$f":"IF(C43=\"\",\"\",LEFT(C43,5))","v":"Muss"},{"$f":"IF($K43=\"\",0,VLOOKUP($K43,Course,2))","v":"Musselburgh"},{"$f":"IF(ISERROR(SEARCH(\"Charity\",$C43)),\"\",\"Charity\")","v":""},{"$f":"IF(ISERROR(SEARCH(\"PA\",$C43)),\"\",\"PA\")","v":""},{"$f":"IF(ISERROR(SEARCH(\"Class\",$C43)),\"\",\"Class\")","v":""},{"$f":"IF(ISERROR(SEARCH(\"Listed\",$C43)),\"\",\"Listed\")","v":""},{"$f":"IF(ISERROR(SEARCH(\"Grd1\",$C43)),\"\",\"Grd1\")","v":""},{"$f":"IF(ISERROR(SEARCH(\"Grd2\",$C43)),\"\",\"Grd2\")","v":""},{"$f":"IF(ISERROR(SEARCH(\"Grd3\",$C43)),\"\",\"Grd3\")","v":""},{"$f":"IF(ISERROR(SEARCH(\"Grp1\",$C43)),\"\",\"Grp1\")","v":""},{"$f":"IF(ISERROR(SEARCH(\"Grp2\",$C43)),\"\",\"Grp2\")","v":""},{"$f":"IF(ISERROR(SEARCH(\"Grp3\",$C43)),\"\",\"Grp3\")","v":""},{"$f":"IF(ISERROR(SEARCH(\"Grp 3\",$C43)),\"\",\"Grp3\")","v":""},{"$f":"IF(ISERROR(SEARCH(\"Nov\",$C43)),\"\",\"Nov\")","v":""},{"$f":"IF(ISERROR(SEARCH(\"App\",$C43)),\"\",\"App\")","v":""},{"$f":"IF(ISERROR(SEARCH(\"Sell\",$C43)),\"\",\"Sell\")","v":""},{"$f":"IF(ISERROR(SEARCH(\"Mdn\",$C43)),\"\",\"Mdn\")","v":""},{"$f":"IF(ISERROR(SEARCH(\"Beg\",$C43)),\"\",\"Beg\")","v":""},{"$f":"IF(ISERROR(SEARCH(\"Claim\",$C43)),\"\",\"Claim\")","v":""},{"$f":"IF(ISERROR(SEARCH(\"Hunt\",$C43)),\"\",\"Hunt\")","v":""},{"$f":"IF(ISERROR(SEARCH(\"Hcap\",$C43)),\"\",\"Hcap\")","v":"Hcap"},{"$f":"IF(ISERROR(SEARCH(\"Cond\",$C43)),\"\",\"Cond\")","v":""},{"$f":"IF(ISERROR(SEARCH(\"XC\",$C43)),\"\",\"XC\")","v":""},{"$f":"IF(ISERROR(SEARCH(\"Stks\",$C43)),\"\",\"Stks\")","v":""},{"$f":"IF(ISERROR(SEARCH(\"Hrd\",$C43)),\"\",\"Hrd\")","v":""},{"$f":"IF(ISERROR(SEARCH(\"Chs\",$C43)),\"\",\"Chs\")","v":""},{"$f":"IF(ISERROR(SEARCH(\" NHF\",$C43)),\"\",\"NHF\")","v":""},{"$f":"IF(ISERROR(SEARCH(\"INHF\",$C43)),\"\",\"INHF\")","v":""},{"$f":"LEFT(A43,10)","v":"27/05/2016"},{"$f":"CONCATENATE(M43,N43,O43,P43,Q43,R43,S43,T43,U43,V43,W43,X43,Y43,Z43,AB43,AA43,AC43,AD43,AE43,AF43,AG43,AH43,AK43,AL43,AI43,AJ43)","v":"Hcap"},{"$f":"IF($AN43=\"\",0,VLOOKUP($AN43,Race,1))","v":"Hcap"},{"$f":"IF($AN43<>$AO43,1,\"\")","v":""},null,{"$f":"IF($I43=\"\",0,IF($I43<Tables!$T$2,0,1))","v":1},{"$f":"IF($I43=\"\",0,IF($I43>Tables!$U$2,0,1))","v":1},{"$f":"IF($I43=\"\",0,IF($H43<VLOOKUP($K43,Course,3),0,1))","v":1},{"$f":"IF($I43=\"\",0,IF($H43>VLOOKUP($K43,Course,4),0,1))","v":1},{"$f":"IF($AN43=\"\",0,IF($H43<VLOOKUP($AN43,Race,2),0,1))","v":1},{"$f":"IF($AN43=\"\",0,IF($H43>VLOOKUP($AN43,Race,3),0,1))","v":1},{"$f":"IF($J43=\"\",0,VLOOKUP($J43,Selection,2))","v":1},{"$f":"IF(E43=0,0,IF(SUM(AR43:AX43)=$AY$1,1,0))","v":1},{"$f":"IF($AY43<>1,0,IF($G43=1,1,0))","v":1},null,{"$f":"IF($K43=\"\",0,VLOOKUP($K43,Course,3))","v":7},{"$f":"IF($K43=\"\",0,VLOOKUP($K43,Course,4))","v":8},{"$f":"IF($AN43=\"\",0,VLOOKUP($AN43,Race,2))","v":1},{"$f":"IF($AN43=\"\",0,VLOOKUP($AN43,Race,3))","v":50},{"$f":"IF($AN43=\"\",0,VLOOKUP($AN43,Race,4))","v":1},{"$f":"IF($AN43=\"\",0,VLOOKUP($AN43,Race,5))","v":50},{"$f":"WEEKDAY(AM43)","v":6},{"$f":"IF($AY43=1,5,\"\")","v":5},{"$f":"IF($AZ43=1,($I43*$BI43),\"\")","v":37},{"$f":"IF($BG43=1,($J43*$BK43),\"\")","v":""}]
["27/05/2016 20:29:41: [G_Auto] :  £ 5.00 Back bet placed on Kilim at 9.4. Fully matched at 9.4.  Ref: 10096","20:41:05","Ponte 27th May - 20:30 1m2f Hcap","Kilim",42,0,null,9,9.4,{"$f":"IF(C44=C43,J43+1,3)","v":3},{"$f":"IF(C44=\"\",\"\",LEFT(C44,5))","v":"Ponte"},{"$f":"IF($K44=\"\",0,VLOOKUP($K44,Course,2))","v":"Pontefract"},{"$f":"IF(ISERROR(SEARCH(\"Charity\",$C44)),\"\",\"Charity\")","v":""},{"$f":"IF(ISERROR(SEARCH(\"PA\",$C44)),\"\",\"PA\")","v":""},{"$f":"IF(ISERROR(SEARCH(\"Class\",$C44)),\"\",\"Class\")","v":""},{"$f":"IF(ISERROR(SEARCH(\"Listed\",$C44)),\"\",\"Listed\")","v":""},{"$f":"IF(ISERROR(SEARCH(\"Grd1\",$C44)),\"\",\"Grd1\")","v":""},{"$f":"IF(ISERROR(SEARCH(\"Grd2\",$C44)),\"\",\"Grd2\")","v":""},{"$f":"IF(ISERROR(SEARCH(\"Grd3\",$C44)),\"\",\"Grd3\")","v":""},{"$f":"IF(ISERROR(SEARCH(\"Grp1\",$C44)),\"\",\"Grp1\")","v":""},{"$f":"IF(ISERROR(SEARCH(\"Grp2\",$C44)),\"\",\"Grp2\")","v":""},{"$f":"IF(ISERROR(SEARCH(\"Grp3\",$C44)),\"\",\"Grp3\")","v":""},{"$f":"IF(ISERROR(SEARCH(\"Grp 3\",$C44)),\"\",\"Grp3\")","v":""},{"$f":"IF(ISERROR(SEARCH(\"Nov\",$C44)),\"\",\"Nov\")","v":""},{"$f":"IF(ISERROR(SEARCH(\"App\",$C44)),\"\",\"App\")","v":""},{"$f":"IF(ISERROR(SEARCH(\"Sell\",$C44)),\"\",\"Sell\")","v":""},{"$f":"IF(ISERROR(SEARCH(\"Mdn\",$C44)),\"\",\"Mdn\")","v":""},{"$f":"IF(ISERROR(SEARCH(\"Beg\",$C44)),\"\",\"Beg\")","v":""},{"$f":"IF(ISERROR(SEARCH(\"Claim\",$C44)),\"\",\"Claim\")","v":""},{"$f":"IF(ISERROR(SEARCH(\"Hunt\",$C44)),\"\",\"Hunt\")","v":""},{"$f":"IF(ISERROR(SEARCH(\"Hcap\",$C44)),\"\",\"Hcap\")","v":"Hcap"},{"$f":"IF(ISERROR(SEARCH(\"Cond\",$C44)),\"\",\"Cond\")","v":""},{"$f":"IF(ISERROR(SEARCH(\"XC\",$C44)),\"\",\"XC\")","v":""},{"$f":"IF(ISERROR(SEARCH(\"Stks\",$C44)),\"\",\"Stks\")","v":""},{"$f":"IF(ISERROR(SEARCH(\"Hrd\",$C44)),\"\",\"Hrd\")","v":""},{"$f":"IF(ISERROR(SEARCH(\"Chs\",$C44)),\"\",\"Chs\")","v":""},{"$f":"IF(ISERROR(SEARCH(\" NHF\",$C44)),\"\",\"NHF\")","v":""},{"$f":"IF(ISERROR(SEARCH(\"INHF\",$C44)),\"\",\"INHF\")","v":""},{"$f":"LEFT(A44,10)","v":"27/05/2016"},{"$f":"CONCATENATE(M44,N44,O44,P44,Q44,R44,S44,T44,U44,V44,W44,X44,Y44,Z44,AB44,AA44,AC44,AD44,AE44,AF44,AG44,AH44,AK44,AL44,AI44,AJ44)","v":"Hcap"},{"$f":"IF($AN44=\"\",0,VLOOKUP($AN44,Race,1))","v":"Hcap"},{"$f":"IF($AN44<>$AO44,1,\"\")","v":""},null,{"$f":"IF($I44=\"\",0,IF($I44<Tables!$T$2,0,1))","v":1},{"$f":"IF($I44=\"\",0,IF($I44>Tables!$U$2,0,1))","v":1},{"$f":"IF($I44=\"\",0,IF($H44<VLOOKUP($K44,Course,3),0,1))","v":0},{"$f":"IF($I44=\"\",0,IF($H44>VLOOKUP($K44,Course,4),0,1))","v":1},{"$f":"IF($AN44=\"\",0,IF($H44<VLOOKUP($AN44,Race,2),0,1))","v":1},{"$f":"IF($AN44=\"\",0,IF($H44>VLOOKUP($AN44,Race,3),0,1))","v":1},{"$f":"IF($J44=\"\",0,VLOOKUP($J44,Selection,2))","v":1},{"$f":"IF(E44=0,0,IF(SUM(AR44:AX44)=$AY$1,1,0))","v":0},{"$f":"IF($AY44<>1,0,IF($G44=1,1,0))","v":0},null,{"$f":"IF($K44=\"\",0,VLOOKUP($K44,Course,3))","v":99},{"$f":"IF($K44=\"\",0,VLOOKUP($K44,Course,4))","v":99},{"$f":"IF($AN44=\"\",0,VLOOKUP($AN44,Race,2))","v":1},{"$f":"IF($AN44=\"\",0,VLOOKUP($AN44,Race,3))","v":50},{"$f":"IF($AN44=\"\",0,VLOOKUP($AN44,Race,4))","v":1},{"$f":"IF($AN44=\"\",0,VLOOKUP($AN44,Race,5))","v":50},{"$f":"WEEKDAY(AM44)","v":6},{"$f":"IF($AY44=1,5,\"\")","v":""},{"$f":"IF($AZ44=1,($I44*$BI44),\"\")","v":""},{"$f":"IF($BG44=1,($J44*$BK44),\"\")","v":""}]
["27/05/2016 20:34:42: [G_Auto] :  £ 5.00 Back bet placed on Ard Na Carraig at 7.4. Fully matched at 7.4.  Ref: 10101","20:43:21","DownR 27th May - 20:35 2m INHF","Ard Na Carraig",22,0,null,16,7.4,{"$f":"IF(C45=C44,J44+1,3)","v":3},{"$f":"IF(C45=\"\",\"\",LEFT(C45,5))","v":"DownR"},{"$f":"IF($K45=\"\",0,VLOOKUP($K45,Course,2))","v":"Down Royal"},{"$f":"IF(ISERROR(SEARCH(\"Charity\",$C45)),\"\",\"Charity\")","v":""},{"$f":"IF(ISERROR(SEARCH(\"PA\",$C45)),\"\",\"PA\")","v":""},{"$f":"IF(ISERROR(SEARCH(\"Class\",$C45)),\"\",\"Class\")","v":""},{"$f":"IF(ISERROR(SEARCH(\"Listed\",$C45)),\"\",\"Listed\")","v":""},{"$f":"IF(ISERROR(SEARCH(\"Grd1\",$C45)),\"\",\"Grd1\")","v":""},{"$f":"IF(ISERROR(SEARCH(\"Grd2\",$C45)),\"\",\"Grd2\")","v":""},{"$f":"IF(ISERROR(SEARCH(\"Grd3\",$C45)),\"\",\"Grd3\")","v":""},{"$f":"IF(ISERROR(SEARCH(\"Grp1\",$C45)),\"\",\"Grp1\")","v":""},{"$f":"IF(ISERROR(SEARCH(\"Grp2\",$C45)),\"\",\"Grp2\")","v":""},{"$f":"IF(ISERROR(SEARCH(\"Grp3\",$C45)),\"\",\"Grp3\")","v":""},{"$f":"IF(ISERROR(SEARCH(\"Grp 3\",$C45)),\"\",\"Grp3\")","v":""},{"$f":"IF(ISERROR(SEARCH(\"Nov\",$C45)),\"\",\"Nov\")","v":""},{"$f":"IF(ISERROR(SEARCH(\"App\",$C45)),\"\",\"App\")","v":""},{"$f":"IF(ISERROR(SEARCH(\"Sell\",$C45)),\"\",\"Sell\")","v":""},{"$f":"IF(ISERROR(SEARCH(\"Mdn\",$C45)),\"\",\"Mdn\")","v":""},{"$f":"IF(ISERROR(SEARCH(\"Beg\",$C45)),\"\",\"Beg\")","v":""},{"$f":"IF(ISERROR(SEARCH(\"Claim\",$C45)),\"\",\"Claim\")","v":""},{"$f":"IF(ISERROR(SEARCH(\"Hunt\",$C45)),\"\",\"Hunt\")","v":""},{"$f":"IF(ISERROR(SEARCH(\"Hcap\",$C45)),\"\",\"Hcap\")","v":""},{"$f":"IF(ISERROR(SEARCH(\"Cond\",$C45)),\"\",\"Cond\")","v":""},{"$f":"IF(ISERROR(SEARCH(\"XC\",$C45)),\"\",\"XC\")","v":""},{"$f":"IF(ISERROR(SEARCH(\"Stks\",$C45)),\"\",\"Stks\")","v":""},{"$f":"IF(ISERROR(SEARCH(\"Hrd\",$C45)),\"\",\"Hrd\")","v":""},{"$f":"IF(ISERROR(SEARCH(\"Chs\",$C45)),\"\",\"Chs\")","v":""},{"$f":"IF(ISERROR(SEARCH(\" NHF\",$C45)),\"\",\"NHF\")","v":""},{"$f":"IF(ISERROR(SEARCH(\"INHF\",$C45)),\"\",\"INHF\")","v":"INHF"},{"$f":"LEFT(A45,10)","v":"27/05/2016"},{"$f":"CONCATENATE(M45,N45,O45,P45,Q45,R45,S45,T45,U45,V45,W45,X45,Y45,Z45,AB45,AA45,AC45,AD45,AE45,AF45,AG45,AH45,AK45,AL45,AI45,AJ45)","v":"INHF"},{"$f":"IF($AN45=\"\",0,VLOOKUP($AN45,Race,1))","v":"INHF"},{"$f":"IF($AN45<>$AO45,1,\"\")","v":""},null,{"$f":"IF($I45=\"\",0,IF($I45<Tables!$T$2,0,1))","v":1},{"$f":"IF($I45=\"\",0,IF($I45>Tables!$U$2,0,1))","v":1},{"$f":"IF($I45=\"\",0,IF($H45<VLOOKUP($K45,Course,3),0,1))","v":0},{"$f":"IF($I45=\"\",0,IF($H45>VLOOKUP($K45,Course,4),0,1))","v":1},{"$f":"IF($AN45=\"\",0,IF($H45<VLOOKUP($AN45,Race,2),0,1))","v":1},{"$f":"IF($AN45=\"\",0,IF($H45>VLOOKUP($AN45,Race,3),0,1))","v":1},{"$f":"IF($J45=\"\",0,VLOOKUP($J45,Selection,2))","v":1},{"$f":"IF(E45=0,0,IF(SUM(AR45:AX45)=$AY$1,1,0))","v":0},{"$f":"IF($AY45<>1,0,IF($G45=1,1,0))","v":0},null,{"$f":"IF($K45=\"\",0,VLOOKUP($K45,Course,3))","v":99},{"$f":"IF($K45=\"\",0,VLOOKUP($K45,Course,4))","v":99},{"$f":"IF($AN45=\"\",0,VLOOKUP($AN45,Race,2))","v":1},{"$f":"IF($AN45=\"\",0,VLOOKUP($AN45,Race,3))","v":50},{"$f":"IF($AN45=\"\",0,VLOOKUP($AN45,Race,4))","v":1},{"$f":"IF($AN45=\"\",0,VLOOKUP($AN45,Race,5))","v":50},{"$f":"WEEKDAY(AM45)","v":6},{"$f":"IF($AY45=1,5,\"\")","v":""},{"$f":"IF($AZ45=1,($I45*$BI45),\"\")","v":""},{"$f":"IF($BG45=1,($J45*$BK45),\"\")","v":""}]
["27/05/2016 20:34:46: [G_Auto] :  £ 5.00 Back bet placed on Red Giant at 7.8. Fully matched at 7.8.  Ref: 10103","20:43:21","DownR 27th May - 20:35 2m INHF","Red Giant",24,0,null,16,7.8,{"$f":"IF(C46=C45,J45+1,3)","v":4},{"$f":"IF(C46=\"\",\"\",LEFT(C46,5))","v":"DownR"},{"$f":"IF($K46=\"\",0,VLOOKUP($K46,Course,2))","v":"Down Royal"},{"$f":"IF(ISERROR(SEARCH(\"Charity\",$C46)),\"\",\"Charity\")","v":""},{"$f":"IF(ISERROR(SEARCH(\"PA\",$C46)),\"\",\"PA\")","v":""},{"$f":"IF(ISERROR(SEARCH(\"Class\",$C46)),\"\",\"Class\")","v":""},{"$f":"IF(ISERROR(SEARCH(\"Listed\",$C46)),\"\",\"Listed\")","v":""},{"$f":"IF(ISERROR(SEARCH(\"Grd1\",$C46)),\"\",\"Grd1\")","v":""},{"$f":"IF(ISERROR(SEARCH(\"Grd2\",$C46)),\"\",\"Grd2\")","v":""},{"$f":"IF(ISERROR(SEARCH(\"Grd3\",$C46)),\"\",\"Grd3\")","v":""},{"$f":"IF(ISERROR(SEARCH(\"Grp1\",$C46)),\"\",\"Grp1\")","v":""},{"$f":"IF(ISERROR(SEARCH(\"Grp2\",$C46)),\"\",\"Grp2\")","v":""},{"$f":"IF(ISERROR(SEARCH(\"Grp3\",$C46)),\"\",\"Grp3\")","v":""},{"$f":"IF(ISERROR(SEARCH(\"Grp 3\",$C46)),\"\",\"Grp3\")","v":""},{"$f":"IF(ISERROR(SEARCH(\"Nov\",$C46)),\"\",\"Nov\")","v":""},{"$f":"IF(ISERROR(SEARCH(\"App\",$C46)),\"\",\"App\")","v":""},{"$f":"IF(ISERROR(SEARCH(\"Sell\",$C46)),\"\",\"Sell\")","v":""},{"$f":"IF(ISERROR(SEARCH(\"Mdn\",$C46)),\"\",\"Mdn\")","v":""},{"$f":"IF(ISERROR(SEARCH(\"Beg\",$C46)),\"\",\"Beg\")","v":""},{"$f":"IF(ISERROR(SEARCH(\"Claim\",$C46)),\"\",\"Claim\")","v":""},{"$f":"IF(ISERROR(SEARCH(\"Hunt\",$C46)),\"\",\"Hunt\")","v":""},{"$f":"IF(ISERROR(SEARCH(\"Hcap\",$C46)),\"\",\"Hcap\")","v":""},{"$f":"IF(ISERROR(SEARCH(\"Cond\",$C46)),\"\",\"Cond\")","v":""},{"$f":"IF(ISERROR(SEARCH(\"XC\",$C46)),\"\",\"XC\")","v":""},{"$f":"IF(ISERROR(SEARCH(\"Stks\",$C46)),\"\",\"Stks\")","v":""},{"$f":"IF(ISERROR(SEARCH(\"Hrd\",$C46)),\"\",\"Hrd\")","v":""},{"$f":"IF(ISERROR(SEARCH(\"Chs\",$C46)),\"\",\"Chs\")","v":""},{"$f":"IF(ISERROR(SEARCH(\" NHF\",$C46)),\"\",\"NHF\")","v":""},{"$f":"IF(ISERROR(SEARCH(\"INHF\",$C46)),\"\",\"INHF\")","v":"INHF"},{"$f":"LEFT(A46,10)","v":"27/05/2016"},{"$f":"CONCATENATE(M46,N46,O46,P46,Q46,R46,S46,T46,U46,V46,W46,X46,Y46,Z46,AB46,AA46,AC46,AD46,AE46,AF46,AG46,AH46,AK46,AL46,AI46,AJ46)","v":"INHF"},{"$f":"IF($AN46=\"\",0,VLOOKUP($AN46,Race,1))","v":"INHF"},{"$f":"IF($AN46<>$AO46,1,\"\")","v":""},null,{"$f":"IF($I46=\"\",0,IF($I46<Tables!$T$2,0,1))","v":1},{"$f":"IF($I46=\"\",0,IF($I46>Tables!$U$2,0,1))","v":1},{"$f":"IF($I46=\"\",0,IF($H46<VLOOKUP($K46,Course,3),0,1))","v":0},{"$f":"IF($I46=\"\",0,IF($H46>VLOOKUP($K46,Course,4),0,1))","v":1},{"$f":"IF($AN46=\"\",0,IF($H46<VLOOKUP($AN46,Race,2),0,1))","v":1},{"$f":"IF($AN46=\"\",0,IF($H46>VLOOKUP($AN46,Race,3),0,1))","v":1},{"$f":"IF($J46=\"\",0,VLOOKUP($J46,Selection,2))","v":1},{"$f":"IF(E46=0,0,IF(SUM(AR46:AX46)=$AY$1,1,0))","v":0},{"$f":"IF($AY46<>1,0,IF($G46=1,1,0))","v":0},null,{"$f":"IF($K46=\"\",0,VLOOKUP($K46,Course,3))","v":99},{"$f":"IF($K46=\"\",0,VLOOKUP($K46,Course,4))","v":99},{"$f":"IF($AN46=\"\",0,VLOOKUP($AN46,Race,2))","v":1},{"$f":"IF($AN46=\"\",0,VLOOKUP($AN46,Race,3))","v":50},{"$f":"IF($AN46=\"\",0,VLOOKUP($AN46,Race,4))","v":1},{"$f":"IF($AN46=\"\",0,VLOOKUP($AN46,Race,5))","v":50},{"$f":"WEEKDAY(AM46)","v":6},{"$f":"IF($AY46=1,5,\"\")","v":""},{"$f":"IF($AZ46=1,($I46*$BI46),\"\")","v":""},{"$f":"IF($BG46=1,($J46*$BK46),\"\")","v":""}]
["27/05/2016 20:34:49: [G_Auto] :  £ 5.00 Back bet placed on Well Joey at 8.4. Fully matched at 8.4.  Ref: 10105","20:43:21","DownR 27th May - 20:35 2m INHF","Well Joey",27,0,null,16,8.4,{"$f":"IF(C47=C46,J46+1,3)","v":5},{"$f":"IF(C47=\"\",\"\",LEFT(C47,5))","v":"DownR"},{"$f":"IF($K47=\"\",0,VLOOKUP($K47,Course,2))","v":"Down Royal"},{"$f":"IF(ISERROR(SEARCH(\"Charity\",$C47)),\"\",\"Charity\")","v":""},{"$f":"IF(ISERROR(SEARCH(\"PA\",$C47)),\"\",\"PA\")","v":""},{"$f":"IF(ISERROR(SEARCH(\"Class\",$C47)),\"\",\"Class\")","v":""},{"$f":"IF(ISERROR(SEARCH(\"Listed\",$C47)),\"\",\"Listed\")","v":""},{"$f":"IF(ISERROR(SEARCH(\"Grd1\",$C47)),\"\",\"Grd1\")","v":""},{"$f":"IF(ISERROR(SEARCH(\"Grd2\",$C47)),\"\",\"Grd2\")","v":""},{"$f":"IF(ISERROR(SEARCH(\"Grd3\",$C47)),\"\",\"Grd3\")","v":""},{"$f":"IF(ISERROR(SEARCH(\"Grp1\",$C47)),\"\",\"Grp1\")","v":""},{"$f":"IF(ISERROR(SEARCH(\"Grp2\",$C47)),\"\",\"Grp2\")","v":""},{"$f":"IF(ISERROR(SEARCH(\"Grp3\",$C47)),\"\",\"Grp3\")","v":""},{"$f":"IF(ISERROR(SEARCH(\"Grp 3\",$C47)),\"\",\"Grp3\")","v":""},{"$f":"IF(ISERROR(SEARCH(\"Nov\",$C47)),\"\",\"Nov\")","v":""},{"$f":"IF(ISERROR(SEARCH(\"App\",$C47)),\"\",\"App\")","v":""},{"$f":"IF(ISERROR(SEARCH(\"Sell\",$C47)),\"\",\"Sell\")","v":""},{"$f":"IF(ISERROR(SEARCH(\"Mdn\",$C47)),\"\",\"Mdn\")","v":""},{"$f":"IF(ISERROR(SEARCH(\"Beg\",$C47)),\"\",\"Beg\")","v":""},{"$f":"IF(ISERROR(SEARCH(\"Claim\",$C47)),\"\",\"Claim\")","v":""},{"$f":"IF(ISERROR(SEARCH(\"Hunt\",$C47)),\"\",\"Hunt\")","v":""},{"$f":"IF(ISERROR(SEARCH(\"Hcap\",$C47)),\"\",\"Hcap\")","v":""},{"$f":"IF(ISERROR(SEARCH(\"Cond\",$C47)),\"\",\"Cond\")","v":""},{"$f":"IF(ISERROR(SEARCH(\"XC\",$C47)),\"\",\"XC\")","v":""},{"$f":"IF(ISERROR(SEARCH(\"Stks\",$C47)),\"\",\"Stks\")","v":""},{"$f":"IF(ISERROR(SEARCH(\"Hrd\",$C47)),\"\",\"Hrd\")","v":""},{"$f":"IF(ISERROR(SEARCH(\"Chs\",$C47)),\"\",\"Chs\")","v":""},{"$f":"IF(ISERROR(SEARCH(\" NHF\",$C47)),\"\",\"NHF\")","v":""},{"$f":"IF(ISERROR(SEARCH(\"INHF\",$C47)),\"\",\"INHF\")","v":"INHF"},{"$f":"LEFT(A47,10)","v":"27/05/2016"},{"$f":"CONCATENATE(M47,N47,O47,P47,Q47,R47,S47,T47,U47,V47,W47,X47,Y47,Z47,AB47,AA47,AC47,AD47,AE47,AF47,AG47,AH47,AK47,AL47,AI47,AJ47)","v":"INHF"},{"$f":"IF($AN47=\"\",0,VLOOKUP($AN47,Race,1))","v":"INHF"},{"$f":"IF($AN47<>$AO47,1,\"\")","v":""},null,{"$f":"IF($I47=\"\",0,IF($I47<Tables!$T$2,0,1))","v":1},{"$f":"IF($I47=\"\",0,IF($I47>Tables!$U$2,0,1))","v":1},{"$f":"IF($I47=\"\",0,IF($H47<VLOOKUP($K47,Course,3),0,1))","v":0},{"$f":"IF($I47=\"\",0,IF($H47>VLOOKUP($K47,Course,4),0,1))","v":1},{"$f":"IF($AN47=\"\",0,IF($H47<VLOOKUP($AN47,Race,2),0,1))","v":1},{"$f":"IF($AN47=\"\",0,IF($H47>VLOOKUP($AN47,Race,3),0,1))","v":1},{"$f":"IF($J47=\"\",0,VLOOKUP($J47,Selection,2))","v":1},{"$f":"IF(E47=0,0,IF(SUM(AR47:AX47)=$AY$1,1,0))","v":0},{"$f":"IF($AY47<>1,0,IF($G47=1,1,0))","v":0},null,{"$f":"IF($K47=\"\",0,VLOOKUP($K47,Course,3))","v":99},{"$f":"IF($K47=\"\",0,VLOOKUP($K47,Course,4))","v":99},{"$f":"IF($AN47=\"\",0,VLOOKUP($AN47,Race,2))","v":1},{"$f":"IF($AN47=\"\",0,VLOOKUP($AN47,Race,3))","v":50},{"$f":"IF($AN47=\"\",0,VLOOKUP($AN47,Race,4))","v":1},{"$f":"IF($AN47=\"\",0,VLOOKUP($AN47,Race,5))","v":50},{"$f":"WEEKDAY(AM47)","v":6},{"$f":"IF($AY47=1,5,\"\")","v":""},{"$f":"IF($AZ47=1,($I47*$BI47),\"\")","v":""},{"$f":"IF($BG47=1,($J47*$BK47),\"\")","v":""}]
["27/05/2016 20:39:43: [G_Auto] :  £ 5.00 Back bet placed on Azrur at 8.4. Fully matched at 8.4.  Ref: 10108","20:46:19","Muss 27th May - 20:40 7f Hcap","Azrur",27,0,null,7,8.4,{"$f":"IF(C48=C47,J47+1,3)","v":3},{"$f":"IF(C48=\"\",\"\",LEFT(C48,5))","v":"Muss"},{"$f":"IF($K48=\"\",0,VLOOKUP($K48,Course,2))","v":"Musselburgh"},{"$f":"IF(ISERROR(SEARCH(\"Charity\",$C48)),\"\",\"Charity\")","v":""},{"$f":"IF(ISERROR(SEARCH(\"PA\",$C48)),\"\",\"PA\")","v":""},{"$f":"IF(ISERROR(SEARCH(\"Class\",$C48)),\"\",\"Class\")","v":""},{"$f":"IF(ISERROR(SEARCH(\"Listed\",$C48)),\"\",\"Listed\")","v":""},{"$f":"IF(ISERROR(SEARCH(\"Grd1\",$C48)),\"\",\"Grd1\")","v":""},{"$f":"IF(ISERROR(SEARCH(\"Grd2\",$C48)),\"\",\"Grd2\")","v":""},{"$f":"IF(ISERROR(SEARCH(\"Grd3\",$C48)),\"\",\"Grd3\")","v":""},{"$f":"IF(ISERROR(SEARCH(\"Grp1\",$C48)),\"\",\"Grp1\")","v":""},{"$f":"IF(ISERROR(SEARCH(\"Grp2\",$C48)),\"\",\"Grp2\")","v":""},{"$f":"IF(ISERROR(SEARCH(\"Grp3\",$C48)),\"\",\"Grp3\")","v":""},{"$f":"IF(ISERROR(SEARCH(\"Grp 3\",$C48)),\"\",\"Grp3\")","v":""},{"$f":"IF(ISERROR(SEARCH(\"Nov\",$C48)),\"\",\"Nov\")","v":""},{"$f":"IF(ISERROR(SEARCH(\"App\",$C48)),\"\",\"App\")","v":""},{"$f":"IF(ISERROR(SEARCH(\"Sell\",$C48)),\"\",\"Sell\")","v":""},{"$f":"IF(ISERROR(SEARCH(\"Mdn\",$C48)),\"\",\"Mdn\")","v":""},{"$f":"IF(ISERROR(SEARCH(\"Beg\",$C48)),\"\",\"Beg\")","v":""},{"$f":"IF(ISERROR(SEARCH(\"Claim\",$C48)),\"\",\"Claim\")","v":""},{"$f":"IF(ISERROR(SEARCH(\"Hunt\",$C48)),\"\",\"Hunt\")","v":""},{"$f":"IF(ISERROR(SEARCH(\"Hcap\",$C48)),\"\",\"Hcap\")","v":"Hcap"},{"$f":"IF(ISERROR(SEARCH(\"Cond\",$C48)),\"\",\"Cond\")","v":""},{"$f":"IF(ISERROR(SEARCH(\"XC\",$C48)),\"\",\"XC\")","v":""},{"$f":"IF(ISERROR(SEARCH(\"Stks\",$C48)),\"\",\"Stks\")","v":""},{"$f":"IF(ISERROR(SEARCH(\"Hrd\",$C48)),\"\",\"Hrd\")","v":""},{"$f":"IF(ISERROR(SEARCH(\"Chs\",$C48)),\"\",\"Chs\")","v":""},{"$f":"IF(ISERROR(SEARCH(\" NHF\",$C48)),\"\",\"NHF\")","v":""},{"$f":"IF(ISERROR(SEARCH(\"INHF\",$C48)),\"\",\"INHF\")","v":""},{"$f":"LEFT(A48,10)","v":"27/05/2016"},{"$f":"CONCATENATE(M48,N48,O48,P48,Q48,R48,S48,T48,U48,V48,W48,X48,Y48,Z48,AB48,AA48,AC48,AD48,AE48,AF48,AG48,AH48,AK48,AL48,AI48,AJ48)","v":"Hcap"},{"$f":"IF($AN48=\"\",0,VLOOKUP($AN48,Race,1))","v":"Hcap"},{"$f":"IF($AN48<>$AO48,1,\"\")","v":""},null,{"$f":"IF($I48=\"\",0,IF($I48<Tables!$T$2,0,1))","v":1},{"$f":"IF($I48=\"\",0,IF($I48>Tables!$U$2,0,1))","v":1},{"$f":"IF($I48=\"\",0,IF($H48<VLOOKUP($K48,Course,3),0,1))","v":1},{"$f":"IF($I48=\"\",0,IF($H48>VLOOKUP($K48,Course,4),0,1))","v":1},{"$f":"IF($AN48=\"\",0,IF($H48<VLOOKUP($AN48,Race,2),0,1))","v":1},{"$f":"IF($AN48=\"\",0,IF($H48>VLOOKUP($AN48,Race,3),0,1))","v":1},{"$f":"IF($J48=\"\",0,VLOOKUP($J48,Selection,2))","v":1},{"$f":"IF(E48=0,0,IF(SUM(AR48:AX48)=$AY$1,1,0))","v":1},{"$f":"IF($AY48<>1,0,IF($G48=1,1,0))","v":0},null,{"$f":"IF($K48=\"\",0,VLOOKUP($K48,Course,3))","v":7},{"$f":"IF($K48=\"\",0,VLOOKUP($K48,Course,4))","v":8},{"$f":"IF($AN48=\"\",0,VLOOKUP($AN48,Race,2))","v":1},{"$f":"IF($AN48=\"\",0,VLOOKUP($AN48,Race,3))","v":50},{"$f":"IF($AN48=\"\",0,VLOOKUP($AN48,Race,4))","v":1},{"$f":"IF($AN48=\"\",0,VLOOKUP($AN48,Race,5))","v":50},{"$f":"WEEKDAY(AM48)","v":6},{"$f":"IF($AY48=1,5,\"\")","v":5},{"$f":"IF($AZ48=1,($I48*$BI48),\"\")","v":""},{"$f":"IF($BG48=1,($J48*$BK48),\"\")","v":""}]
["27/05/2016 20:39:46: [G_Auto] :  £ 5.00 Back bet placed on Courier at 9.8. Fully matched at 9.8.  Ref: 10110","20:46:19","Muss 27th May - 20:40 7f Hcap","Courier",34,0,null,7,9.8,{"$f":"IF(C49=C48,J48+1,3)","v":4},{"$f":"IF(C49=\"\",\"\",LEFT(C49,5))","v":"Muss"},{"$f":"IF($K49=\"\",0,VLOOKUP($K49,Course,2))","v":"Musselburgh"},{"$f":"IF(ISERROR(SEARCH(\"Charity\",$C49)),\"\",\"Charity\")","v":""},{"$f":"IF(ISERROR(SEARCH(\"PA\",$C49)),\"\",\"PA\")","v":""},{"$f":"IF(ISERROR(SEARCH(\"Class\",$C49)),\"\",\"Class\")","v":""},{"$f":"IF(ISERROR(SEARCH(\"Listed\",$C49)),\"\",\"Listed\")","v":""},{"$f":"IF(ISERROR(SEARCH(\"Grd1\",$C49)),\"\",\"Grd1\")","v":""},{"$f":"IF(ISERROR(SEARCH(\"Grd2\",$C49)),\"\",\"Grd2\")","v":""},{"$f":"IF(ISERROR(SEARCH(\"Grd3\",$C49)),\"\",\"Grd3\")","v":""},{"$f":"IF(ISERROR(SEARCH(\"Grp1\",$C49)),\"\",\"Grp1\")","v":""},{"$f":"IF(ISERROR(SEARCH(\"Grp2\",$C49)),\"\",\"Grp2\")","v":""},{"$f":"IF(ISERROR(SEARCH(\"Grp3\",$C49)),\"\",\"Grp3\")","v":""},{"$f":"IF(ISERROR(SEARCH(\"Grp 3\",$C49)),\"\",\"Grp3\")","v":""},{"$f":"IF(ISERROR(SEARCH(\"Nov\",$C49)),\"\",\"Nov\")","v":""},{"$f":"IF(ISERROR(SEARCH(\"App\",$C49)),\"\",\"App\")","v":""},{"$f":"IF(ISERROR(SEARCH(\"Sell\",$C49)),\"\",\"Sell\")","v":""},{"$f":"IF(ISERROR(SEARCH(\"Mdn\",$C49)),\"\",\"Mdn\")","v":""},{"$f":"IF(ISERROR(SEARCH(\"Beg\",$C49)),\"\",\"Beg\")","v":""},{"$f":"IF(ISERROR(SEARCH(\"Claim\",$C49)),\"\",\"Claim\")","v":""},{"$f":"IF(ISERROR(SEARCH(\"Hunt\",$C49)),\"\",\"Hunt\")","v":""},{"$f":"IF(ISERROR(SEARCH(\"Hcap\",$C49)),\"\",\"Hcap\")","v":"Hcap"},{"$f":"IF(ISERROR(SEARCH(\"Cond\",$C49)),\"\",\"Cond\")","v":""},{"$f":"IF(ISERROR(SEARCH(\"XC\",$C49)),\"\",\"XC\")","v":""},{"$f":"IF(ISERROR(SEARCH(\"Stks\",$C49)),\"\",\"Stks\")","v":""},{"$f":"IF(ISERROR(SEARCH(\"Hrd\",$C49)),\"\",\"Hrd\")","v":""},{"$f":"IF(ISERROR(SEARCH(\"Chs\",$C49)),\"\",\"Chs\")","v":""},{"$f":"IF(ISERROR(SEARCH(\" NHF\",$C49)),\"\",\"NHF\")","v":""},{"$f":"IF(ISERROR(SEARCH(\"INHF\",$C49)),\"\",\"INHF\")","v":""},{"$f":"LEFT(A49,10)","v":"27/05/2016"},{"$f":"CONCATENATE(M49,N49,O49,P49,Q49,R49,S49,T49,U49,V49,W49,X49,Y49,Z49,AB49,AA49,AC49,AD49,AE49,AF49,AG49,AH49,AK49,AL49,AI49,AJ49)","v":"Hcap"},{"$f":"IF($AN49=\"\",0,VLOOKUP($AN49,Race,1))","v":"Hcap"},{"$f":"IF($AN49<>$AO49,1,\"\")","v":""},null,{"$f":"IF($I49=\"\",0,IF($I49<Tables!$T$2,0,1))","v":1},{"$f":"IF($I49=\"\",0,IF($I49>Tables!$U$2,0,1))","v":1},{"$f":"IF($I49=\"\",0,IF($H49<VLOOKUP($K49,Course,3),0,1))","v":1},{"$f":"IF($I49=\"\",0,IF($H49>VLOOKUP($K49,Course,4),0,1))","v":1},{"$f":"IF($AN49=\"\",0,IF($H49<VLOOKUP($AN49,Race,2),0,1))","v":1},{"$f":"IF($AN49=\"\",0,IF($H49>VLOOKUP($AN49,Race,3),0,1))","v":1},{"$f":"IF($J49=\"\",0,VLOOKUP($J49,Selection,2))","v":1},{"$f":"IF(E49=0,0,IF(SUM(AR49:AX49)=$AY$1,1,0))","v":1},{"$f":"IF($AY49<>1,0,IF($G49=1,1,0))","v":0},null,{"$f":"IF($K49=\"\",0,VLOOKUP($K49,Course,3))","v":7},{"$f":"IF($K49=\"\",0,VLOOKUP($K49,Course,4))","v":8},{"$f":"IF($AN49=\"\",0,VLOOKUP($AN49,Race,2))","v":1},{"$f":"IF($AN49=\"\",0,VLOOKUP($AN49,Race,3))","v":50},{"$f":"IF($AN49=\"\",0,VLOOKUP($AN49,Race,4))","v":1},{"$f":"IF($AN49=\"\",0,VLOOKUP($AN49,Race,5))","v":50},{"$f":"WEEKDAY(AM49)","v":6},{"$f":"IF($AY49=1,5,\"\")","v":5},{"$f":"IF($AZ49=1,($I49*$BI49),\"\")","v":""},{"$f":"IF($BG49=1,($J49*$BK49),\"\")","v":""}]
["27/05/2016 20:39:39: [G_Auto] :  £ 5.00 Back bet placed on Rasaman at 8. Fully matched at 8.  Ref: 10106","20:46:19","Muss 27th May - 20:40 7f Hcap","Rasaman",25,0,null,7,8,{"$f":"IF(C50=C49,J49+1,3)","v":5},{"$f":"IF(C50=\"\",\"\",LEFT(C50,5))","v":"Muss"},{"$f":"IF($K50=\"\",0,VLOOKUP($K50,Course,2))","v":"Musselburgh"},{"$f":"IF(ISERROR(SEARCH(\"Charity\",$C50)),\"\",\"Charity\")","v":""},{"$f":"IF(ISERROR(SEARCH(\"PA\",$C50)),\"\",\"PA\")","v":""},{"$f":"IF(ISERROR(SEARCH(\"Class\",$C50)),\"\",\"Class\")","v":""},{"$f":"IF(ISERROR(SEARCH(\"Listed\",$C50)),\"\",\"Listed\")","v":""},{"$f":"IF(ISERROR(SEARCH(\"Grd1\",$C50)),\"\",\"Grd1\")","v":""},{"$f":"IF(ISERROR(SEARCH(\"Grd2\",$C50)),\"\",\"Grd2\")","v":""},{"$f":"IF(ISERROR(SEARCH(\"Grd3\",$C50)),\"\",\"Grd3\")","v":""},{"$f":"IF(ISERROR(SEARCH(\"Grp1\",$C50)),\"\",\"Grp1\")","v":""},{"$f":"IF(ISERROR(SEARCH(\"Grp2\",$C50)),\"\",\"Grp2\")","v":""},{"$f":"IF(ISERROR(SEARCH(\"Grp3\",$C50)),\"\",\"Grp3\")","v":""},{"$f":"IF(ISERROR(SEARCH(\"Grp 3\",$C50)),\"\",\"Grp3\")","v":""},{"$f":"IF(ISERROR(SEARCH(\"Nov\",$C50)),\"\",\"Nov\")","v":""},{"$f":"IF(ISERROR(SEARCH(\"App\",$C50)),\"\",\"App\")","v":""},{"$f":"IF(ISERROR(SEARCH(\"Sell\",$C50)),\"\",\"Sell\")","v":""},{"$f":"IF(ISERROR(SEARCH(\"Mdn\",$C50)),\"\",\"Mdn\")","v":""},{"$f":"IF(ISERROR(SEARCH(\"Beg\",$C50)),\"\",\"Beg\")","v":""},{"$f":"IF(ISERROR(SEARCH(\"Claim\",$C50)),\"\",\"Claim\")","v":""},{"$f":"IF(ISERROR(SEARCH(\"Hunt\",$C50)),\"\",\"Hunt\")","v":""},{"$f":"IF(ISERROR(SEARCH(\"Hcap\",$C50)),\"\",\"Hcap\")","v":"Hcap"},{"$f":"IF(ISERROR(SEARCH(\"Cond\",$C50)),\"\",\"Cond\")","v":""},{"$f":"IF(ISERROR(SEARCH(\"XC\",$C50)),\"\",\"XC\")","v":""},{"$f":"IF(ISERROR(SEARCH(\"Stks\",$C50)),\"\",\"Stks\")","v":""},{"$f":"IF(ISERROR(SEARCH(\"Hrd\",$C50)),\"\",\"Hrd\")","v":""},{"$f":"IF(ISERROR(SEARCH(\"Chs\",$C50)),\"\",\"Chs\")","v":""},{"$f":"IF(ISERROR(SEARCH(\" NHF\",$C50)),\"\",\"NHF\")","v":""},{"$f":"IF(ISERROR(SEARCH(\"INHF\",$C50)),\"\",\"INHF\")","v":""},{"$f":"LEFT(A50,10)","v":"27/05/2016"},{"$f":"CONCATENATE(M50,N50,O50,P50,Q50,R50,S50,T50,U50,V50,W50,X50,Y50,Z50,AB50,AA50,AC50,AD50,AE50,AF50,AG50,AH50,AK50,AL50,AI50,AJ50)","v":"Hcap"},{"$f":"IF($AN50=\"\",0,VLOOKUP($AN50,Race,1))","v":"Hcap"},{"$f":"IF($AN50<>$AO50,1,\"\")","v":""},null,{"$f":"IF($I50=\"\",0,IF($I50<Tables!$T$2,0,1))","v":1},{"$f":"IF($I50=\"\",0,IF($I50>Tables!$U$2,0,1))","v":1},{"$f":"IF($I50=\"\",0,IF($H50<VLOOKUP($K50,Course,3),0,1))","v":1},{"$f":"IF($I50=\"\",0,IF($H50>VLOOKUP($K50,Course,4),0,1))","v":1},{"$f":"IF($AN50=\"\",0,IF($H50<VLOOKUP($AN50,Race,2),0,1))","v":1},{"$f":"IF($AN50=\"\",0,IF($H50>VLOOKUP($AN50,Race,3),0,1))","v":1},{"$f":"IF($J50=\"\",0,VLOOKUP($J50,Selection,2))","v":1},{"$f":"IF(E50=0,0,IF(SUM(AR50:AX50)=$AY$1,1,0))","v":1},{"$f":"IF($AY50<>1,0,IF($G50=1,1,0))","v":0},null,{"$f":"IF($K50=\"\",0,VLOOKUP($K50,Course,3))","v":7},{"$f":"IF($K50=\"\",0,VLOOKUP($K50,Course,4))","v":8},{"$f":"IF($AN50=\"\",0,VLOOKUP($AN50,Race,2))","v":1},{"$f":"IF($AN50=\"\",0,VLOOKUP($AN50,Race,3))","v":50},{"$f":"IF($AN50=\"\",0,VLOOKUP($AN50,Race,4))","v":1},{"$f":"IF($AN50=\"\",0,VLOOKUP($AN50,Race,5))","v":50},{"$f":"WEEKDAY(AM50)","v":6},{"$f":"IF($AY50=1,5,\"\")","v":5},{"$f":"IF($AZ50=1,($I50*$BI50),\"\")","v":""},{"$f":"IF($BG50=1,($J50*$BK50),\"\")","v":""}]
["27/05/2016 20:49:40: [G_Auto] :  £ 5.00 Back bet placed on Finish The Story at 7.4. Fully matched at 7.4.  Ref: 10113","20:58:49","Worc 27th May - 20:50 2m7f Hcap Hrd","Finish The Story",22,0,null,15,7.4,{"$f":"IF(C51=C50,J50+1,3)","v":3},{"$f":"IF(C51=\"\",\"\",LEFT(C51,5))","v":"Worc"},{"$f":"IF($K51=\"\",0,VLOOKUP($K51,Course,2))","v":"Worcester"},{"$f":"IF(ISERROR(SEARCH(\"Charity\",$C51)),\"\",\"Charity\")","v":""},{"$f":"IF(ISERROR(SEARCH(\"PA\",$C51)),\"\",\"PA\")","v":""},{"$f":"IF(ISERROR(SEARCH(\"Class\",$C51)),\"\",\"Class\")","v":""},{"$f":"IF(ISERROR(SEARCH(\"Listed\",$C51)),\"\",\"Listed\")","v":""},{"$f":"IF(ISERROR(SEARCH(\"Grd1\",$C51)),\"\",\"Grd1\")","v":""},{"$f":"IF(ISERROR(SEARCH(\"Grd2\",$C51)),\"\",\"Grd2\")","v":""},{"$f":"IF(ISERROR(SEARCH(\"Grd3\",$C51)),\"\",\"Grd3\")","v":""},{"$f":"IF(ISERROR(SEARCH(\"Grp1\",$C51)),\"\",\"Grp1\")","v":""},{"$f":"IF(ISERROR(SEARCH(\"Grp2\",$C51)),\"\",\"Grp2\")","v":""},{"$f":"IF(ISERROR(SEARCH(\"Grp3\",$C51)),\"\",\"Grp3\")","v":""},{"$f":"IF(ISERROR(SEARCH(\"Grp 3\",$C51)),\"\",\"Grp3\")","v":""},{"$f":"IF(ISERROR(SEARCH(\"Nov\",$C51)),\"\",\"Nov\")","v":""},{"$f":"IF(ISERROR(SEARCH(\"App\",$C51)),\"\",\"App\")","v":""},{"$f":"IF(ISERROR(SEARCH(\"Sell\",$C51)),\"\",\"Sell\")","v":""},{"$f":"IF(ISERROR(SEARCH(\"Mdn\",$C51)),\"\",\"Mdn\")","v":""},{"$f":"IF(ISERROR(SEARCH(\"Beg\",$C51)),\"\",\"Beg\")","v":""},{"$f":"IF(ISERROR(SEARCH(\"Claim\",$C51)),\"\",\"Claim\")","v":""},{"$f":"IF(ISERROR(SEARCH(\"Hunt\",$C51)),\"\",\"Hunt\")","v":""},{"$f":"IF(ISERROR(SEARCH(\"Hcap\",$C51)),\"\",\"Hcap\")","v":"Hcap"},{"$f":"IF(ISERROR(SEARCH(\"Cond\",$C51)),\"\",\"Cond\")","v":""},{"$f":"IF(ISERROR(SEARCH(\"XC\",$C51)),\"\",\"XC\")","v":""},{"$f":"IF(ISERROR(SEARCH(\"Stks\",$C51)),\"\",\"Stks\")","v":""},{"$f":"IF(ISERROR(SEARCH(\"Hrd\",$C51)),\"\",\"Hrd\")","v":"Hrd"},{"$f":"IF(ISERROR(SEARCH(\"Chs\",$C51)),\"\",\"Chs\")","v":""},{"$f":"IF(ISERROR(SEARCH(\" NHF\",$C51)),\"\",\"NHF\")","v":""},{"$f":"IF(ISERROR(SEARCH(\"INHF\",$C51)),\"\",\"INHF\")","v":""},{"$f":"LEFT(A51,10)","v":"27/05/2016"},{"$f":"CONCATENATE(M51,N51,O51,P51,Q51,R51,S51,T51,U51,V51,W51,X51,Y51,Z51,AB51,AA51,AC51,AD51,AE51,AF51,AG51,AH51,AK51,AL51,AI51,AJ51)","v":"HcapHrd"},{"$f":"IF($AN51=\"\",0,VLOOKUP($AN51,Race,1))","v":"HcapHrd"},{"$f":"IF($AN51<>$AO51,1,\"\")","v":""},null,{"$f":"IF($I51=\"\",0,IF($I51<Tables!$T$2,0,1))","v":1},{"$f":"IF($I51=\"\",0,IF($I51>Tables!$U$2,0,1))","v":1},{"$f":"IF($I51=\"\",0,IF($H51<VLOOKUP($K51,Course,3),0,1))","v":1},{"$f":"IF($I51=\"\",0,IF($H51>VLOOKUP($K51,Course,4),0,1))","v":0},{"$f":"IF($AN51=\"\",0,IF($H51<VLOOKUP($AN51,Race,2),0,1))","v":1},{"$f":"IF($AN51=\"\",0,IF($H51>VLOOKUP($AN51,Race,3),0,1))","v":1},{"$f":"IF($J51=\"\",0,VLOOKUP($J51,Selection,2))","v":1},{"$f":"IF(E51=0,0,IF(SUM(AR51:AX51)=$AY$1,1,0))","v":0},{"$f":"IF($AY51<>1,0,IF($G51=1,1,0))","v":0},null,{"$f":"IF($K51=\"\",0,VLOOKUP($K51,Course,3))","v":7},{"$f":"IF($K51=\"\",0,VLOOKUP($K51,Course,4))","v":9},{"$f":"IF($AN51=\"\",0,VLOOKUP($AN51,Race,2))","v":1},{"$f":"IF($AN51=\"\",0,VLOOKUP($AN51,Race,3))","v":50},{"$f":"IF($AN51=\"\",0,VLOOKUP($AN51,Race,4))","v":1},{"$f":"IF($AN51=\"\",0,VLOOKUP($AN51,Race,5))","v":50},{"$f":"WEEKDAY(AM51)","v":6},{"$f":"IF($AY51=1,5,\"\")","v":""},{"$f":"IF($AZ51=1,($I51*$BI51),\"\")","v":""},{"$f":"IF($BG51=1,($J51*$BK51),\"\")","v":""}]
["27/05/2016 20:49:42: [G_Auto] :  £ 5.00 Back bet placed on Princesse Fleur at 8.4. Fully matched at 8.4.  Ref: 10115","20:58:49","Worc 27th May - 20:50 2m7f Hcap Hrd","Princesse Fleur",27]

{"sheet":"Tables","index":1,"n_rows":128,"n_cols":22,"rows_kept":128,"cut":false,"hidden":false,"merged":[]}
["Win No",{"$f":"Dutch!AZ1545","v":42},41,"Course Code","Course","Win Min","Win Max","Pl Min","Pl Max","Bet",null,"RaceType","Win Min","Win Max","Pl Min","Pl Max","Bet",null,null,"Min","Max"]
["Win Prof",{"$f":"Dutch!BJ1546","v":1104.5},1270.5,"Aint","Aintree",99,99,99,99,0,null,"AppHcap",1,50,1,50,0,null,"Win",5,12,9.2]
["Ave",{"$f":"B2/B1","v":26.297619047619},30.99,"Ascot","Ascot",99,99,99,99,0,null,"AppMdnStks",1,50,1,50,0,null,"Place",3,3.9]
[null,null,null,"Ayr 1","Ayr",99,99,99,99,1,null,"BegChs",1,50,1,50,0]
[null,null,null,"Ayr 2","Ayr",99,99,99,99,1,null,"BegHrd",1,50,1,50,0,null,3,1]
[null,null,null,"Ayr 3","Ayr",99,99,99,99,1,null,"CharityStks",1,50,1,50,0,null,4,1]
[null,null,null,"Ayr 4","Ayr",99,99,99,99,1,null,"Chs",99,99,1,50,0,null,5,1]
[null,null,null,"Ayr 5","Ayr",99,99,99,99,1,null,"Claim",1,50,1,50,0,null,6,0]
[null,null,null,"Ayr 6","Ayr",99,99,99,99,1,null,"ClaimStks",1,50,1,50,0,null,7,0]
[null,null,null,"Ayr 7","Ayr",99,99,99,99,1,null,"Class",1,50,1,50,0,null,8,0]
[null,null,null,"Ayr 8","Ayr",99,99,99,99,1,null,"ClassStks",1,50,1,50,0]
[null,null,null,"Ayr 9","Ayr",99,99,99,99,1,null,"Cond",1,50,1,50,0]
[null,null,null,"Balli","Ballinrobe",99,99,99,99,0,null,"CondStks",1,50,1,50,0]
[null,null,null,"Bang","Bangor",99,99,99,99,0,null,"Grd1Chs",1,50,1,50,0]
[null,null,null,"Bath","Bath",99,99,9,14,0,null,"Grd1HcapChs",1,50,1,50,0]
[null,null,null,"Bev 1","Beverley",12,12,99,99,0,null,"Grd1HcapHrd",1,50,1,50,0]
[null,null,null,"Bev 2","Beverley",12,12,99,99,0,null,"Grd1Hrd",1,50,1,50,0]
[null,null,null,"Bev 3","Beverley",12,12,99,99,0,null,"Grd1Inhf",1,50,1,50,0]
[null,null,null,"Bev 4","Beverley",12,12,99,99,0,null,"Grd1NHF",1,50,1,50,0]
[null,null,null,"Bev 5","Beverley",12,12,99,99,0,null,"Grd1NovChs",1,50,1,50,0]
[null,null,null,"Bev 6","Beverley",12,12,99,99,0,null,"Grd1NovHrd",1,50,1,50,0]
[null,null,null,"Bev 7","Beverley",12,12,99,99,0,null,"Grd2Chs",1,50,1,50,0]
[null,null,null,"Bev 8","Beverley",12,12,99,99,0,null,"Grd2HcapChs",1,50,1,50,0]
[null,null,null,"Bev 9","Beverley",12,12,99,99,0,null,"Grd2HcapHrd",1,50,1,50,0]
[null,null,null,"Brig","Brighton",99,99,99,99,0,null,"Grd2Hrd",1,50,1,50,0]
[null,null,null,"Carl","Carlisle",99,99,99,99,0,null,"Grd2INHF",1,50,1,50,0]
[null,null,null,"Cart","Cartmel",7,12,99,99,0,null,"Grd2NHF",1,50,1,50,0]
[null,null,null,"Catt","Catterick",5,14,99,99,0,null,"Grd2NovChs",1,50,1,50,0]
[null,null,null,"Chelm","Chelmsford",99,99,99,99,0,null,"Grd2NovHrd",1,50,1,50,0]
[null,null,null,"Chelt","Cheltenham",99,99,99,99,0,null,"Grd3Chs",1,50,1,50,0]
[null,null,null,"Chep","Chepstow",99,99,99,99,0,null,"Grd3HcapChs",1,50,1,50,0]
[null,null,null,"Chest","Chester",99,99,99,99,0,null,"Grd3HcapHrd",1,50,1,50,0]
[null,null,null,"Clon","Clonmell",99,99,99,99,0,null,"Grd3Hrd",1,50,1,50,0]
[null,null,null,"Cork","Cork",99,99,99,99,0,null,"Grd3INHF",1,50,1,50,0]
[null,null,null,"Curr","Curragh",99,99,99,99,0,null,"Grd3NHF",1,50,1,50,0]
[null,null,null,"Donc","Doncaster",99,99,99,99,0,null,"Grd3NovChs",1,50,1,50,0]
[null,null,null,"DownP","Down Patrick",99,99,99,99,0,null,"Grd3NovHrd",1,50,1,50,0]
[null,null,null,"DownR","Down Royal",99,99,99,99,0,null,"Grp1",1,50,1,50,0]
[null,null,null,"Dund","Dundalk",99,99,99,99,0,null,"Grp2",1,50,1,50,0]
[null,null,null,"Epsm","Epsom",99,99,99,99,0,null,"Grp3",1,50,1,50,0]
[null,null,null,"Extr","Exeter",99,99,99,99,0,null,"Hcap",1,50,1,50,1]
[null,null,null,"Fairy","Fairyhouse",6,18,99,99,0,null,"HcapChs",1,50,1,50,0]
[null,null,null,"Fake","Fakenham",99,99,99,99,0,null,"HcapCondChs",1,50,1,50,0]
[null,null,null,"FfosL","Ffos Las",99,99,99,99,0,null,"HcapCondHrd",1,50,1,50,0]
[null,null,null,"Font","Fontwell",6,8,99,99,0,null,"HcapHrd",1,50,1,50,0]
[null,null,null,"Good","Goodwood",99,99,99,99,0,null,"HcapStks",1,50,1,50,0]
[null,null,null,"GowP","Gowran Park",99,99,99,99,0,null,"Hrd",1,50,1,50,0]
[null,null,null,"Ham 1","Hamilton",99,99,99,99,0,null,"Hunt",1,50,99,99,0]
[null,null,null,"Ham 2","Hamilton",99,99,99,99,0,null,"HuntChs",1,50,1,50,0]
[null,null,null,"Ham 3","Hamilton",99,99,99,99,0,null,"HuntHcapChs",1,50,1,50,0]
[null,null,null,"Ham 4","Hamilton",99,99,99,99,0,null,"HuntHcapHrd",1,50,1,50,0]
[null,null,null,"Ham 5","Hamilton",99,99,99,99,0,null,"HuntHrd",1,50,1,50,0]
[null,null,null,"Ham 6","Hamilton",99,99,99,99,0,null,"HuntNHF",1,50,99,99,0]
[null,null,null,"Ham 7","Hamilton",99,99,99,99,0,null,"INHF",1,50,1,50,0]
[null,null,null,"Ham 8","Hamilton",99,99,99,99,0,null,"Listed",99,99,1,50,0]
[null,null,null,"Ham 9","Hamilton",99,99,99,99,0,null,"ListedChs",1,50,1,50,0]
[null,null,null,"Hayd","Haydock",10,13,99,99,0,null,"ListedHcap",1,50,1,50,0]
[null,null,null,"Hex 1","Hexham",99,99,99,99,0,null,"ListedHcapChs",1,50,1,50,0]
[null,null,null,"Hex 2","Hexham",99,99,99,99,0,null,"ListedHcapHrd",1,50,1,50,0]
[null,null,null,"Hex 3","Hexham",99,99,99,99,0,null,"ListedHrd",1,50,1,50,0]
[null,null,null,"Hex 4","Hexham",99,99,99,99,0,null,"ListedINHF",1,50,1,50,0]
[null,null,null,"Hex 5","Hexham",99,99,99,99,0,null,"ListedNovChs",1,50,1,50,0]
[null,null,null,"Hex 6","Hexham",99,99,99,99,0,null,"ListedNovHcapChs",1,50,1,50,0]
[null,null,null,"Hex 7","Hexham",99,99,99,99,0,null,"ListedNovHcapHrd",1,50,1,50,0]
[null,null,null,"Hex 8","Hexham",99,99,99,99,0,null,"ListedNovHrd",1,50,1,50,0]
[null,null,null,"Hex 9","Hexham",99,99,99,99,0,null,"ListedStks",1,50,1,50,0]
[null,null,null,"Hunt","Huntingdon",99,99,99,99,0,null,"Mdn",1,50,1,50,0]
[null,null,null,"Kelso","Kelso",99,99,99,99,0,null,"MdnChs",1,50,1,50,0]
[null,null,null,"Kemp","Kempton",8,13,99,99,0,null,"MdnHcap",1,50,99,99,0]
[null,null,null,"Kilb","Kilbeggan",99,99,99,99,0,null,"MdnHrd",1,50,1,50,0]
[null,null,null,"Killa","Killarney",99,99,99,99,0,null,"MdnHuntChs",1,50,1,50,0]
[null,null,null,"Leic","Leicester",5,11,99,99,0,null,"MdnHuntHrd",1,50,1,50,0]
[null,null,null,"Leop","Leopardstown",99,99,99,99,0,null,"MdnNHF",1,50,1,50,0]
[null,null,null,"Lim 1","Limerick",99,99,99,99,0,null,"MdnStks",1,50,1,50,0]
[null,null,null,"Lim 2","Limerick",99,99,99,99,0,null,"NHF",1,50,1,50,0]
[null,null,null,"Lim 3","Limerick",99,99,99,99,0,null,"Nov",1,50,1,50,0]
[null,null,null,"Lim 4","Limerick",99,99,99,99,0,null,"NovChs",1,50,1,50,0]
[null,null,null,"Lim 5","Limerick",99,99,99,99,0,null,"NovHcapChs",1,50,1,50,0]
[null,null,null,"Lim 6","Limerick",99,99,99,99,0,null,"NovHcapHrd",1,50,1,50,0]
[null,null,null,"Lim 7","Limerick",99,99,99,99,0,null,"NovHrd",1,50,1,50,0]
[null,null,null,"Lim 8","Limerick",99,99,99,99,0,null,"NovHuntChs",1,50,1,50,0]
[null,null,null,"Lim 9","Limerick",99,99,99,99,0,null,"NovHuntHrd",1,50,1,50,0]
[null,null,null,"Ling","Lingfield",8,11,99,99,0,null,"NovSellChs",1,50,1,50,0]
[null,null,null,"Ludl","Ludlow",99,99,99,99,0,null,"NovSellHrd",1,50,1,50,0]
[null,null,null,"MrktR","Market Rasen",99,99,99,99,0,null,"NovStks",1,50,1,50,0]
[null,null,null,"Muss","Musselburgh",7,8,7,9,0,null,"PAGrp1",1,50,1,50,0]
[null,null,null,"Naas","Naas",13,13,99,99,0,null,"PAGrp2",1,50,1,50,0]
[null,null,null,"Navan","Navan",99,99,99,99,0,null,"PAGrp3",1,50,1,50,0]
[null,null,null,"Newb","Newbury",99,99,99,99,0,null,"Sell",1,50,1,50,0]
[null,null,null,"Newc","Newcastle",99,99,99,99,0,null,"SellChs",1,50,1,50,0]
[null,null,null,"Newm","Newmarket",99,99,99,99,0,null,"SellHcap",1,50,1,50,0]
[null,null,null,"Newt","Newton Abbot",99,99,99,99,0,null,"SellHrd",1,50,1,50,0]
[null,null,null,"Nott","Nottingham",5,6,99,99,0,null,"SellStks",1,50,1,50,0]
[null,null,null,"Perth","Perth",99,99,99,99,0,null,"Stks",1,50,1,50,0]
[null,null,null,"Plump","Plumpton",99,99,99,99,0,null,"StksNHF",1,50,1,50,0]
[null,null,null,"Ponte","Pontefract",99,99,99,99,0,null,"XCChs",1,50,1,50,0]
[null,null,null,"Punch","Punchestown",99,99,99,99,0,null,null,99,99,99,99,0]
[null,null,null,"Redc","Redcar",8,17,99,99,0,null,null,99,99,99,99,0]
[null,null,null,"Ripon","Ripon",99,99,99,99,0,null,null,99,99,99,99,0]
[null,null,null,"Rosc","Roscommon",99,99,99,99,0]
[null,null,null,"Sails","Sailsbury",7,7,99,99,0]
[null,null,null,"Sand","Sandown",99,99,99,99,0]
[null,null,null,"Sedge","Sedgefield",99,99,99,99,0]
[null,null,null,"Sligo","Sligo",99,99,99,99,0]
[null,null,null,"Sthl","Southwell",99,99,99,99,0]
[null,null,null,"Strat","Stratford",99,99,99,99,0]
[null,null,null,"Taun","Taunton",99,99,99,99,0]
[null,null,null,"Thirs","Thirsk",99,99,99,99,0]
[null,null,null,"Tipp","Tipperary",99,99,99,99,0]
[null,null,null,"Towc","Towcester",6,7,99,99,0]
[null,null,null,"Tram","Tramore",99,99,99,99,0]
[null,null,null,"Uttox","Uttoxeter",99,99,99,99,0,null,null,null,null,null,null,null,null,null,"Ayr Mdn & Hcap 2.34"]
[null,null,null,"Warw","Warwick",99,99,99,99,0]
[null,null,null,"Weth","Wetherby",99,99,99,99,0]
[null,null,null,"Wex 1","Wexford",99,99,99,99,0]
[null,null,null,"Wex 2","Wexford",99,99,99,99,0]
[null,null,null,"Wex 3","Wexford",99,99,99,99,0]
[null,null,null,"Wex 4","Wexford",99,99,99,99,0]
[null,null,null,"Wex 5","Wexford",99,99,99,99,0]
[null,null,null,"Wex 6","Wexford",99,99,99,99,0]
[null,null,null,"Wex 7","Wexford",99,99,99,99,0]
[null,null,null,"Wex 8","Wexford",99,99,99,99,0]
[null,null,null,"Wex 9","Wexford",99,99,99,99,0]
[null,null,null,"Winc","Wincanton",99,99,99,99,0]
[null,null,null,"Wind","Windsor",99,99,99,99,0]
[null,null,null,"Wolv","Wolverhampton",99,99,99,99,0]
[null,null,null,"Worc","Worcester",7,9,6,15,0]
[null,null,null,"York","York",99,99,99,99,0]

{"sheet":"Tennis","index":2,"n_rows":910,"n_cols":7,"rows_kept":910,"cut":false,"hidden":false,"merged":[]}
["Log","Time","Market","Selection","Profit If Win","Res","P&L"]
["13/05/2016 a","16:17:02","N Djokovic v A Murray - Match Odds","Novak Djokovic",0,0]
["13/05/2016 a","16:17:02","N Djokovic v A Murray - Match Odds","Andy Murray",0,0]
["13/05/2016 a","16:17:13","N Djokovic v A Murray - Match Odds","Novak Djokovic",2.7,0]
["13/05/2016 a","16:17:13","N Djokovic v A Murray - Match Odds","Andy Murray",-5,0]
["13/05/2016 a","16:17:25","N Djokovic v A Murray - Match Odds","Novak Djokovic",2.7,0]
["13/05/2016 a","16:17:25","N Djokovic v A Murray - Match Odds","Andy Murray",-5,0]
["13/05/2016 a","16:17:36","N Djokovic v A Murray - Match Odds","Novak Djokovic",2.7,0]
["14/05/2016 15:20:47:  Guardian has detected that the market is in-play","16:17:36","N Djokovic v A Murray - Match Odds","Andy Murray",-5,0]
["14/05/2016 15:20:47:  Guardian has detected that the market is suspended","16:17:48","N Djokovic v A Murray - Match Odds","Novak Djokovic",2.7,0]
["14/05/2016 15:21:01:  Guardian has detected that the market is now unsuspended","16:17:48","N Djokovic v A Murray - Match Odds","Andy Murray",-5,0]
["14/05/2016 15:21:06: [G_Auto] :  £ 10.00 Lay bet placed on Makarova/Vesnina at 2. Fully matched at 1.93.  Ref: 10031","16:17:59","N Djokovic v A Murray - Match Odds","Novak Djokovic",2.7,0]
["14/05/2016 15:31:03: [G_Auto] :  £ 10.00 Lay bet placed on Makarova/Vesnina at 2. Fully matched at 1.93.  Ref: 10034","16:17:59","N Djokovic v A Murray - Match Odds","Andy Murray",-5,0]
["14/05/2016 15:36:29: [G_Auto] :  Greened up Makarova/Vesnina by Backing 17.87 at 2.16","16:18:11","N Djokovic v A Murray - Match Odds","Novak Djokovic",2.7,0]
["14/05/2016 16:02:32: [G_Auto] :  £ 10.00 Lay bet placed on Makarova/Vesnina at 1.32. Fully matched at 1.25.  Ref: 10045","16:18:11","N Djokovic v A Murray - Match Odds","Andy Murray",-5,0]
["14/05/2016 16:07:50: [G_Auto] :  Greened up Makarova/Vesnina by Backing 11.47 at 1.09","16:18:22","N Djokovic v A Murray - Match Odds","Novak Djokovic",2.7,0]
["14/05/2016 16:54:04:  Guardian has detected that the market is suspended","16:18:22","N Djokovic v A Murray - Match Odds","Andy Murray",-5,0]
[]
["14/05/2016 14:30:41:  Guardian has detected that the market is in-play","16:28:45","N Djokovic v A Murray - Match Odds","Novak Djokovic",2.7,0]
["14/05/2016 14:30:41:  Guardian has detected that the market is suspended","16:28:45","N Djokovic v A Murray - Match Odds","Andy Murray",-5,0]
["14/05/2016 14:30:57:  Guardian has detected that the market is now unsuspended","16:28:59","N Djokovic v A Murray - Match Odds","Novak Djokovic",0.11,0]
["14/05/2016 14:31:02: [G_Auto] :  £ 10.00 Lay bet placed on Garbiñe Muguruza at 1.49. Fully matched at 1.48.  Ref: 10015","16:28:59","N Djokovic v A Murray - Match Odds","Andy Murray",0.07,0]
["14/05/2016 14:43:46: [G_Auto] :  Greened up Garbiñe Muguruza by Backing 8.76 at 1.69","16:29:10","N Djokovic v A Murray - Match Odds","Novak Djokovic",0.1,0]
["14/05/2016 15:49:07: [G_Auto] :  £ 10.00 Lay bet placed on Madison Keys at 1.61. Fully matched at 1.6.  Ref: 10040","16:29:10","N Djokovic v A Murray - Match Odds","Andy Murray",0.1,0]
["14/05/2016 16:14:30: [G_Auto] :  Greened up Madison Keys by Backing 13.56 at 1.18","16:29:20","N Djokovic v A Murray - Match Odds","Novak Djokovic",0.1,0]
["14/05/2016 16:33:02:  Guardian has detected that the market is suspended","16:29:20","N Djokovic v A Murray - Match Odds","Andy Murray",0.1,0]
[null,"16:29:30","N Djokovic v A Murray - Match Odds","Novak Djokovic",0.1,0]
["14/05/2016 14:26:51:  Guardian has detected that the market is in-play","16:29:30","N Djokovic v A Murray - Match Odds","Andy Murray",0.1,0]
["14/05/2016 14:26:51:  Guardian has detected that the market is suspended","16:29:40","N Djokovic v A Murray - Match Odds","Novak Djokovic",0.1,0]
["14/05/2016 14:27:07:  Guardian has detected that the market is now unsuspended","16:29:40","N Djokovic v A Murray - Match Odds","Andy Murray",0.1,0]
["14/05/2016 14:27:12: [G_Auto] :  £ 10.00 Lay bet placed on Andy Murray at 1.1. Fully matched at 1.09.  Ref: 10012","16:31:56","N Djokovic v A Murray - Match Odds","Novak Djokovic",0.1,0]
["14/05/2016 14:44:02: [G_Auto] :  Greened up Andy Murray by Backing 10.48 at 1.04","16:31:56","N Djokovic v A Murray - Match Odds","Andy Murray",0.1,0]
["14/05/2016 15:12:15: [G_Auto] :  £ 10.00 Lay bet placed on Andy Murray at 1.04. Fully matched at 1.03.  Ref: 10028","16:32:06","N Djokovic v A Murray - Match Odds","Novak Djokovic",3.25,0]
["14/05/2016 15:38:14:  Guardian has detected that the market is suspended","16:32:06","N Djokovic v A Murray - Match Odds","Andy Murray",-4.9,0]
[null,"16:32:17","N Djokovic v A Murray - Match Odds","Novak Djokovic",3.25,0]
[null,"16:32:17","N Djokovic v A Murray - Match Odds","Andy Murray",-4.9,0]
[null,"16:32:28","N Djokovic v A Murray - Match Odds","Novak Djokovic",3.25,0]
[null,"16:32:28","N Djokovic v A Murray - Match Odds","Andy Murray",-4.9,0]
[null,"16:32:42","N Djokovic v A Murray - Match Odds","Novak Djokovic",3.25,0]
[null,"16:32:42","N Djokovic v A Murray - Match Odds","Andy Murray",-4.9,0]
[null,"16:32:52","N Djokovic v A Murray - Match Odds","Novak Djokovic",3.25,0]
[null,"16:32:52","N Djokovic v A Murray - Match Odds","Andy Murray",-4.9,0]
[null,"16:33:02","N Djokovic v A Murray - Match Odds","Novak Djokovic",3.25,0]
[null,"16:33:02","N Djokovic v A Murray - Match Odds","Andy Murray",-4.9,0]
[null,"16:33:12","N Djokovic v A Murray - Match Odds","Novak Djokovic",3.25,0]
[null,"16:33:12","N Djokovic v A Murray - Match Odds","Andy Murray",-4.9,0]
[null,"16:33:22","N Djokovic v A Murray - Match Odds","Novak Djokovic",3.25,0]
[null,"16:33:22","N Djokovic v A Murray - Match Odds","Andy Murray",-4.9,0]
[null,"16:33:32","N Djokovic v A Murray - Match Odds","Novak Djokovic",3.25,0]
[null,"16:33:32","N Djokovic v A Murray - Match Odds","Andy Murray",-4.9,0]
[null,"16:33:42","N Djokovic v A Murray - Match Odds","Novak Djokovic",3.25,0]
[null,"16:33:42","N Djokovic v A Murray - Match Odds","Andy Murray",-4.9,0]
[null,"16:33:52","N Djokovic v A Murray - Match Odds","Novak Djokovic",3.25,0]
[null,"16:33:52","N Djokovic v A Murray - Match Odds","Andy Murray",-4.9,0]
[null,"16:34:02","N Djokovic v A Murray - Match Odds","Novak Djokovic",3.25,0]
[null,"16:34:02","N Djokovic v A Murray - Match Odds","Andy Murray",-4.9,0]
[null,"16:34:12","N Djokovic v A Murray - Match Odds","Novak Djokovic",3.25,0]
[null,"16:34:12","N Djokovic v A Murray - Match Odds","Andy Murray",-4.9,0]
[null,"16:34:22","N Djokovic v A Murray - Match Odds","Novak Djokovic",3.25,0]
[null,"16:34:22","N Djokovic v A Murray - Match Odds","Andy Murray",-4.9,0]
[null,"16:34:32","N Djokovic v A Murray - Match Odds","Novak Djokovic",3.25,0]
[null,"16:34:32","N Djokovic v A Murray - Match Odds","Andy Murray",-4.9,0]
[null,"16:34:46","N Djokovic v A Murray - Match Odds","Novak Djokovic",3.25,0]
[null,"16:34:46","N Djokovic v A Murray - Match Odds","Andy Murray",-4.9,0]
[null,"16:34:56","N Djokovic v A Murray - Match Odds","Novak Djokovic",3.25,0]
[null,"16:34:56","N Djokovic v A Murray - Match Odds","Andy Murray",-4.9,0]
[]
[null,"16:37:34","N Djokovic v A Murray - Match Odds","Novak Djokovic",3.25,0]
[null,"16:37:34","N Djokovic v A Murray - Match Odds","Andy Murray",-4.9,0]
[null,"16:37:47","N Djokovic v A Murray - Match Odds","Novak Djokovic",3.25,0]
[null,"16:37:47","N Djokovic v A Murray - Match Odds","Andy Murray",-4.9,0]
[null,"16:38:00","N Djokovic v A Murray - Match Odds","Novak Djokovic",-1.35,0]
[null,"16:38:00","N Djokovic v A Murray - Match Odds","Andy Murray",-1.36,0]
[null,"16:38:13","N Djokovic v A Murray - Match Odds","Novak Djokovic",-1.35,0]
[null,"16:38:13","N Djokovic v A Murray - Match Odds","Andy Murray",-1.36,0]
[null,"16:38:26","N Djokovic v A Murray - Match Odds","Novak Djokovic",-1.35,0]
[null,"16:38:26","N Djokovic v A Murray - Match Odds","Andy Murray",-1.36,0]
[null,"16:38:40","N Djokovic v A Murray - Match Odds","Novak Djokovic",-1.35,0]
[null,"16:38:40","N Djokovic v A Murray - Match Odds","Andy Murray",-1.36,0]
[null,"16:38:53","N Djokovic v A Murray - Match Odds","Novak Djokovic",-6.35,0]
[null,"16:38:53","N Djokovic v A Murray - Match Odds","Andy Murray",2.79,0]
[null,"16:41:58","N Djokovic v A Murray - Match Odds","Novak Djokovic",-6.35,0]
[null,"16:41:58","N Djokovic v A Murray - Match Odds","Andy Murray",2.79,0]
[null,"16:42:10","N Djokovic v A Murray - Match Odds","Novak Djokovic",-0.77,0]
[null,"16:42:10","N Djokovic v A Murray - Match Odds","Andy Murray",-0.78,0]
[null,"16:42:23","N Djokovic v A Murray - Match Odds","Novak Djokovic",-0.77,0]
[null,"16:42:23","N Djokovic v A Murray - Match Odds","Andy Murray",-0.78,0]
[null,"16:42:35","N Djokovic v A Murray - Match Odds","Novak Djokovic",-0.77,0]
[null,"16:42:35","N Djokovic v A Murray - Match Odds","Andy Murray",-0.78,0]
[null,"16:42:47","N Djokovic v A Murray - Match Odds","Novak Djokovic",-0.77,0]
[null,"16:42:47","N Djokovic v A Murray - Match Odds","Andy Murray",-0.78,0]
[null,"16:42:59","N Djokovic v A Murray - Match Odds","Novak Djokovic",-0.77,0]
[null,"16:42:59","N Djokovic v A Murray - Match Odds","Andy Murray",-0.78,0]
[null,"16:43:11","N Djokovic v A Murray - Match Odds","Novak Djokovic",-0.77,0]
[null,"16:43:11","N Djokovic v A Murray - Match Odds","Andy Murray",-0.78,0]
[null,"16:43:24","N Djokovic v A Murray - Match Odds","Novak Djokovic",-0.77,0]
[null,"16:43:24","N Djokovic v A Murray - Match Odds","Andy Murray",-0.78,0]
[null,"16:43:37","N Djokovic v A Murray - Match Odds","Novak Djokovic",-0.77,0]
[null,"16:43:37","N Djokovic v A Murray - Match Odds","Andy Murray",-0.78,0]
[null,"16:43:49","N Djokovic v A Murray - Match Odds","Novak Djokovic",-0.77,0]
[null,"16:43:49","N Djokovic v A Murray - Match Odds","Andy Murray",-0.78,0]
[null,"16:44:01","N Djokovic v A Murray - Match Odds","Novak Djokovic",-0.77,0]
[null,"16:44:01","N Djokovic v A Murray - Match Odds","Andy Murray",-0.78,0]
[null,"16:46:03","N Djokovic v A Murray - Match Odds","Novak Djokovic",-0.77,0]
[null,"16:46:03","N Djokovic v A Murray - Match Odds","Andy Murray",-0.78,0]
[null,"16:46:15","N Djokovic v A Murray - Match Odds","Novak Djokovic",-5.77,0]
[null,"16:46:15","N Djokovic v A Murray - Match Odds","Andy Murray",2.82,0]
[null,"16:46:27","N Djokovic v A Murray - Match Odds","Novak Djokovic",-5.77,0]
[null,"16:46:27","N Djokovic v A Murray - Match Odds","Andy Murray",2.82,0]
[null,"16:46:39","N Djokovic v A Murray - Match Odds","Novak Djokovic",-5.77,0]
[null,"16:46:39","N Djokovic v A Murray - Match Odds","Andy Murray",2.82,0]
[null,"16:46:52","N Djokovic v A Murray - Match Odds","Novak Djokovic",-5.77,0]
[null,"16:46:52","N Djokovic v A Murray - Match Odds","Andy Murray",2.82,0]
[]
[null,"16:51:13","N Djokovic v A Murray - Match Odds","Novak Djokovic",-5.77,0]
[null,"16:51:13","N Djokovic v A Murray - Match Odds","Andy Murray",2.82,0]
[null,"16:51:24","N Djokovic v A Murray - Match Odds","Novak Djokovic",-0.56,0]
[null,"16:51:24","N Djokovic v A Murray - Match Odds","Andy Murray",-0.46,0]
[null,"16:51:36","N Djokovic v A Murray - Match Odds","Novak Djokovic",-0.49,0]
[null,"16:51:36","N Djokovic v A Murray - Match Odds","Andy Murray",-0.51,0]
[null,"16:51:47","N Djokovic v A Murray - Match Odds","Novak Djokovic",-0.49,0]
[null,"16:51:47","N Djokovic v A Murray - Match Odds","Andy Murray",-0.51,0]
[null,"16:51:58","N Djokovic v A Murray - Match Odds","Novak Djokovic",-0.49,0]
[null,"16:51:58","N Djokovic v A Murray - Match Odds","Andy Murray",-0.51,0]
[]
[null,"16:52:09","N Djokovic v A Murray - Match Odds","Novak Djokovic",-0.49,0]
[null,"16:52:09","N Djokovic v A Murray - Match Odds","Andy Murray",-0.51,0]
[null,"16:52:21","N Djokovic v A Murray - Match Odds","Novak Djokovic",-0.49,0]
[null,"16:52:21","N Djokovic v A Murray - Match Odds","Andy Murray",-0.51,0]
[null,"16:52:32","N Djokovic v A Murray - Match Odds","Novak Djokovic",-0.49,0]
[null,"16:52:32","N Djokovic v A Murray - Match Odds","Andy Murray",-0.51,0]
[null,"16:52:43","N Djokovic v A Murray - Match Odds","Novak Djokovic",-0.49,0]
[null,"16:52:43","N Djokovic v A Murray - Match Odds","Andy Murray",-0.51,0]
[null,"16:52:54","N Djokovic v A Murray - Match Odds","Novak Djokovic",-0.49,0]
[null,"16:52:54","N Djokovic v A Murray - Match Odds","Andy Murray",-0.51,0]
[null,"16:53:05","N Djokovic v A Murray - Match Odds","Novak Djokovic",-0.49,0]
[null,"16:53:05","N Djokovic v A Murray - Match Odds","Andy Murray",-0.51,0]
[null,"16:53:17","N Djokovic v A Murray - Match Odds","Novak Djokovic",-0.49,0]
[null,"16:53:17","N Djokovic v A Murray - Match Odds","Andy Murray",-0.51,0]
[null,"16:53:28","N Djokovic v A Murray - Match Odds","Novak Djokovic",-0.49,0]
[null,"16:53:28","N Djokovic v A Murray - Match Odds","Andy Murray",-0.51,0]
[null,"16:53:39","N Djokovic v A Murray - Match Odds","Novak Djokovic",-0.49,0]
[null,"16:53:39","N Djokovic v A Murray - Match Odds","Andy Murray",-0.51,0]
[null,"16:53:50","N Djokovic v A Murray - Match Odds","Novak Djokovic",-0.49,0]
[null,"16:53:50","N Djokovic v A Murray - Match Odds","Andy Murray",-0.51,0]
[null,"16:54:01","N Djokovic v A Murray - Match Odds","Novak Djokovic",-0.49,0]
[null,"16:54:01","N Djokovic v A Murray - Match Odds","Andy Murray",-0.51,0]
[null,"16:56:24","N Djokovic v A Murray - Match Odds","Novak Djokovic",-0.49,0]
[null,"16:56:24","N Djokovic v A Murray - Match Odds","Andy Murray",-0.51,0]
[null,"16:56:35","N Djokovic v A Murray - Match Odds","Novak Djokovic",-5.49,0]
[null,"16:56:35","N Djokovic v A Murray - Match Odds","Andy Murray",2.94,0]
[null,"16:56:46","N Djokovic v A Murray - Match Odds","Novak Djokovic",-5.49,0]
[null,"16:56:46","N Djokovic v A Murray - Match Odds","Andy Murray",2.94,0]
[null,"16:56:57","N Djokovic v A Murray - Match Odds","Novak Djokovic",-5.49,0]
[null,"16:56:57","N Djokovic v A Murray - Match Odds","Andy Murray",2.94,0]
[]
[null,"17:00:34","N Djokovic v A Murray - Match Odds","Novak Djokovic",-5.49,0]
[null,"17:00:34","N Djokovic v A Murray - Match Odds","Andy Murray",2.94,0]
[null,"17:00:44","N Djokovic v A Murray - Match Odds","Novak Djokovic",-5.49,0]
[null,"17:00:44","N Djokovic v A Murray - Match Odds","Andy Murray",2.94,0]
[null,"17:00:55","N Djokovic v A Murray - Match Odds","Novak Djokovic",-0.18,0]
[null,"17:00:55","N Djokovic v A Murray - Match Odds","Andy Murray",-0.19,0]
[null,"17:01:05","N Djokovic v A Murray - Match Odds","Novak Djokovic",-0.18,0]
[null,"17:01:05","N Djokovic v A Murray - Match Odds","Andy Murray",-0.19,0]
[null,"17:01:15","N Djokovic v A Murray - Match Odds","Novak Djokovic",-0.18,0]
[null,"17:01:15","N Djokovic v A Murray - Match Odds","Andy Murray",-0.19,0]
[null,"17:01:26","N Djokovic v A Murray - Match Odds","Novak Djokovic",-0.18,0]
[null,"17:01:26","N Djokovic v A Murray - Match Odds","Andy Murray",-0.19,0]
[null,"17:01:36","N Djokovic v A Murray - Match Odds","Novak Djokovic",-0.18,0]
[null,"17:01:36","N Djokovic v A Murray - Match Odds","Andy Murray",-0.19,0]
[null,"17:01:46","N Djokovic v A Murray - Match Odds","Novak Djokovic",-0.18,0]
[null,"17:01:46","N Djokovic v A Murray - Match Odds","Andy Murray",-0.19,0]
[null,"17:01:57","N Djokovic v A Murray - Match Odds","Novak Djokovic",-0.18,0]
[null,"17:01:57","N Djokovic v A Murray - Match Odds","Andy Murray",-0.19,0]
[null,"17:02:07","N Djokovic v A Murray - Match Odds","Novak Djokovic",-0.18,0]
[null,"17:02:07","N Djokovic v A Murray - Match Odds","Andy Murray",-0.19,0]
[null,"17:02:17","N Djokovic v A Murray - Match Odds","Novak Djokovic",-0.18,0]
[null,"17:02:17","N Djokovic v A Murray - Match Odds","Andy Murray",-0.19,0]
[null,"17:02:28","N Djokovic v A Murray - Match Odds","Novak Djokovic",-0.18,0]
[null,"17:02:28","N Djokovic v A Murray - Match Odds","Andy Murray",-0.19,0]
[null,"17:02:38","N Djokovic v A Murray - Match Odds","Novak Djokovic",-0.18,0]
[null,"17:02:38","N Djokovic v A Murray - Match Odds","Andy Murray",-0.19,0]
[null,"17:02:48","N Djokovic v A Murray - Match Odds","Novak Djokovic",-0.18,0]
[null,"17:02:48","N Djokovic v A Murray - Match Odds","Andy Murray",-0.19,0]
[null,"17:02:59","N Djokovic v A Murray - Match Odds","Novak Djokovic",-0.18,0]
[null,"17:02:59","N Djokovic v A Murray - Match Odds","Andy Murray",-0.19,0]
[null,"17:03:09","N Djokovic v A Murray - Match Odds","Novak Djokovic",-0.18,0]
[null,"17:03:09","N Djokovic v A Murray - Match Odds","Andy Murray",-0.19,0]
[null,"17:04:45","N Djokovic v A Murray - Match Odds","Novak Djokovic",-0.18,0]
[null,"17:04:45","N Djokovic v A Murray - Match Odds","Andy Murray",-0.19,0]
[null,"17:04:56","N Djokovic v A Murray - Match Odds","Novak Djokovic",-5.18,0]
[null,"17:04:56","N Djokovic v A Murray - Match Odds","Andy Murray",3.26,0]
[null,"17:05:06","N Djokovic v A Murray - Match Odds","Novak Djokovic",-5.18,0]
[null,"17:05:06","N Djokovic v A Murray - Match Odds","Andy Murray",3.26,0]
[null,"17:05:16","N Djokovic v A Murray - Match Odds","Novak Djokovic",-5.18,0]
[null,"17:05:16","N Djokovic v A Murray - Match Odds","Andy Murray",3.26,0]
[null,"17:05:27","N Djokovic v A Murray - Match Odds","Novak Djokovic",-5.18,0]
[null,"17:05:27","N Djokovic v A Murray - Match Odds","Andy Murray",3.26,0]
[null,"17:05:37","N Djokovic v A Murray - Match Odds","Novak Djokovic",-5.18,0]
[null,"17:05:37","N Djokovic v A Murray - Match Odds","Andy Murray",3.26,0]
[null,"17:05:47","N Djokovic v A Murray - Match Odds","Novak Djokovic",-5.18,0]
[null,"17:05:47","N Djokovic v A Murray - Match Odds","Andy Murray",3.26,0]
[]
[null,"17:13:10","N Djokovic v A Murray - Match Odds","Novak Djokovic",-5.18,0]
[null,"17:13:10","N Djokovic v A Murray - Match Odds","Andy Murray",3.26,0]
[null,"17:13:20","N Djokovic v A Murray - Match Odds","Novak Djokovic",0.07,0]
[null,"17:13:20","N Djokovic v A Murray - Match Odds","Andy Murray",0.11,0]
[null,"17:13:32","N Djokovic v A Murray - Match Odds","Novak Djokovic",0.1,0]
[null,"17:13:32","N Djokovic v A Murray - Match Odds","Andy Murray",0.09,0]
[null,"17:13:42","N Djokovic v A Murray - Match Odds","Novak Djokovic",0.1,0]
[null,"17:13:42","N Djokovic v A Murray - Match Odds","Andy Murray",0.09,0]
[]
[null,"17:17:01","N Djokovic v A Murray - Match Odds","Novak Djokovic",0.1,0]
[null,"17:17:01","N Djokovic v A Murray - Match Odds","Andy Murray",0.09,0]
[null,"17:17:12","N Djokovic v A Murray - Match Odds","Novak Djokovic",-4.9,0]
[null,"17:17:12","N Djokovic v A Murray - Match Odds","Andy Murray",3.74,0]
[null,"17:17:23","N Djokovic v A Murray - Match Odds","Novak Djokovic",-4.9,0]
[null,"17:17:23","N Djokovic v A Murray - Match Odds","Andy Murray",3.74,0]
[null,"17:17:34","N Djokovic v A Murray - Match Odds","Novak Djokovic",-4.9,0]
[null,"17:17:34","N Djokovic v A Murray - Match Odds","Andy Murray",3.74,0]
[null,"17:17:44","N Djokovic v A Murray - Match Odds","Novak Djokovic",-4.9,0]
[null,"17:17:44","N Djokovic v A Murray - Match Odds","Andy Murray",3.74,0]
[null,"17:17:56","N Djokovic v A Murray - Match Odds","Novak Djokovic",-4.9,0]
[null,"17:17:56","N Djokovic v A Murray - Match Odds","Andy Murray",3.74,0]
[null,"17:18:07","N Djokovic v A Murray - Match Odds","Novak Djokovic",-4.9,0]
[null,"17:18:07","N Djokovic v A Murray - Match Odds","Andy Murray",3.74,0]
[null,"17:18:18","N Djokovic v A Murray - Match Odds","Novak Djokovic",-4.9,0]
[null,"17:18:18","N Djokovic v A Murray - Match Odds","Andy Murray",3.74,0]
[null,"17:18:29","N Djokovic v A Murray - Match Odds","Novak Djokovic",-4.9,0]
[null,"17:18:29","N Djokovic v A Murray - Match Odds","Andy Murray",3.74,0]
[null,"17:18:40","N Djokovic v A Murray - Match Odds","Novak Djokovic",-4.9,0]
[null,"17:18:40","N Djokovic v A Murray - Match Odds","Andy Murray",3.74,0]
[null,"17:18:51","N Djokovic v A Murray - Match Odds","Novak Djokovic",-4.9,0]
[null,"17:18:51","N Djokovic v A Murray - Match Odds","Andy Murray",3.74,0]
[null,"17:19:02","N Djokovic v A Murray - Match Odds","Novak Djokovic",-4.9,0]
[null,"17:19:02","N Djokovic v A Murray - Match Odds","Andy Murray",3.74,0]
[null,"17:19:13","N Djokovic v A Murray - Match Odds","Novak Djokovic",-4.9,0]
[null,"17:19:13","N Djokovic v A Murray - Match Odds","Andy Murray",3.74,0]
[null,"17:19:24","N Djokovic v A Murray - Match Odds","Novak Djokovic",-4.9,0]
[null,"17:19:24","N Djokovic v A Murray - Match Odds","Andy Murray",3.74,0]
[null,"17:19:35","N Djokovic v A Murray - Match Odds","Novak Djokovic",-4.9,0]
[null,"17:19:35","N Djokovic v A Murray - Match Odds","Andy Murray",3.74,0]
[]
[null,"17:25:25","N Djokovic v A Murray - Match Odds","Novak Djokovic",-4.9,0]
[null,"17:25:25","N Djokovic v A Murray - Match Odds","Andy Murray",3.74,0]
[null,"17:25:36","N Djokovic v A Murray - Match Odds","Novak Djokovic",8.09,0]
[null,"17:25:36","N Djokovic v A Murray - Match Odds","Andy Murray",-4.46,0]
[null,"17:25:47","N Djokovic v A Murray - Match Odds","Novak Djokovic",8.09,0]
[null,"17:25:47","N Djokovic v A Murray - Match Odds","Andy Murray",-4.46,0]
[null,"17:25:58","N Djokovic v A Murray - Match Odds","Novak Djokovic",8.31,0]
[null,"17:25:58","N Djokovic v A Murray - Match Odds","Andy Murray",-4.6,0]
[null,"17:26:09","N Djokovic v A Murray - Match Odds","Novak Djokovic",8.31,0]
[null,"17:26:09","N Djokovic v A Murray - Match Odds","Andy Murray",-4.6,0]
[]
[null,"17:30:47","N Djokovic v A Murray - Match Odds","Novak Djokovic",8.31,0]
[null,"17:30:47","N Djokovic v A Murray - Match Odds","Andy Murray",-4.6,0]
[null,"17:30:58","N Djokovic v A Murray - Match Odds","Novak Djokovic",-6.16,0]
[null,"17:30:58","N Djokovic v A Murray - Match Odds","Andy Murray",-0.57,0]
[null,"17:31:09","N Djokovic v A Murray - Match Odds","Novak Djokovic",-6.16,0]
[null,"17:31:09","N Djokovic v A Murray - Match Odds","Andy Murray",-0.57,0]
[null,"17:31:19","N Djokovic v A Murray - Match Odds","Novak Djokovic",-6.81,0]
[null,"17:31:19","N Djokovic v A Murray - Match Odds","Andy Murray",-0.4,0]
[null,"17:31:30","N Djokovic v A Murray - Match Odds","Novak Djokovic",-6.81,0]
[null,"17:31:30","N Djokovic v A Murray - Match Odds","Andy Murray",-0.4,0]
[null,"17:31:41","N Djokovic v A Murray - Match Odds","Novak Djokovic",-6.81,0]
[null,"17:31:41","N Djokovic v A Murray - Match Odds","Andy Murray",-0.4,0]
[null,"17:31:52","N Djokovic v A Murray - Match Odds","Novak Djokovic",-6.81,0]
[null,"17:31:52","N Djokovic v A Murray - Match Odds","Andy Murray",-0.4,0]
[null,"17:32:02","N Djokovic v A Murray - Match Odds","Novak Djokovic",-6.81,0]
[null,"17:32:02","N Djokovic v A Murray - Match Odds","Andy Murray",-0.4,0]
[null,"17:32:13","N Djokovic v A Murray - Match Odds","Novak Djokovic",-6.81,0]
[null,"17:32:13","N Djokovic v A Murray - Match Odds","Andy Murray",-0.4,0]
[null,"17:32:24","N Djokovic v A Murray - Match Odds","Novak Djokovic",-6.81,0]
[null,"17:32:24","N Djokovic v A Murray - Match Odds","Andy Murray",-0.4,0]
[null,"17:32:35","N Djokovic v A Murray - Match Odds","Novak Djokovic",-6.81,0]
[null,"17:32:35","N Djokovic v A Murray - Match Odds","Andy Murray",-0.4,0]
[]
[null,"17:36:11","N Djokovic v A Murray - Match Odds","Novak Djokovic",-6.81,0]
[null,"17:36:11","N Djokovic v A Murray - Match Odds","Andy Murray",-0.4,0]
[null,"17:36:22","N Djokovic v A Murray - Match Odds","Novak Djokovic",-1.61,0]
[null,"17:36:22","N Djokovic v A Murray - Match Odds","Andy Murray",-1.29,0]
[null,"17:36:33","N Djokovic v A Murray - Match Odds","Novak Djokovic",-1.61,0]
[null,"17:36:33","N Djokovic v A Murray - Match Odds","Andy Murray",-1.29,0]
[]
[null,"17:39:36","N Djokovic v A Murray - Match Odds","Novak Djokovic",-1.34,0]
[null,"17:39:36","N Djokovic v A Murray - Match Odds","Andy Murray",-1.33,0]
[null,"17:39:46","N Djokovic v A Murray - Match Odds","Novak Djokovic",-6.34,0]
[null,"17:39:46","N Djokovic v A Murray - Match Odds","Andy Murray",-0.28,0]
[null,"17:39:56","N Djokovic v A Murray - Match Odds","Novak Djokovic",-6.34,0]
[null,"17:39:56","N Djokovic v A Murray - Match Odds","Andy Murray",-0.28,0]
[null,"17:40:06","N Djokovic v A Murray - Match Odds","Novak Djokovic",-6.34,0]
[null,"17:40:06","N Djokovic v A Murray - Match Odds","Andy Murray",-0.28,0]
[null,"17:40:16","N Djokovic v A Murray - Match Odds","Novak Djokovic",-6.34,0]
[null,"17:40:16","N Djokovic v A Murray - Match Odds","Andy Murray",-0.28,0]
[null,"17:40:26","N Djokovic v A Murray - Match Odds","Novak Djokovic",-6.34,0]
[null,"17:40:26","N Djokovic v A Murray - Match Odds","Andy Murray",-0.28,0]
[null,"17:40:36","N Djokovic v A Murray - Match Odds","Novak Djokovic",-6.34,0]
[null,"17:40:36","N Djokovic v A Murray - Match Odds","Andy Murray",-0.28,0]
[null,"17:40:46","N Djokovic v A Murray - Match Odds","Novak Djokovic",-6.34,0]
[null,"17:40:46","N Djokovic v A Murray - Match Odds","Andy Murray",-0.28,0]
[null,"17:40:56","N Djokovic v A Murray - Match Odds","Novak Djokovic",-6.34,0]
[null,"17:40:56","N Djokovic v A Murray - Match Odds","Andy Murray",-0.28,0]
[null,"17:41:06","N Djokovic v A Murray - Match Odds","Novak Djokovic",-6.34,0]
[null,"17:41:06","N Djokovic v A Murray - Match Odds","Andy Murray",-0.28,0]
[null,"17:41:16","N Djokovic v A Murray - Match Odds","Novak Djokovic",-6.34,0]
[null,"17:41:16","N Djokovic v A Murray - Match Odds","Andy Murray",-0.28,0]
[null,"17:41:26","N Djokovic v A Murray - Match Odds","Novak Djokovic",-6.34,0]
[null,"17:41:26","N Djokovic v A Murray - Match Odds","Andy Murray",-0.28,0]
[null,"17:41:36","N Djokovic v A Murray - Match Odds","Novak Djokovic",-6.34,0]
[null,"17:41:36","N Djokovic v A Murray - Match Odds","Andy Murray",-0.28,0]
[null,"17:41:46","N Djokovic v A Murray - Match Odds","Novak Djokovic",-6.34,0]
[null,"17:41:46","N Djokovic v A Murray - Match Odds","Andy Murray",-0.28,0]
[null,"17:41:56","N Djokovic v A Murray - Match Odds","Novak Djokovic",-6.34,0]
[null,"17:41:56","N Djokovic v A Murray - Match Odds","Andy Murray",-0.28,0]
[null,"17:45:52","N Djokovic v A Murray - Match Odds","Novak Djokovic",-6.34,0]
[null,"17:45:52","N Djokovic v A Murray - Match Odds","Andy Murray",-0.28,0]
[null,"17:46:02","N Djokovic v A Murray - Match Odds","Novak Djokovic",-0.84,0]
[null,"17:46:02","N Djokovic v A Murray - Match Odds","Andy Murray",-0.83,0]
[null,"17:46:12","N Djokovic v A Murray - Match Odds","Novak Djokovic",-0.84,0]
[null,"17:46:12","N Djokovic v A Murray - Match Odds","Andy Murray",-0.83,0]
[null,"17:46:22","N Djokovic v A Murray - Match Odds","Novak Djokovic",-0.84,0]
[null,"17:46:22","N Djokovic v A Murray - Match Odds","Andy Murray",-0.83,0]
[null,"17:46:32","N Djokovic v A Murray - Match Odds","Novak Djokovic",-0.84,0]
[null,"17:46:32","N Djokovic v A Murray - Match Odds","Andy Murray",-0.83,0]
[null,"17:46:42","N Djokovic v A Murray - Match Odds","Novak Djokovic",-0.84,0]
[null,"17:46:42","N Djokovic v A Murray - Match Odds","Andy Murray",-0.83,0]
[null,"17:46:52","N Djokovic v A Murray - Match Odds","Novak Djokovic",-0.84,0]
[null,"17:46:52","N Djokovic v A Murray - Match Odds","Andy Murray",-0.83,0]
[null,"17:47:02","N Djokovic v A Murray - Match Odds","Novak Djokovic",-0.84,0]
[null,"17:47:02","N Djokovic v A Murray - Match Odds","Andy Murray",-0.83,0]
[null,"17:49:41","N Djokovic v A Murray - Match Odds","Novak Djokovic",-0.84,0]
[null,"17:49:41","N Djokovic v A Murray - Match Odds","Andy Murray",-0.83,0]
[]
[null,"17:51:07","N Djokovic v A Murray - Match Odds","Novak Djokovic",-5.84,0]
[null,"17:51:07","N Djokovic v A Murray - Match Odds","Andy Murray",-0.73,0]
[]
[null,"16:14:11","N Djokovic v A Murray - Match Odds","Novak Djokovic",0,0]
[null,"16:14:11","N Djokovic v A Murray - Match Odds","Andy Murray",0,0]
[]
[null,"14:36:37","Delbonis v Tipsarevic - Match Odds","Federico Delbonis",0,0]
[null,"14:36:37","Delbonis v Tipsarevic - Match Odds","Janko Tipsarevic",0,0]
[null,"14:36:49","Delbonis v Tipsarevic - Match Odds","Federico Delbonis",1.9,0]
[null,"14:36:49","Delbonis v Tipsarevic - Match Odds","Janko Tipsarevic",-10,0]
[null,"14:37:01","Delbonis v Tipsarevic - Match Odds","Federico Delbonis",1.9,0]
[null,"14:37:01","Delbonis v Tipsarevic - Match Odds","Janko Tipsarevic",-10,0]
[null,"14:37:13","Delbonis v Tipsarevic - Match Odds","Federico Delbonis",1.9,0]
[null,"14:37:13","Delbonis v Tipsarevic - Match Odds","Janko Tipsarevic",-10,0]
[null,"14:39:52","Delbonis v Tipsarevic - Match Odds","Federico Delbonis",1.9,0]
[null,"14:39:52","Delbonis v Tipsarevic - Match Odds","Janko Tipsarevic",-10,0]
[null,"14:40:04","Delbonis v Tipsarevic - Match Odds","Federico Delbonis",0.35,0]
[null,"14:40:04","Delbonis v Tipsarevic - Match Odds","Janko Tipsarevic",0.35,0]
[null,"14:40:16","Delbonis v Tipsarevic - Match Odds","Federico Delbonis",0.35,0]
[null,"14:40:16","Delbonis v Tipsarevic - Match Odds","Janko Tipsarevic",0.35,0]
[null,"14:40:28","Delbonis v Tipsarevic - Match Odds","Federico Delbonis",0.35,0]
[null,"14:40:28","Delbonis v Tipsarevic - Match Odds","Janko Tipsarevic",0.35,0]
[null,"14:40:40","Delbonis v Tipsarevic - Match Odds","Federico Delbonis",0.35,0]
[null,"14:40:40","Delbonis v Tipsarevic - Match Odds","Janko Tipsarevic",0.35,0]
[null,"14:40:52","Delbonis v Tipsarevic - Match Odds","Federico Delbonis",0.35,0]
[null,"14:40:52","Delbonis v Tipsarevic - Match Odds","Janko Tipsarevic",0.35,0]
[null,"14:41:05","Delbonis v Tipsarevic - Match Odds","Federico Delbonis",0.35,0]
[null,"14:41:05","Delbonis v Tipsarevic - Match Odds","Janko Tipsarevic",0.35,0]
[null,"14:41:17","Delbonis v Tipsarevic - Match Odds","Federico Delbonis",0.35,0]
[null,"14:41:17","Delbonis v Tipsarevic - Match Odds","Janko Tipsarevic",0.35,0]
[null,"14:41:29","Delbonis v Tipsarevic - Match Odds","Federico Delbonis",0.35,0]
[null,"14:41:29","Delbonis v Tipsarevic - Match Odds","Janko Tipsarevic",0.35,0]
[null,"14:41:41","Delbonis v Tipsarevic - Match Odds","Federico Delbonis",0.35,0]
[null,"14:41:41","Delbonis v Tipsarevic - Match Odds","Janko Tipsarevic",0.35,0]
[null,"14:41:53","Delbonis v Tipsarevic - Match Odds","Federico Delbonis",0.35,0]
[null,"14:41:53","Delbonis v Tipsarevic - Match Odds","Janko Tipsarevic",0.35,0]
[]
[null,"14:45:19","Delbonis v Tipsarevic - Match Odds","Federico Delbonis",0.35,0]
[null,"14:45:19","Delbonis v Tipsarevic - Match Odds","Janko Tipsarevic",0.35,0]
[null,"14:45:31","Delbonis v Tipsarevic - Match Odds","Federico Delbonis",1.15,0]
[null,"14:45:31","Delbonis v Tipsarevic - Match Odds","Janko Tipsarevic",-9.65,0]
[null,"14:45:43","Delbonis v Tipsarevic - Match Odds","Federico Delbonis",1.15,0]
[null,"14:45:43","Delbonis v Tipsarevic - Match Odds","Janko Tipsarevic",-9.65,0]
[null,"14:52:03","Delbonis v Tipsarevic - Match Odds","Federico Delbonis",1.15,0]
[null,"14:52:03","Delbonis v Tipsarevic - Match Odds","Janko Tipsarevic",-9.65,0]
[null,"14:52:15","Delbonis v Tipsarevic - Match Odds","Federico Delbonis",0.35,0]
[null,"14:52:15","Delbonis v Tipsarevic - Match Odds","Janko Tipsarevic",0.35,0]
[null,"14:52:27","Delbonis v Tipsarevic - Match Odds","Federico Delbonis",0.35,0]
[null,"14:52:27","Delbonis v Tipsarevic - Match Odds","Janko Tipsarevic",0.35,0]
[null,"14:52:39","Delbonis v Tipsarevic - Match Odds","Federico Delbonis",0.35,0]
[null,"14:52:39","Delbonis v Tipsarevic - Match Odds","Janko Tipsarevic",0.35,0]
[null,"14:52:51","Delbonis v Tipsarevic - Match Odds","Federico Delbonis",0.35,0]
[null,"14:52:51","Delbonis v Tipsarevic - Match Odds","Janko Tipsarevic",0.35,0]
[null,"14:53:03","Delbonis v Tipsarevic - Match Odds","Federico Delbonis",0.35,0]
[null,"14:53:03","Delbonis v Tipsarevic - Match Odds","Janko Tipsarevic",0.35,0]
[null,"14:53:15","Delbonis v Tipsarevic - Match Odds","Federico Delbonis",0.35,0]
[null,"14:53:15","Delbonis v Tipsarevic - Match Odds","Janko Tipsarevic",0.35,0]
[null,"14:53:28","Delbonis v Tipsarevic - Match Odds","Federico Delbonis",0.35,0]
[null,"14:53:28","Delbonis v Tipsarevic - Match Odds","Janko Tipsarevic",0.35,0]
[null,"14:53:40","Delbonis v Tipsarevic - Match Odds","Federico Delbonis",0.35,0]
[null,"14:53:40","Delbonis v Tipsarevic - Match Odds","Janko Tipsarevic",0.35,0]
[null,"14:53:51","Delbonis v Tipsarevic - Match Odds","Federico Delbonis",0.35,0]
[null,"14:53:51","Delbonis v Tipsarevic - Match Odds","Janko Tipsarevic",0.35,0]
[]
[null,"15:01:43","Delbonis v Tipsarevic - Match Odds","Federico Delbonis",0.35,0]
[null,"15:01:43","Delbonis v Tipsarevic - Match Odds","Janko Tipsarevic",0.35,0]
[null,"15:01:54","Delbonis v Tipsarevic - Match Odds","Federico Delbonis",0.85,0]
[null,"15:01:54","Delbonis v Tipsarevic - Match Odds","Janko Tipsarevic",-9.65,0]
[null,"15:02:05","Delbonis v Tipsarevic - Match Odds","Federico Delbonis",0.85,0]
[null,"15:02:05","Delbonis v Tipsarevic - Match Odds","Janko Tipsarevic",-9.65,0]
[]
[null,"15:02:17","Delbonis v Tipsarevic - Match Odds","Federico Delbonis",0.85,0]
[null,"15:02:17","Delbonis v Tipsarevic - Match Odds","Janko Tipsarevic",-9.65,0]
[null,"15:06:12","Delbonis v Tipsarevic - Match Odds","Federico Delbonis",0.85,0]
[null,"15:06:12","Delbonis v Tipsarevic - Match Odds","Janko Tipsarevic",-9.65,0]
[null,"15:06:24","Delbonis v Tipsarevic - Match Odds","Federico Delbonis",0.35,0]
[null,"15:06:24","Delbonis v Tipsarevic - Match Odds","Janko Tipsarevic",0.35,0]
[null,"15:06:35","Delbonis v Tipsarevic - Match Odds","Federico Delbonis",0.35,0]
[null,"15:06:35","Delbonis v Tipsarevic - Match Odds","Janko Tipsarevic",0.35,0]
[null,"15:06:46","Delbonis v Tipsarevic - Match Odds","Federico Delbonis",0.35,0]
[null,"15:06:46","Delbonis v Tipsarevic - Match Odds","Janko Tipsarevic",0.35,0]
[null,"15:06:57","Delbonis v Tipsarevic - Match Odds","Federico Delbonis",0.35,0]
[null,"15:06:57","Delbonis v Tipsarevic - Match Odds","Janko Tipsarevic",0.35,0]
[null,"15:07:09","Delbonis v Tipsarevic - Match Odds","Federico Delbonis",0.35,0]
[null,"15:07:09","Delbonis v Tipsarevic - Match Odds","Janko Tipsarevic",0.35,0]
[null,"15:07:20","Delbonis v Tipsarevic - Match Odds","Federico Delbonis",0.35,0]
[null,"15:07:20","Delbonis v Tipsarevic - Match Odds","Janko Tipsarevic",0.35,0]
[null,"15:07:31","Delbonis v Tipsarevic - Match Odds","Federico Delbonis",0.35,0]
[null,"15:07:31","Delbonis v Tipsarevic - Match Odds","Janko Tipsarevic",0.35,0]
[null,"15:07:42","Delbonis v Tipsarevic - Match Odds","Federico Delbonis",0.35,0]
[null,"15:07:42","Delbonis v Tipsarevic - Match Odds","Janko Tipsarevic",0.35,0]
[null,"15:07:52","Delbonis v Tipsarevic - Match Odds","Federico Delbonis",0.35,0]
[null,"15:07:52","Delbonis v Tipsarevic - Match Odds","Janko Tipsarevic",0.35,0]
[null,"15:08:03","Delbonis v Tipsarevic - Match Odds","Federico Delbonis",0.35,0]
[null,"15:08:03","Delbonis v Tipsarevic - Match Odds","Janko Tipsarevic",0.35,0]
[null,"15:08:14","Delbonis v Tipsarevic - Match Odds","Federico Delbonis",0.35,0]
[null,"15:08:14","Delbonis v Tipsarevic - Match Odds","Janko Tipsarevic",0.35,0]
[null,"15:08:25","Delbonis v Tipsarevic - Match Odds","Federico Delbonis",0.35,0]
[null,"15:08:25","Delbonis v Tipsarevic - Match Odds","Janko Tipsarevic",0.35,0]
[null,"15:08:36","Delbonis v Tipsarevic - Match Odds","Federico Delbonis",0.35,0]
[null,"15:08:36","Delbonis v Tipsarevic - Match Odds","Janko Tipsarevic",0.35,0]
[null,"15:08:46","Delbonis v Tipsarevic - Match Odds","Federico Delbonis",0.35,0]
[null,"15:08:46","Delbonis v Tipsarevic - Match Odds","Janko Tipsarevic",0.35,0]
[null,"15:08:57","Delbonis v Tipsarevic - Match Odds","Federico Delbonis",0.35,0]
[null,"15:08:57","Delbonis v Tipsarevic - Match Odds","Janko Tipsarevic",0.35,0]
[null,"15:09:08","Delbonis v Tipsarevic - Match Odds","Federico Delbonis",0.35,0]
[null,"15:09:08","Delbonis v Tipsarevic - Match Odds","Janko Tipsarevic",0.35,0]
[null,"15:11:28","Delbonis v Tipsarevic - Match Odds","Federico Delbonis",0.35,0]
[null,"15:11:28","Delbonis v Tipsarevic - Match Odds","Janko Tipsarevic",0.35,0]
[null,"15:11:39","Delbonis v Tipsarevic - Match Odds","Federico Delbonis",0.95,0]
[null,"15:11:39","Delbonis v Tipsarevic - Match Odds","Janko Tipsarevic",-9.65,0]
[null,"15:11:50","Delbonis v Tipsarevic - Match Odds","Federico Delbonis",0.95,0]
[null,"15:11:50","Delbonis v Tipsarevic - Match Odds","Janko Tipsarevic",-9.65,0]
[null,"15:12:01","Delbonis v Tipsarevic - Match Odds","Federico Delbonis",0.95,0]
[null,"15:12:01","Delbonis v Tipsarevic - Match Odds","Janko Tipsarevic",-9.65,0]
[null,"15:12:11","Delbonis v Tipsarevic - Match Odds","Federico Delbonis",0.95,0]
[null,"15:12:11","Delbonis v Tipsarevic - Match Odds","Janko Tipsarevic",-9.65,0]
[null,"15:15:06","Delbonis v Tipsarevic - Match Odds","Federico Delbonis",0.95,0]
[null,"15:15:06","Delbonis v Tipsarevic - Match Odds","Janko Tipsarevic",-9.65,0]
[null,"15:15:16","Delbonis v Tipsarevic - Match Odds","Federico Delbonis",-0.27,0]
[null,"15:15:16","Delbonis v Tipsarevic - Match Odds","Janko Tipsarevic",-0.27,0]
[null,"15:15:27","Delbonis v Tipsarevic - Match Odds","Federico Delbonis",-0.27,0]
[null,"15:15:27","Delbonis v Tipsarevic - Match Odds","Janko Tipsarevic",-0.27,0]
[null,"15:15:38","Delbonis v Tipsarevic - Match Odds","Federico Delbonis",-0.27,0]
[null,"15:15:38","Delbonis v Tipsarevic - Match Odds","Janko Tipsarevic",-0.27,0]
[null,"15:19:17","Delbonis v Tipsarevic - Match Odds","Federico Delbonis",-0.27,0]
[null,"15:19:17","Delbonis v Tipsarevic - Match Odds","Janko Tipsarevic",-0.27,0]
[null,"15:19:28","Delbonis v Tipsarevic - Match Odds","Federico Delbonis",0.53,0]
[null,"15:19:28","Delbonis v Tipsarevic - Match Odds","Janko Tipsarevic",-10.27,0]
[null,"15:19:39","Delbonis v Tipsarevic - Match Odds","Federico Delbonis",0.53,0]
[null,"15:19:39","Delbonis v Tipsarevic - Match Odds","Janko Tipsarevic",-10.27,0]
[null,"15:19:50","Delbonis v Tipsarevic - Match Odds","Federico Delbonis",0.53,0]
[null,"15:19:50","Delbonis v Tipsarevic - Match Odds","Janko Tipsarevic",-10.27,0]
[null,"15:20:01","Delbonis v Tipsarevic - Match Odds","Federico Delbonis",0.53,0]
[null,"15:20:01","Delbonis v Tipsarevic - Match Odds","Janko Tipsarevic",-10.27,0]
[null,"15:20:12","Delbonis v Tipsarevic - Match Odds","Federico Delbonis",0.53,0]
[null,"15:20:12","Delbonis v Tipsarevic - Match Odds","Janko Tipsarevic",-10.27,0]
[null,"15:20:23","Delbonis v Tipsarevic - Match Odds","Federico Delbonis",0.53,0]
[null,"15:20:23","Delbonis v Tipsarevic - Match Odds","Janko Tipsarevic",-10.27,0]
[null,"15:20:34","Delbonis v Tipsarevic - Match Odds","Federico Delbonis",0.53,0]
[null,"15:20:34","Delbonis v Tipsarevic - Match Odds","Janko Tipsarevic",-10.27,0]
[null,"15:20:45","Delbonis v Tipsarevic - Match Odds","Federico Delbonis",0.53,0]
[null,"15:20:45","Delbonis v Tipsarevic - Match Odds","Janko Tipsarevic",-10.27,0]
[null,"15:20:56","Delbonis v Tipsarevic - Match Odds","Federico Delbonis",0.53,0]
[null,"15:20:56","Delbonis v Tipsarevic - Match Odds","Janko Tipsarevic",-10.27,0]
[]
[null,"15:22:11","Delbonis v Tipsarevic - Match Odds","Federico Delbonis",0.53,0]
[null,"15:22:11","Delbonis v Tipsarevic - Match Odds","Janko Tipsarevic",-10.27,0]
[null,"15:22:21","Delbonis v Tipsarevic - Match Odds","Federico Delbonis",-0.08,0]
[null,"15:22:21","Delbonis v Tipsarevic - Match Odds","Janko Tipsarevic",-0.08,0]
[null,"15:22:32","Delbonis v Tipsarevic - Match Odds","Federico Delbonis",-0.08,0]
[null,"15:22:32","Delbonis v Tipsarevic - Match Odds","Janko Tipsarevic",-0.08,0]
[null,"15:25:11","Delbonis v Tipsarevic - Match Odds","Federico Delbonis",-0.08,0]
[null,"15:25:11","Delbonis v Tipsarevic - Match Odds","Janko Tipsarevic",-0.08,0]
[null,"15:25:22","Delbonis v Tipsarevic - Match Odds","Federico Delbonis",0.72,0]
[null,"15:25:22","Delbonis v Tipsarevic - Match Odds","Janko Tipsarevic",-10.08,0]
[null,"15:25:33","Delbonis v Tipsarevic - Match Odds","Federico Delbonis",0.72,0]
[null,"15:25:33","Delbonis v Tipsarevic - Match Odds","Janko Tipsarevic",-10.08,0]
[null,"15:25:43","Delbonis v Tipsarevic - Match Odds","Federico Delbonis",0.72,0]
[null,"15:25:43","Delbonis v Tipsarevic - Match Odds","Janko Tipsarevic",-10.08,0]
[null,"15:25:54","Delbonis v Tipsarevic - Match Odds","Federico Delbonis",0.72,0]
[null,"15:25:54","Delbonis v Tipsarevic - Match Odds","Janko Tipsarevic",-10.08,0]
[null,"15:26:05","Delbonis v Tipsarevic - Match Odds","Federico Delbonis",0.72,0]
[null,"15:26:05","Delbonis v Tipsarevic - Match Odds","Janko Tipsarevic",-10.08,0]
[null,"15:26:21","Delbonis v Tipsarevic - Match Odds","Federico Delbonis",0.72,0]
[null,"15:26:21","Delbonis v Tipsarevic - Match Odds","Janko Tipsarevic",-10.08,0]
[null,"15:26:35","Delbonis v Tipsarevic - Match Odds","Federico Delbonis",0.72,0]
[null,"15:26:35","Delbonis v Tipsarevic - Match Odds","Janko Tipsarevic",-10.08,0]
[null,"15:27:49","Delbonis v Tipsarevic - Match Odds","Federico Delbonis",0.72,0]
[null,"15:27:49","Delbonis v Tipsarevic - Match Odds","Janko Tipsarevic",-10.08,0]
[null,"15:28:03","Delbonis v Tipsarevic - Match Odds","Federico Delbonis",0.01,0]
[null,"15:28:03","Delbonis v Tipsarevic - Match Odds","Janko Tipsarevic",0.01,0]
[null,"15:28:16","Delbonis v Tipsarevic - Match Odds","Federico Delbonis",0.01,0]
[null,"15:28:16","Delbonis v Tipsarevic - Match Odds","Janko Tipsarevic",0.01,0]
[]
[]
[]
[]
[]
[]
[]
[]
[]
[]
[]
[]
[]
[]
[]
[]
[]
[]
[]
[]
[]
[]
[]
[]
[]
[]
[]
[]
[]
[]
[]
[]
[]
[]
[]
[]
[]
[]
[]
[]
[]
[]
[]
[]
[]
[]
[]
[]
[]
[]
[]
[]
[]
[]
[]
[]
[]
[]
[]
[]
[]
[]
[]
[]
[]
[]
[]
[]
[]
[]
[]
[]
[]
[]
[]
[]
[]
[]
[]
[]
[]
[]
[]
[]
[]
[]
[]
[]
[]
[]
[]
[]
[]
[]
[]
[]
[]
[]
[]
[]
[]
[]
[]
[]
[]
[]
[]
[]
[]
[]
[]
[]
[]
[]
[]
[]
[]
[]
[]
[]
[]
[]
[]
[]
[]
[]
[]
[]
[]
[]
[]
[]
[]
[]
[]
[]
[]
[]
[]
[]
[]
[]
[]
[]
[]
[]
[]
[]
[]
[]
[]
[]
[]
[]
[]
[]
[]
[]
[]
[]
[]
[]
[]
[]
[]
[]
[]
[]
[]
[]
[]
[]
[]
[]
[]
[]
[]
[]
[]
[]
[]
[]
[]
[]
[]
[]
[]
[]
[]
[]
[]
[]
[]
[]
[]
[]
[]
[]
[]
[]
[]
[]
[]
[]
[]
[]
[]
[]
[]
[]
[]
[]
[]
[]
[]
[]
[]
[]
[]
[]
[]
[]
[]
[]
[]
[]
[]
[]
[]
[]
[]
[]
[]
[]
[]
[]
[]
[]
[]
[]
[]
[]
[]
[]
[]
[]
[]
[]
[]
[]
[]
[]
[]
[]
[]
[]
[]
[]
[]
[]
[]
[]
[]
[]
[]
[]
[]
[]
[]
[]
[]
[]
[]
[]
[]
[]
[]
[]
[]
[]
[]
[]
[]
[]
[]
[]
[]
[]
[]
[]
[]
[]
[]
[]
[]
[]
[]
[]
[]
[]
[]
[]
[]
[]
[]
[]
[]
[]
[]
[]
[]
[]
[]
[]
[]
[]
[]
[]
[]
[]
[]
[]
[]
[]
[]
[]
[]
[]
[]
[]
[]
[]
[]
[]
[]
[]
[]
[]
[]
[]
[]
[]
[]
[]
[]
[]
[]
[]
[]
[]
[]
[]
[]
[]
[]
[]
[]
[]
[]
[]
[]
[]
[]
[]
[]
[]
[]
[]
[]
[]
[]
[]
[]
[]
[]
[]
[]
[]
[]
[]
[]
[]
[]
[]
[]
[]
[]
[]
[]
[]
[]
[]
[]
[]
[]
[]
[]
[]
[]
[]
[]
[]
[null,null,null,null,null,null,{"$f":"SUM(G2:G909)","v":0}]

{"sheet":"Soccer","index":3,"n_rows":0,"n_cols":0,"rows_kept":0,"cut":false,"hidden":false,"merged":[]}

{"sheet":"Strategy","index":4,"n_rows":2,"n_cols":13,"rows_kept":2,"cut":false,"hidden":false,"merged":[]}
["Course",null,"Run Min","Run Max",null,null,"Lay odds","stake","win","lose","back odds","stake","Win"]
[null,null,null,null,null,"2nd Fav",8,5,{"$f":"H2","v":5},{"$f":"G2*H2","v":40},3,13,{"$f":"L2*K2","v":39}]