{"text_format":"1","workbook":"xlsx","n_sheets":5,"sheets":["premières chaleurs","intensité chaleurs","saillies naturelles","syncros","échos"],"not_rendered":{"charts":0,"images":0,"macros":1,"external_links":1,"defined_names":7,"comments":5,"pivot_tables":0},"unopened":[],"bounds":{"document_bytes":16777216,"sheet_cells":100000,"rows_first":2000,"rows_last":500,"rows_between":2000,"halvings":0,"cell_chars":16384,"cell_head_chars":4096},"cells_cut":0,"cells_raw":0,"read":"whole","date_system":"1900"}

{"sheet":"premières chaleurs","index":0,"n_rows":201,"n_cols":21,"rows_kept":201,"cut":false,"hidden":false,"merged":[[1,0,1,2],[5,9,5,11],[5,12,5,13],[5,14,5,15],[4,0,4,2],[5,16,5,17],[5,18,5,19],[1,3,1,19],[3,6,3,8],[3,9,3,19],[4,4,6,4],[4,5,6,5],[4,6,6,6],[4,7,6,7],[4,8,6,8],[4,9,4,11],[4,12,4,13],[4,14,4,15],[4,16,4,17],[4,18,4,19],[4,3,5,3]]}
[]
["retour à la page d'accueil",null,null,"Date des premières chaleurs par l'observation ou par échographie/palper "]
[]
[null,null,null,null,null,null,"Par l'observation",null,null,"Par échographie/palper"]
[{"$f":"'[1]1 ères chaleurs'!$B$1","v":"54474307"},null,null,"N° 4 chiffres ","Nom de l'animal","Date de naissance "," Date de l'observation de la première chaleur ","Moyens de détection ","Lieu d'observation"," 1ère date écho/palper:                au sevrage",null,null," 2nde date écho/palper:                à la 1 ère entrée au bâtiment",null," 3ème date écho/palper:                  à la 1 ère sortie du bâtiment",null,"4ème date écho/palper:                à la 2 nde entrée du bâtiment",null,"5ème date écho/palper:                  à la 2 nde sortie du bâtiment"]
[]
[null,null,null,null,null,null,null,null,null,"type","résultat ","épine du bassin?","type","résultat ","type","résultat ","type","résultat ","type","résultat ","Remarques particulières sur l'animal"]
[null,null,null,{"$f":"IF('[1]1 ères chaleurs'!A11=\"\",\"\",IF('[1]1 ères chaleurs'!A11=\"total général\",\"\",'[1]1 ères chaleurs'!A11))","v":"4886"},{"$f":"IF('[1]1 ères chaleurs'!B11=\"\",\"\",'[1]1 ères chaleurs'!B11)","v":"JELLY"},{"$f":"IF('[1]1 ères chaleurs'!C11=\"\",\"\",'[1]1 ères chaleurs'!C11)","v":"2014-10-06"},null,null,null,{"$f":"IF(G8=\"\",\"\",\"XXX\")","v":""},{"$f":"IF(G8=\"\",\"\",\"XXX\")","v":""},null,{"$f":"IF(K8=\"\",\"\",IF(K8=1,IF(G8=\"\",\"\",\"XXX\"),\"XXX\"))","v":""},{"$f":"IF(K8=\"\",\"\",IF(K8=1,IF(G8=\"\",\"\",\"XXX\"),\"XXX\"))","v":""},{"$f":"IF(N8=\"\",\"\",IF(N8=1,IF(G8=\"\",\"\",\"XXX\"),\"XXX\"))","v":""},{"$f":"IF(N8=\"\",\"\",IF(N8=1,IF(G8=\"\",\"\",\"XXX\"),\"XXX\"))","v":""},{"$f":"IF(P8=\"\",\"\",IF(P8=1,IF(G8=\"\",\"\",\"XXX\"),\"XXX\"))","v":""},{"$f":"IF(P8=\"\",\"\",IF(P8=1,IF(G8=\"\",\"\",\"XXX\"),\"XXX\"))","v":""},{"$f":"IF(R8=\"\",\"\",IF(R8=1,IF(G8=\"\",\"\",\"XXX\"),\"XXX\"))","v":""},{"$f":"IF(R8=\"\",\"\",IF(R8=1,IF(G8=\"\",\"\",\"XXX\"),\"XXX\"))","v":""}]
[null,null,null,{"$f":"IF('[1]1 ères chaleurs'!A12=\"\",\"\",IF('[1]1 ères chaleurs'!A12=\"total général\",\"\",'[1]1 ères chaleurs'!A12))","v":"4887"},{"$f":"IF('[1]1 ères chaleurs'!B12=\"\",\"\",'[1]1 ères chaleurs'!B12)","v":"JACYNTHE"},{"$f":"IF('[1]1 ères chaleurs'!C12=\"\",\"\",'[1]1 ères chaleurs'!C12)","v":"2014-10-07"},null,null,null,"","",null,{"$f":"IF(K9=\"\",\"\",IF(K9=1,IF(G9=\"\",\"\",\"XXX\"),\"XXX\"))","v":""},"","","","","","",""]
[null,null,null,{"$f":"IF('[1]1 ères chaleurs'!A13=\"\",\"\",IF('[1]1 ères chaleurs'!A13=\"total général\",\"\",'[1]1 ères chaleurs'!A13))","v":"4888"},{"$f":"IF('[1]1 ères chaleurs'!B13=\"\",\"\",'[1]1 ères chaleurs'!B13)","v":"JASMINE"},{"$f":"IF('[1]1 ères chaleurs'!C13=\"\",\"\",'[1]1 ères chaleurs'!C13)","v":"2014-10-08"},null,null,null,"","",null,"","","","","","","",""]
[null,null,null,{"$f":"IF('[1]1 ères chaleurs'!A14=\"\",\"\",IF('[1]1 ères chaleurs'!A14=\"total général\",\"\",'[1]1 ères chaleurs'!A14))","v":"4889"},{"$f":"IF('[1]1 ères chaleurs'!B14=\"\",\"\",'[1]1 ères chaleurs'!B14)","v":"JALA"},{"$f":"IF('[1]1 ères chaleurs'!C14=\"\",\"\",'[1]1 ères chaleurs'!C14)","v":"2014-10-11"},null,null,null,"","",null,"","","","","","","",""]
[null,null,null,{"$f":"IF('[1]1 ères chaleurs'!A15=\"\",\"\",IF('[1]1 ères chaleurs'!A15=\"total général\",\"\",'[1]1 ères chaleurs'!A15))","v":"4890"},{"$f":"IF('[1]1 ères chaleurs'!B15=\"\",\"\",'[1]1 ères chaleurs'!B15)","v":"JENNA"},{"$f":"IF('[1]1 ères chaleurs'!C15=\"\",\"\",'[1]1 ères chaleurs'!C15)","v":"2014-10-18"},null,null,null,"","",null,"","","","","","","",""]
[null,null,null,{"$f":"IF('[1]1 ères chaleurs'!A16=\"\",\"\",IF('[1]1 ères chaleurs'!A16=\"total général\",\"\",'[1]1 ères chaleurs'!A16))","v":"4891"},{"$f":"IF('[1]1 ères chaleurs'!B16=\"\",\"\",'[1]1 ères chaleurs'!B16)","v":"JIXIE"},{"$f":"IF('[1]1 ères chaleurs'!C16=\"\",\"\",'[1]1 ères chaleurs'!C16)","v":"2014-10-18"},null,null,null,"","",null,"","","","","","","",""]
[null,null,null,{"$f":"IF('[1]1 ères chaleurs'!A17=\"\",\"\",IF('[1]1 ères chaleurs'!A17=\"total général\",\"\",'[1]1 ères chaleurs'!A17))","v":"4892"},{"$f":"IF('[1]1 ères chaleurs'!B17=\"\",\"\",'[1]1 ères chaleurs'!B17)","v":"JAMAIQUE"},{"$f":"IF('[1]1 ères chaleurs'!C17=\"\",\"\",'[1]1 ères chaleurs'!C17)","v":"2014-10-29"},null,null,null,"","",null,"","","","","","","",""]
[null,null,null,{"$f":"IF('[1]1 ères chaleurs'!A18=\"\",\"\",IF('[1]1 ères chaleurs'!A18=\"total général\",\"\",'[1]1 ères chaleurs'!A18))","v":"4893"},{"$f":"IF('[1]1 ères chaleurs'!B18=\"\",\"\",'[1]1 ères chaleurs'!B18)","v":"JACOTTE"},{"$f":"IF('[1]1 ères chaleurs'!C18=\"\",\"\",'[1]1 ères chaleurs'!C18)","v":"2014-11-03"},null,null,null,"","",null,"","","","","","","",""]
[null,null,null,{"$f":"IF('[1]1 ères chaleurs'!A19=\"\",\"\",IF('[1]1 ères chaleurs'!A19=\"total général\",\"\",'[1]1 ères chaleurs'!A19))","v":"4894"},{"$f":"IF('[1]1 ères chaleurs'!B19=\"\",\"\",'[1]1 ères chaleurs'!B19)","v":"JOCONDE"},{"$f":"IF('[1]1 ères chaleurs'!C19=\"\",\"\",'[1]1 ères chaleurs'!C19)","v":"2014-11-08"},null,null,null,"","",null,"","","","","","","",""]
[null,null,null,{"$f":"IF('[1]1 ères chaleurs'!A20=\"\",\"\",IF('[1]1 ères chaleurs'!A20=\"total général\",\"\",'[1]1 ères chaleurs'!A20))","v":"4895"},{"$f":"IF('[1]1 ères chaleurs'!B20=\"\",\"\",'[1]1 ères chaleurs'!B20)","v":"JETSET"},{"$f":"IF('[1]1 ères chaleurs'!C20=\"\",\"\",'[1]1 ères chaleurs'!C20)","v":"2014-11-12"},null,null,null,"","",null,"","","","","","","",""]
[null,null,null,{"$f":"IF('[1]1 ères chaleurs'!A21=\"\",\"\",IF('[1]1 ères chaleurs'!A21=\"total général\",\"\",'[1]1 ères chaleurs'!A21))","v":"4896"},{"$f":"IF('[1]1 ères chaleurs'!B21=\"\",\"\",'[1]1 ères chaleurs'!B21)","v":"JOY"},{"$f":"IF('[1]1 ères chaleurs'!C21=\"\",\"\",'[1]1 ères chaleurs'!C21)","v":"2014-11-18"},null,null,null,"","",null,"","","","","","","",""]
[null,null,null,{"$f":"IF('[1]1 ères chaleurs'!A22=\"\",\"\",IF('[1]1 ères chaleurs'!A22=\"total général\",\"\",'[1]1 ères chaleurs'!A22))","v":"4897"},{"$f":"IF('[1]1 ères chaleurs'!B22=\"\",\"\",'[1]1 ères chaleurs'!B22)","v":"JASMA"},{"$f":"IF('[1]1 ères chaleurs'!C22=\"\",\"\",'[1]1 ères chaleurs'!C22)","v":"2014-11-24"},null,null,null,"","",null,"","","","","","","",""]
[null,null,null,{"$f":"IF('[1]1 ères chaleurs'!A23=\"\",\"\",IF('[1]1 ères chaleurs'!A23=\"total général\",\"\",'[1]1 ères chaleurs'!A23))","v":"4898"},{"$f":"IF('[1]1 ères chaleurs'!B23=\"\",\"\",'[1]1 ères chaleurs'!B23)","v":"JAMIE"},{"$f":"IF('[1]1 ères chaleurs'!C23=\"\",\"\",'[1]1 ères chaleurs'!C23)","v":"2014-12-01"},null,null,null,"","",null,"","","","","","","",""]
[null,null,null,{"$f":"IF('[1]1 ères chaleurs'!A24=\"\",\"\",IF('[1]1 ères chaleurs'!A24=\"total général\",\"\",'[1]1 ères chaleurs'!A24))","v":"4899"},{"$f":"IF('[1]1 ères chaleurs'!B24=\"\",\"\",'[1]1 ères chaleurs'!B24)","v":"JALNA"},{"$f":"IF('[1]1 ères chaleurs'!C24=\"\",\"\",'[1]1 ères chaleurs'!C24)","v":"2014-12-03"},null,null,null,"","",null,"","","","","","","",""]
[null,null,null,{"$f":"IF('[1]1 ères chaleurs'!A25=\"\",\"\",IF('[1]1 ères chaleurs'!A25=\"total général\",\"\",'[1]1 ères chaleurs'!A25))","v":"4901"},{"$f":"IF('[1]1 ères chaleurs'!B25=\"\",\"\",'[1]1 ères chaleurs'!B25)","v":"JODIE"},{"$f":"IF('[1]1 ères chaleurs'!C25=\"\",\"\",'[1]1 ères chaleurs'!C25)","v":"2014-12-06"},null,null,null,"","",null,"","","","","","","",""]
[null,null,null,{"$f":"IF('[1]1 ères chaleurs'!A26=\"\",\"\",IF('[1]1 ères chaleurs'!A26=\"total général\",\"\",'[1]1 ères chaleurs'!A26))","v":"4902"},{"$f":"IF('[1]1 ères chaleurs'!B26=\"\",\"\",'[1]1 ères chaleurs'!B26)","v":"JUNGLE"},{"$f":"IF('[1]1 ères chaleurs'!C26=\"\",\"\",'[1]1 ères chaleurs'!C26)","v":"2014-12-08"},null,null,null,"","",null,"","","","","","","",""]
[null,null,null,{"$f":"IF('[1]1 ères chaleurs'!A27=\"\",\"\",IF('[1]1 ères chaleurs'!A27=\"total général\",\"\",'[1]1 ères chaleurs'!A27))","v":"4903"},{"$f":"IF('[1]1 ères chaleurs'!B27=\"\",\"\",'[1]1 ères chaleurs'!B27)","v":"JELENE"},{"$f":"IF('[1]1 ères chaleurs'!C27=\"\",\"\",'[1]1 ères chaleurs'!C27)","v":"2014-12-08"},null,null,null,"","",null,"","","","","","","",""]
[null,null,null,{"$f":"IF('[1]1 ères chaleurs'!A28=\"\",\"\",IF('[1]1 ères chaleurs'!A28=\"total général\",\"\",'[1]1 ères chaleurs'!A28))","v":"4904"},{"$f":"IF('[1]1 ères chaleurs'!B28=\"\",\"\",'[1]1 ères chaleurs'!B28)","v":"JAMBETTE"},{"$f":"IF('[1]1 ères chaleurs'!C28=\"\",\"\",'[1]1 ères chaleurs'!C28)","v":"2014-12-12"},null,null,null,"","",null,"","","","","","","",""]
[null,null,null,{"$f":"IF('[1]1 ères chaleurs'!A29=\"\",\"\",IF('[1]1 ères chaleurs'!A29=\"total général\",\"\",'[1]1 ères chaleurs'!A29))","v":"4905"},{"$f":"IF('[1]1 ères chaleurs'!B29=\"\",\"\",'[1]1 ères chaleurs'!B29)","v":"JOLIE"},{"$f":"IF('[1]1 ères chaleurs'!C29=\"\",\"\",'[1]1 ères chaleurs'!C29)","v":"2014-12-14"},null,null,null,"","",null,"","","","","","","",""]
[null,null,null,{"$f":"IF('[1]1 ères chaleurs'!A30=\"\",\"\",IF('[1]1 ères chaleurs'!A30=\"total général\",\"\",'[1]1 ères chaleurs'!A30))","v":"4906"},{"$f":"IF('[1]1 ères chaleurs'!B30=\"\",\"\",'[1]1 ères chaleurs'!B30)","v":"JOYEUSE"},{"$f":"IF('[1]1 ères chaleurs'!C30=\"\",\"\",'[1]1 ères chaleurs'!C30)","v":"2014-12-14"},null,null,null,"",{"$f":"IF(G27=\"\",\"\",\"XXX\")","v":""},null,"",{"$f":"IF(K27=\"\",\"\",IF(K27=1,IF(G27=\"\",\"\",\"XXX\"),\"XXX\"))","v":""},"",{"$f":"IF(N27=\"\",\"\",IF(N27=1,IF(G27=\"\",\"\",\"XXX\"),\"XXX\"))","v":""},"","","",{"$f":"IF(R27=\"\",\"\",IF(R27=1,IF(G27=\"\",\"\",\"XXX\"),\"XXX\"))","v":""}]
[null,null,null,{"$f":"IF('[1]1 ères chaleurs'!A31=\"\",\"\",IF('[1]1 ères chaleurs'!A31=\"total général\",\"\",'[1]1 ères chaleurs'!A31))","v":"4907"},{"$f":"IF('[1]1 ères chaleurs'!B31=\"\",\"\",'[1]1 ères chaleurs'!B31)","v":"JORDANIE"},{"$f":"IF('[1]1 ères chaleurs'!C31=\"\",\"\",'[1]1 ères chaleurs'!C31)","v":"2014-12-16"},null,null,null,"","",null,"","","","","","","",""]
[null,null,null,{"$f":"IF('[1]1 ères chaleurs'!A32=\"\",\"\",IF('[1]1 ères chaleurs'!A32=\"total général\",\"\",'[1]1 ères chaleurs'!A32))","v":"4908"},{"$f":"IF('[1]1 ères chaleurs'!B32=\"\",\"\",'[1]1 ères chaleurs'!B32)","v":"LACUNE"},{"$f":"IF('[1]1 ères chaleurs'!C32=\"\",\"\",'[1]1 ères chaleurs'!C32)","v":"2015-01-04"},null,null,null,"","",null,"","","","","","","",""]
[null,null,null,{"$f":"IF('[1]1 ères chaleurs'!A33=\"\",\"\",IF('[1]1 ères chaleurs'!A33=\"total général\",\"\",'[1]1 ères chaleurs'!A33))","v":"4909"},{"$f":"IF('[1]1 ères chaleurs'!B33=\"\",\"\",'[1]1 ères chaleurs'!B33)","v":"LIQUEUR"},{"$f":"IF('[1]1 ères chaleurs'!C33=\"\",\"\",'[1]1 ères chaleurs'!C33)","v":"2015-01-19"},null,null,null,"","",null,"","","","","","","",""]
[null,null,null,{"$f":"IF('[1]1 ères chaleurs'!A34=\"\",\"\",IF('[1]1 ères chaleurs'!A34=\"total général\",\"\",'[1]1 ères chaleurs'!A34))","v":"4910"},{"$f":"IF('[1]1 ères chaleurs'!B34=\"\",\"\",'[1]1 ères chaleurs'!B34)","v":"LITURGIE"},{"$f":"IF('[1]1 ères chaleurs'!C34=\"\",\"\",'[1]1 ères chaleurs'!C34)","v":"2015-02-03"},null,null,null,"","",null,"","","","","","","",""]
[null,null,null,{"$f":"IF('[1]1 ères chaleurs'!A35=\"\",\"\",IF('[1]1 ères chaleurs'!A35=\"total général\",\"\",'[1]1 ères chaleurs'!A35))","v":"4911"},{"$f":"IF('[1]1 ères chaleurs'!B35=\"\",\"\",'[1]1 ères chaleurs'!B35)","v":"LAINE"},{"$f":"IF('[1]1 ères chaleurs'!C35=\"\",\"\",'[1]1 ères chaleurs'!C35)","v":"2015-02-08"},null,null,null,"","",null,"","","","","","","",""]
[null,null,null,{"$f":"IF('[1]1 ères chaleurs'!A36=\"\",\"\",IF('[1]1 ères chaleurs'!A36=\"total général\",\"\",'[1]1 ères chaleurs'!A36))","v":"5937"},{"$f":"IF('[1]1 ères chaleurs'!B36=\"\",\"\",'[1]1 ères chaleurs'!B36)","v":"IMPERIALE"},{"$f":"IF('[1]1 ères chaleurs'!C36=\"\",\"\",'[1]1 ères chaleurs'!C36)","v":"2013-12-01"},null,null,null,"","",null,"","","","","","","",""]
[null,null,null,{"$f":"IF('[1]1 ères chaleurs'!A37=\"\",\"\",IF('[1]1 ères chaleurs'!A37=\"total général\",\"\",'[1]1 ères chaleurs'!A37))","v":"5946"},{"$f":"IF('[1]1 ères chaleurs'!B37=\"\",\"\",'[1]1 ères chaleurs'!B37)","v":"JARDINE"},{"$f":"IF('[1]1 ères chaleurs'!C37=\"\",\"\",'[1]1 ères chaleurs'!C37)","v":"2014-01-15"},null,null,null,"","",null,"","","","","","","",""]
[null,null,null,{"$f":"IF('[1]1 ères chaleurs'!A38=\"\",\"\",IF('[1]1 ères chaleurs'!A38=\"total général\",\"\",'[1]1 ères chaleurs'!A38))","v":"5948"},{"$f":"IF('[1]1 ères chaleurs'!B38=\"\",\"\",'[1]1 ères chaleurs'!B38)","v":"JUPETTE"},{"$f":"IF('[1]1 ères chaleurs'!C38=\"\",\"\",'[1]1 ères chaleurs'!C38)","v":"2014-09-29"},null,null,null,"","",null,"","","","","","","",""]
[null,null,null,{"$f":"IF('[1]1 ères chaleurs'!A39=\"\",\"\",IF('[1]1 ères chaleurs'!A39=\"total général\",\"\",'[1]1 ères chaleurs'!A39))","v":"5949"},{"$f":"IF('[1]1 ères chaleurs'!B39=\"\",\"\",'[1]1 ères chaleurs'!B39)","v":"JALIE"},{"$f":"IF('[1]1 ères chaleurs'!C39=\"\",\"\",'[1]1 ères chaleurs'!C39)","v":"2014-09-29"},null,null,null,"","",null,"","","","","","","",""]
[null,null,null,{"$f":"IF('[1]1 ères chaleurs'!A40=\"\",\"\",IF('[1]1 ères chaleurs'!A40=\"total général\",\"\",'[1]1 ères chaleurs'!A40))","v":""},{"$f":"IF('[1]1 ères chaleurs'!B40=\"\",\"\",'[1]1 ères chaleurs'!B40)","v":""},{"$f":"IF('[1]1 ères chaleurs'!C40=\"\",\"\",'[1]1 ères chaleurs'!C40)","v":""},null,null,null,"","",null,"","","","","","","",""]
[null,null,null,{"$f":"IF('[1]1 ères chaleurs'!A41=\"\",\"\",IF('[1]1 ères chaleurs'!A41=\"total général\",\"\",'[1]1 ères chaleurs'!A41))","v":""},{"$f":"IF('[1]1 ères chaleurs'!B41=\"\",\"\",'[1]1 ères chaleurs'!B41)","v":""},{"$f":"IF('[1]1 ères chaleurs'!C41=\"\",\"\",'[1]1 ères chaleurs'!C41)","v":""},null,null,null,"","",null,"","","","","","","",""]
[null,null,null,{"$f":"IF('[1]1 ères chaleurs'!A42=\"\",\"\",IF('[1]1 ères chaleurs'!A42=\"total général\",\"\",'[1]1 ères chaleurs'!A42))","v":""},{"$f":"IF('[1]1 ères chaleurs'!B42=\"\",\"\",'[1]1 ères chaleurs'!B42)","v":""},{"$f":"IF('[1]1 ères chaleurs'!C42=\"\",\"\",'[1]1 ères chaleurs'!C42)","v":""},null,null,null,"","",null,"","","","","","","",""]
[null,null,null,{"$f":"IF('[1]1 ères chaleurs'!A43=\"\",\"\",IF('[1]1 ères chaleurs'!A43=\"total général\",\"\",'[1]1 ères chaleurs'!A43))","v":""},{"$f":"IF('[1]1 ères chaleurs'!B43=\"\",\"\",'[1]1 ères chaleurs'!B43)","v":""},{"$f":"IF('[1]1 ères chaleurs'!C43=\"\",\"\",'[1]1 ères chaleurs'!C43)","v":""},null,null,null,"","",null,"","","","","","","",""]
[null,null,null,{"$f":"IF('[1]1 ères chaleurs'!A44=\"\",\"\",IF('[1]1 ères chaleurs'!A44=\"total général\",\"\",'[1]1 ères chaleurs'!A44))","v":""},{"$f":"IF('[1]1 ères chaleurs'!B44=\"\",\"\",'[1]1 ères chaleurs'!B44)","v":""},{"$f":"IF('[1]1 ères chaleurs'!C44=\"\",\"\",'[1]1 ères chaleurs'!C44)","v":""},null,null,null,"","",null,"","","","","","","",""]
[null,null,null,{"$f":"IF('[1]1 ères chaleurs'!A45=\"\",\"\",IF('[1]1 ères chaleurs'!A45=\"total général\",\"\",'[1]1 ères chaleurs'!A45))","v":""},{"$f":"IF('[1]1 ères chaleurs'!B45=\"\",\"\",'[1]1 ères chaleurs'!B45)","v":""},{"$f":"IF('[1]1 ères chaleurs'!C45=\"\",\"\",'[1]1 ères chaleurs'!C45)","v":""},null,null,null,"","",null,"","","","","","","",""]
[null,null,null,{"$f":"IF('[1]1 ères chaleurs'!A46=\"\",\"\",IF('[1]1 ères chaleurs'!A46=\"total général\",\"\",'[1]1 ères chaleurs'!A46))","v":""},{"$f":"IF('[1]1 ères chaleurs'!B46=\"\",\"\",'[1]1 ères chaleurs'!B46)","v":""},{"$f":"IF('[1]1 ères chaleurs'!C46=\"\",\"\",'[1]1 ères chaleurs'!C46)","v":""},null,null,null,"","",null,"","","","","","","",""]
[null,null,null,{"$f":"IF('[1]1 ères chaleurs'!A47=\"\",\"\",IF('[1]1 ères chaleurs'!A47=\"total général\",\"\",'[1]1 ères chaleurs'!A47))","v":""},{"$f":"IF('[1]1 ères chaleurs'!B47=\"\",\"\",'[1]1 ères chaleurs'!B47)","v":""},{"$f":"IF('[1]1 ères chaleurs'!C47=\"\",\"\",'[1]1 ères chaleurs'!C47)","v":""},null,null,null,"","",null,"","","","","","","",""]
[null,null,null,{"$f":"IF('[1]1 ères chaleurs'!A48=\"\",\"\",IF('[1]1 ères chaleurs'!A48=\"total général\",\"\",'[1]1 ères chaleurs'!A48))","v":""},{"$f":"IF('[1]1 ères chaleurs'!B48=\"\",\"\",'[1]1 ères chaleurs'!B48)","v":""},{"$f":"IF('[1]1 ères chaleurs'!C48=\"\",\"\",'[1]1 ères chaleurs'!C48)","v":""},null,null,null,"","",null,"","","","","","","",""]
[null,null,null,{"$f":"IF('[1]1 ères chaleurs'!A49=\"\",\"\",IF('[1]1 ères chaleurs'!A49=\"total général\",\"\",'[1]1 ères chaleurs'!A49))","v":""},{"$f":"IF('[1]1 ères chaleurs'!B49=\"\",\"\",'[1]1 ères chaleurs'!B49)","v":""},{"$f":"IF('[1]1 ères chaleurs'!C49=\"\",\"\",'[1]1 ères chaleurs'!C49)","v":""},null,null,null,"","",null,"","","","","","","",""]
[null,null,null,{"$f":"IF('[1]1 ères chaleurs'!A50=\"\",\"\",IF('[1]1 ères chaleurs'!A50=\"total général\",\"\",'[1]1 ères chaleurs'!A50))","v":""},{"$f":"IF('[1]1 ères chaleurs'!B50=\"\",\"\",'[1]1 ères chaleurs'!B50)","v":""},{"$f":"IF('[1]1 ères chaleurs'!C50=\"\",\"\",'[1]1 ères chaleurs'!C50)","v":""},null,null,null,"","",null,"","","","","","","",""]
[null,null,null,{"$f":"IF('[1]1 ères chaleurs'!A51=\"\",\"\",IF('[1]1 ères chaleurs'!A51=\"total général\",\"\",'[1]1 ères chaleurs'!A51))","v":""},{"$f":"IF('[1]1 ères chaleurs'!B51=\"\",\"\",'[1]1 ères chaleurs'!B51)","v":""},{"$f":"IF('[1]1 ères chaleurs'!C51=\"\",\"\",'[1]1 ères chaleurs'!C51)","v":""},null,null,null,"","",null,"","","","","","","",""]
[null,null,null,{"$f":"IF('[1]1 ères chaleurs'!A52=\"\",\"\",IF('[1]1 ères chaleurs'!A52=\"total général\",\"\",'[1]1 ères chaleurs'!A52))","v":""},{"$f":"IF('[1]1 ères chaleurs'!B52=\"\",\"\",'[1]1 ères chaleurs'!B52)","v":""},{"$f":"IF('[1]1 ères chaleurs'!C52=\"\",\"\",'[1]1 ères chaleurs'!C52)","v":""},null,null,null,"","",null,"","","","","","","",""]
[null,null,null,{"$f":"IF('[1]1 ères chaleurs'!A53=\"\",\"\",IF('[1]1 ères chaleurs'!A53=\"total général\",\"\",'[1]1 ères chaleurs'!A53))","v":""},{"$f":"IF('[1]1 ères chaleurs'!B53=\"\",\"\",'[1]1 ères chaleurs'!B53)","v":""},{"$f":"IF('[1]1 ères chaleurs'!C53=\"\",\"\",'[1]1 ères chaleurs'!C53)","v":""},null,null,null,"","",null,"","","","","","","",""]
[null,null,null,{"$f":"IF('[1]1 ères chaleurs'!A54=\"\",\"\",IF('[1]1 ères chaleurs'!A54=\"total général\",\"\",'[1]1 ères chaleurs'!A54))","v":""},{"$f":"IF('[1]1 ères chaleurs'!B54=\"\",\"\",'[1]1 ères chaleurs'!B54)","v":""},{"$f":"IF('[1]1 ères chaleurs'!C54=\"\",\"\",'[1]1 ères chaleurs'!C54)","v":""},null,null,null,"","",null,"","","","","","","",""]
[null,null,null,{"$f":"IF('[1]1 ères chaleurs'!A55=\"\",\"\",IF('[1]1 ères chaleurs'!A55=\"total général\",\"\",'[1]1 ères chaleurs'!A55))","v":""},{"$f":"IF('[1]1 ères chaleurs'!B55=\"\",\"\",'[1]1 ères chaleurs'!B55)","v":""},{"$f":"IF('[1]1 ères chaleurs'!C55=\"\",\"\",'[1]1 ères chaleurs'!C55)","v":""},null,null,null,"","",null,"","","","","","","",""]
[null,null,null,{"$f":"IF('[1]1 ères chaleurs'!A56=\"\",\"\",IF('[1]1 ères chaleurs'!A56=\"total général\",\"\",'[1]1 ères chaleurs'!A56))","v":""},{"$f":"IF('[1]1 ères chaleurs'!B56=\"\",\"\",'[1]1 ères chaleurs'!B56)","v":""},{"$f":"IF('[1]1 ères chaleurs'!C56=\"\",\"\",'[1]1 ères chaleurs'!C56)","v":""},null,null,null,"","",null,"","","","","","","",""]
[null,null,null,{"$f":"IF('[1]1 ères chaleurs'!A57=\"\",\"\",IF('[1]1 ères chaleurs'!A57=\"total général\",\"\",'[1]1 ères chaleurs'!A57))","v":""},{"$f":"IF('[1]1 ères chaleurs'!B57=\"\",\"\",'[1]1 ères chaleurs'!B57)","v":""},{"$f":"IF('[1]1 ères chaleurs'!C57=\"\",\"\",'[1]1 ères chaleurs'!C57)","v":""},null,null,null,"","",null,"","","","","","","",""]
[null,null,null,{"$f":"IF('[1]1 ères chaleurs'!A58=\"\",\"\",IF('[1]1 ères chaleurs'!A58=\"total général\",\"\",'[1]1 ères chaleurs'!A58))","v":""},{"$f":"IF('[1]1 ères chaleurs'!B58=\"\",\"\",'[1]1 ères chaleurs'!B58)","v":""},{"$f":"IF('[1]1 ères chaleurs'!C58=\"\",\"\",'[1]1 ères chaleurs'!C58)","v":""},null,null,null,"","",null,"","","","","","","",""]
[null,null,null,{"$f":"IF('[1]1 ères chaleurs'!A59=\"\",\"\",IF('[1]1 ères chaleurs'!A59=\"total général\",\"\",'[1]1 ères chaleurs'!A59))","v":""},{"$f":"IF('[1]1 ères chaleurs'!B59=\"\",\"\",'[1]1 ères chaleurs'!B59)","v":""},{"$f":"IF('[1]1 ères chaleurs'!C59=\"\",\"\",'[1]1 ères chaleurs'!C59)","v":""},null,null,null,"","",null,"","","","","","","",""]
[null,null,null,{"$f":"IF('[1]1 ères chaleurs'!A60=\"\",\"\",IF('[1]1 ères chaleurs'!A60=\"total général\",\"\",'[1]1 ères chaleurs'!A60))","v":""},{"$f":"IF('[1]1 ères chaleurs'!B60=\"\",\"\",'[1]1 ères chaleurs'!B60)","v":""},{"$f":"IF('[1]1 ères chaleurs'!C60=\"\",\"\",'[1]1 ères chaleurs'!C60)","v":""},null,null,null,"","",null,"","","","","","","",""]
[null,null,null,{"$f":"IF('[1]1 ères chaleurs'!A61=\"\",\"\",IF('[1]1 ères chaleurs'!A61=\"total général\",\"\",'[1]1 ères chaleurs'!A61))","v":""},{"$f":"IF('[1]1 ères chaleurs'!B61=\"\",\"\",'[1]1 ères chaleurs'!B61)","v":""},{"$f":"IF('[1]1 ères chaleurs'!C61=\"\",\"\",'[1]1 ères chaleurs'!C61)","v":""},null,null,null,"","",null,"","","","","","","",""]
[null,null,null,{"$f":"IF('[1]1 ères chaleurs'!A62=\"\",\"\",IF('[1]1 ères chaleurs'!A62=\"total général\",\"\",'[1]1 ères chaleurs'!A62))","v":""},{"$f":"IF('[1]1 ères chaleurs'!B62=\"\",\"\",'[1]1 ères chaleurs'!B62)","v":""},{"$f":"IF('[1]1 ères chaleurs'!C62=\"\",\"\",'[1]1 ères chaleurs'!C62)","v":""},null,null,null,"","",null,"","","","","","","",""]
[null,null,null,{"$f":"IF('[1]1 ères chaleurs'!A63=\"\",\"\",IF('[1]1 ères chaleurs'!A63=\"total général\",\"\",'[1]1 ères chaleurs'!A63))","v":""},{"$f":"IF('[1]1 ères chaleurs'!B63=\"\",\"\",'[1]1 ères chaleurs'!B63)","v":""},{"$f":"IF('[1]1 ères chaleurs'!C63=\"\",\"\",'[1]1 ères chaleurs'!C63)","v":""},null,null,null,"","",null,"","","","","","","",""]
[null,null,null,{"$f":"IF('[1]1 ères chaleurs'!A64=\"\",\"\",IF('[1]1 ères chaleurs'!A64=\"total général\",\"\",'[1]1 ères chaleurs'!A64))","v":""},{"$f":"IF('[1]1 ères chaleurs'!B64=\"\",\"\",'[1]1 ères chaleurs'!B64)","v":""},{"$f":"IF('[1]1 ères chaleurs'!C64=\"\",\"\",'[1]1 ères chaleurs'!C64)","v":""},null,null,null,"","",null,"","","","","","","",""]
[null,null,null,{"$f":"IF('[1]1 ères chaleurs'!A65=\"\",\"\",IF('[1]1 ères chaleurs'!A65=\"total général\",\"\",'[1]1 ères chaleurs'!A65))","v":""},{"$f":"IF('[1]1 ères chaleurs'!B65=\"\",\"\",'[1]1 ères chaleurs'!B65)","v":""},{"$f":"IF('[1]1 ères chaleurs'!C65=\"\",\"\",'[1]1 ères chaleurs'!C65)","v":""},null,null,null,"","",null,"","","","","","","",""]
[null,null,null,{"$f":"IF('[1]1 ères chaleurs'!A66=\"\",\"\",IF('[1]1 ères chaleurs'!A66=\"total général\",\"\",'[1]1 ères chaleurs'!A66))","v":""},{"$f":"IF('[1]1 ères chaleurs'!B66=\"\",\"\",'[1]1 ères chaleurs'!B66)","v":""},{"$f":"IF('[1]1 ères chaleurs'!C66=\"\",\"\",'[1]1 ères chaleurs'!C66)","v":""},null,null,null,"","",null,"","","","","","","",""]
[null,null,null,{"$f":"IF('[1]1 ères chaleurs'!A67=\"\",\"\",IF('[1]1 ères chaleurs'!A67=\"total général\",\"\",'[1]1 ères chaleurs'!A67))","v":""},{"$f":"IF('[1]1 ères chaleurs'!B67=\"\",\"\",'[1]1 ères chaleurs'!B67)","v":""},{"$f":"IF('[1]1 ères chaleurs'!C67=\"\",\"\",'[1]1 ères chaleurs'!C67)","v":""},null,null,null,"","",null,"","","","","","","",""]
[null,null,null,{"$f":"IF('[1]1 ères chaleurs'!A68=\"\",\"\",IF('[1]1 ères chaleurs'!A68=\"total général\",\"\",'[1]1 ères chaleurs'!A68))","v":""},{"$f":"IF('[1]1 ères chaleurs'!B68=\"\",\"\",'[1]1 ères chaleurs'!B68)","v":""},{"$f":"IF('[1]1 ères chaleurs'!C68=\"\",\"\",'[1]1 ères chaleurs'!C68)","v":""},null,null,null,"","",null,"","","","","","","",""]
[null,null,null,{"$f":"IF('[1]1 ères chaleurs'!A69=\"\",\"\",IF('[1]1 ères chaleurs'!A69=\"total général\",\"\",'[1]1 ères chaleurs'!A69))","v":""},{"$f":"IF('[1]1 ères chaleurs'!B69=\"\",\"\",'[1]1 ères chaleurs'!B69)","v":""},{"$f":"IF('[1]1 ères chaleurs'!C69=\"\",\"\",'[1]1 ères chaleurs'!C69)","v":""},null,null,null,"","",null,"","","","","","","",""]
[null,null,null,{"$f":"IF('[1]1 ères chaleurs'!A70=\"\",\"\",IF('[1]1 ères chaleurs'!A70=\"total général\",\"\",'[1]1 ères chaleurs'!A70))","v":""},{"$f":"IF('[1]1 ères chaleurs'!B70=\"\",\"\",'[1]1 ères chaleurs'!B70)","v":""},{"$f":"IF('[1]1 ères chaleurs'!C70=\"\",\"\",'[1]1 ères chaleurs'!C70)","v":""},null,null,null,"","",null,"","","","","","","",""]
[null,null,null,{"$f":"IF('[1]1 ères chaleurs'!A71=\"\",\"\",IF('[1]1 ères chaleurs'!A71=\"total général\",\"\",'[1]1 ères chaleurs'!A71))","v":""},{"$f":"IF('[1]1 ères chaleurs'!B71=\"\",\"\",'[1]1 ères chaleurs'!B71)","v":""},{"$f":"IF('[1]1 ères chaleurs'!C71=\"\",\"\",'[1]1 ères chaleurs'!C71)","v":""},null,null,null,"","",null,"","","","","","","",""]
[null,null,null,{"$f":"IF('[1]1 ères chaleurs'!A72=\"\",\"\",IF('[1]1 ères chaleurs'!A72=\"total général\",\"\",'[1]1 ères chaleurs'!A72))","v":""},{"$f":"IF('[1]1 ères chaleurs'!B72=\"\",\"\",'[1]1 ères chaleurs'!B72)","v":""},{"$f":"IF('[1]1 ères chaleurs'!C72=\"\",\"\",'[1]1 ères chaleurs'!C72)","v":""},null,null,null,"","",null,"","","","","","","",""]
[null,null,null,{"$f":"IF('[1]1 ères chaleurs'!A73=\"\",\"\",IF('[1]1 ères chaleurs'!A73=\"total général\",\"\",'[1]1 ères chaleurs'!A73))","v":""},{"$f":"IF('[1]1 ères chaleurs'!B73=\"\",\"\",'[1]1 ères chaleurs'!B73)","v":""},{"$f":"IF('[1]1 ères chaleurs'!C73=\"\",\"\",'[1]1 ères chaleurs'!C73)","v":""},null,null,null,"","",null,"","","","","","","",""]
[null,null,null,{"$f":"IF('[1]1 ères chaleurs'!A74=\"\",\"\",IF('[1]1 ères chaleurs'!A74=\"total général\",\"\",'[1]1 ères chaleurs'!A74))","v":""},{"$f":"IF('[1]1 ères chaleurs'!B74=\"\",\"\",'[1]1 ères chaleurs'!B74)","v":""},{"$f":"IF('[1]1 ères chaleurs'!C74=\"\",\"\",'[1]1 ères chaleurs'!C74)","v":""},null,null,null,"","",null,"","","","","","","",""]
[null,null,null,{"$f":"IF('[1]1 ères chaleurs'!A75=\"\",\"\",IF('[1]1 ères chaleurs'!A75=\"total général\",\"\",'[1]1 ères chaleurs'!A75))","v":""},{"$f":"IF('[1]1 ères chaleurs'!B75=\"\",\"\",'[1]1 ères chaleurs'!B75)","v":""},{"$f":"IF('[1]1 ères chaleurs'!C75=\"\",\"\",'[1]1 ères chaleurs'!C75)","v":""},null,null,null,"","",null,"","",{"$f":"IF(N72=\"\",\"\",IF(N72=1,IF(G72=\"\",\"\",\"XXX\"),\"XXX\"))","v":""},"",{"$f":"IF(P72=\"\",\"\",IF(P72=1,IF(G72=\"\",\"\",\"XXX\"),\"XXX\"))","v":""},{"$f":"IF(P72=\"\",\"\",IF(P72=1,IF(G72=\"\",\"\",\"XXX\"),\"XXX\"))","v":""},{"$f":"IF(R72=\"\",\"\",IF(R72=1,IF(G72=\"\",\"\",\"XXX\"),\"XXX\"))","v":""},""]
[null,null,null,{"$f":"IF('[1]1 ères chaleurs'!A76=\"\",\"\",IF('[1]1 ères chaleurs'!A76=\"total général\",\"\",'[1]1 ères chaleurs'!A76))","v":""},{"$f":"IF('[1]1 ères chaleurs'!B76=\"\",\"\",'[1]1 ères chaleurs'!B76)","v":""},{"$f":"IF('[1]1 ères chaleurs'!C76=\"\",\"\",'[1]1 ères chaleurs'!C76)","v":""},null,null,null,{"$f":"IF(G73=\"\",\"\",\"XXX\")","v":""},"",null,{"$f":"IF(K73=\"\",\"\",IF(K73=1,IF(G73=\"\",\"\",\"XXX\"),\"XXX\"))","v":""},"","","","","","",""]
[null,null,null,{"$f":"IF('[1]1 ères chaleurs'!A77=\"\",\"\",IF('[1]1 ères chaleurs'!A77=\"total général\",\"\",'[1]1 ères chaleurs'!A77))","v":""},{"$f":"IF('[1]1 ères chaleurs'!B77=\"\",\"\",'[1]1 ères chaleurs'!B77)","v":""},{"$f":"IF('[1]1 ères chaleurs'!C77=\"\",\"\",'[1]1 ères chaleurs'!C77)","v":""},null,null,null,"","",null,"","","","","","","",""]
[null,null,null,{"$f":"IF('[1]1 ères chaleurs'!A78=\"\",\"\",IF('[1]1 ères chaleurs'!A78=\"total général\",\"\",'[1]1 ères chaleurs'!A78))","v":""},{"$f":"IF('[1]1 ères chaleurs'!B78=\"\",\"\",'[1]1 ères chaleurs'!B78)","v":""},{"$f":"IF('[1]1 ères chaleurs'!C78=\"\",\"\",'[1]1 ères chaleurs'!C78)","v":""},null,null,null,"","",null,"","","","","","","",""]
[null,null,null,{"$f":"IF('[1]1 ères chaleurs'!A79=\"\",\"\",IF('[1]1 ères chaleurs'!A79=\"total général\",\"\",'[1]1 ères chaleurs'!A79))","v":""},{"$f":"IF('[1]1 ères chaleurs'!B79=\"\",\"\",'[1]1 ères chaleurs'!B79)","v":""},{"$f":"IF('[1]1 ères chaleurs'!C79=\"\",\"\",'[1]1 ères chaleurs'!C79)","v":""},null,null,null,"","",null,"","","","","","","",""]
[null,null,null,{"$f":"IF('[1]1 ères chaleurs'!A80=\"\",\"\",IF('[1]1 ères chaleurs'!A80=\"total général\",\"\",'[1]1 ères chaleurs'!A80))","v":""},{"$f":"IF('[1]1 ères chaleurs'!B80=\"\",\"\",'[1]1 ères chaleurs'!B80)","v":""},{"$f":"IF('[1]1 ères chaleurs'!C80=\"\",\"\",'[1]1 ères chaleurs'!C80)","v":""},null,null,null,"","",null,"","","","","","","",""]
[null,null,null,{"$f":"IF('[1]1 ères chaleurs'!A81=\"\",\"\",IF('[1]1 ères chaleurs'!A81=\"total général\",\"\",'[1]1 ères chaleurs'!A81))","v":""},{"$f":"IF('[1]1 ères chaleurs'!B81=\"\",\"\",'[1]1 ères chaleurs'!B81)","v":""},{"$f":"IF('[1]1 ères chaleurs'!C81=\"\",\"\",'[1]1 ères chaleurs'!C81)","v":""},null,null,null,"","",null,"","","","","","","",""]
[null,null,null,{"$f":"IF('[1]1 ères chaleurs'!A82=\"\",\"\",IF('[1]1 ères chaleurs'!A82=\"total général\",\"\",'[1]1 ères chaleurs'!A82))","v":""},{"$f":"IF('[1]1 ères chaleurs'!B82=\"\",\"\",'[1]1 ères chaleurs'!B82)","v":""},{"$f":"IF('[1]1 ères chaleurs'!C82=\"\",\"\",'[1]1 ères chaleurs'!C82)","v":""},null,null,null,"","",null,"","","","","","","",""]
[null,null,null,{"$f":"IF('[1]1 ères chaleurs'!A83=\"\",\"\",IF('[1]1 ères chaleurs'!A83=\"total général\",\"\",'[1]1 ères chaleurs'!A83))","v":""},{"$f":"IF('[1]1 ères chaleurs'!B83=\"\",\"\",'[1]1 ères chaleurs'!B83)","v":""},{"$f":"IF('[1]1 ères chaleurs'!C83=\"\",\"\",'[1]1 ères chaleurs'!C83)","v":""},null,null,null,"","",null,"","","","","","","",""]
[null,null,null,{"$f":"IF('[1]1 ères chaleurs'!A84=\"\",\"\",IF('[1]1 ères chaleurs'!A84=\"total général\",\"\",'[1]1 ères chaleurs'!A84))","v":""},{"$f":"IF('[1]1 ères chaleurs'!B84=\"\",\"\",'[1]1 ères chaleurs'!B84)","v":""},{"$f":"IF('[1]1 ères chaleurs'!C84=\"\",\"\",'[1]1 ères chaleurs'!C84)","v":""},null,null,null,"","",null,"","","","","","","",""]
[null,null,null,{"$f":"IF('[1]1 ères chaleurs'!A85=\"\",\"\",IF('[1]1 ères chaleurs'!A85=\"total général\",\"\",'[1]1 ères chaleurs'!A85))","v":""},{"$f":"IF('[1]1 ères chaleurs'!B85=\"\",\"\",'[1]1 ères chaleurs'!B85)","v":""},{"$f":"IF('[1]1 ères chaleurs'!C85=\"\",\"\",'[1]1 ères chaleurs'!C85)","v":""},null,null,null,"","",null,"","","","","","","",""]
[null,null,null,{"$f":"IF('[1]1 ères chaleurs'!A86=\"\",\"\",IF('[1]1 ères chaleurs'!A86=\"total général\",\"\",'[1]1 ères chaleurs'!A86))","v":""},{"$f":"IF('[1]1 ères chaleurs'!B86=\"\",\"\",'[1]1 ères chaleurs'!B86)","v":""},{"$f":"IF('[1]1 ères chaleurs'!C86=\"\",\"\",'[1]1 ères chaleurs'!C86)","v":""},null,null,null,"","",null,"","","","","","","",""]
[null,null,null,{"$f":"IF('[1]1 ères chaleurs'!A87=\"\",\"\",IF('[1]1 ères chaleurs'!A87=\"total général\",\"\",'[1]1 ères chaleurs'!A87))","v":""},{"$f":"IF('[1]1 ères chaleurs'!B87=\"\",\"\",'[1]1 ères chaleurs'!B87)","v":""},{"$f":"IF('[1]1 ères chaleurs'!C87=\"\",\"\",'[1]1 ères chaleurs'!C87)","v":""},null,null,null,"","",null,"","","","","","","",""]
[null,null,null,{"$f":"IF('[1]1 ères chaleurs'!A88=\"\",\"\",IF('[1]1 ères chaleurs'!A88=\"total général\",\"\",'[1]1 ères chaleurs'!A88))","v":""},{"$f":"IF('[1]1 ères chaleurs'!B88=\"\",\"\",'[1]1 ères chaleurs'!B88)","v":""},{"$f":"IF('[1]1 ères chaleurs'!C88=\"\",\"\",'[1]1 ères chaleurs'!C88)","v":""},null,null,null,"","",null,"","","","","","","",""]
[null,null,null,{"$f":"IF('[1]1 ères chaleurs'!A89=\"\",\"\",IF('[1]1 ères chaleurs'!A89=\"total général\",\"\",'[1]1 ères chaleurs'!A89))","v":""},{"$f":"IF('[1]1 ères chaleurs'!B89=\"\",\"\",'[1]1 ères chaleurs'!B89)","v":""},{"$f":"IF('[1]1 ères chaleurs'!C89=\"\",\"\",'[1]1 ères chaleurs'!C89)","v":""},null,null,null,"","",null,"","","","","","","",""]
[null,null,null,{"$f":"IF('[1]1 ères chaleurs'!A90=\"\",\"\",IF('[1]1 ères chaleurs'!A90=\"total général\",\"\",'[1]1 ères chaleurs'!A90))","v":""},{"$f":"IF('[1]1 ères chaleurs'!B90=\"\",\"\",'[1]1 ères chaleurs'!B90)","v":""},{"$f":"IF('[1]1 ères chaleurs'!C90=\"\",\"\",'[1]1 ères chaleurs'!C90)","v":""},null,null,null,"","",null,"","","","","","","",""]
[null,null,null,{"$f":"IF('[1]1 ères chaleurs'!A91=\"\",\"\",IF('[1]1 ères chaleurs'!A91=\"total général\",\"\",'[1]1 ères chaleurs'!A91))","v":""},{"$f":"IF('[1]1 ères chaleurs'!B91=\"\",\"\",'[1]1 ères chaleurs'!B91)","v":""},{"$f":"IF('[1]1 ères chaleurs'!C91=\"\",\"\",'[1]1 ères chaleurs'!C91)","v":""},null,null,null,"","",null,"","","","","","","",""]
[null,null,null,{"$f":"IF('[1]1 ères chaleurs'!A92=\"\",\"\",IF('[1]1 ères chaleurs'!A92=\"total général\",\"\",'[1]1 ères chaleurs'!A92))","v":""},{"$f":"IF('[1]1 ères chaleurs'!B92=\"\",\"\",'[1]1 ères chaleurs'!B92)","v":""},{"$f":"IF('[1]1 ères chaleurs'!C92=\"\",\"\",'[1]1 ères chaleurs'!C92)","v":""},null,null,null,"","",null,"","","","","","","",""]
[null,null,null,{"$f":"IF('[1]1 ères chaleurs'!A93=\"\",\"\",IF('[1]1 ères chaleurs'!A93=\"total général\",\"\",'[1]1 ères chaleurs'!A93))","v":""},{"$f":"IF('[1]1 ères chaleurs'!B93=\"\",\"\",'[1]1 ères chaleurs'!B93)","v":""},{"$f":"IF('[1]1 ères chaleurs'!C93=\"\",\"\",'[1]1 ères chaleurs'!C93)","v":""},null,null,null,"","",null,"","","","","","","",""]
[null,null,null,{"$f":"IF('[1]1 ères chaleurs'!A94=\"\",\"\",IF('[1]1 ères chaleurs'!A94=\"total général\",\"\",'[1]1 ères chaleurs'!A94))","v":""},{"$f":"IF('[1]1 ères chaleurs'!B94=\"\",\"\",'[1]1 ères chaleurs'!B94)","v":""},{"$f":"IF('[1]1 ères chaleurs'!C94=\"\",\"\",'[1]1 ères chaleurs'!C94)","v":""},null,null,null,"",{"$f":"IF(G91=\"\",\"\",\"XXX\")","v":""},null,"",{"$f":"IF(K91=\"\",\"\",IF(K91=1,IF(G91=\"\",\"\",\"XXX\"),\"XXX\"))","v":""},"",{"$f":"IF(N91=\"\",\"\",IF(N91=1,IF(G91=\"\",\"\",\"XXX\"),\"XXX\"))","v":""},"","","",{"$f":"IF(R91=\"\",\"\",IF(R91=1,IF(G91=\"\",\"\",\"XXX\"),\"XXX\"))","v":""}]
[null,null,null,{"$f":"IF('[1]1 ères chaleurs'!A95=\"\",\"\",IF('[1]1 ères chaleurs'!A95=\"total général\",\"\",'[1]1 ères chaleurs'!A95))","v":""},{"$f":"IF('[1]1 ères chaleurs'!B95=\"\",\"\",'[1]1 ères chaleurs'!B95)","v":""},{"$f":"IF('[1]1 ères chaleurs'!C95=\"\",\"\",'[1]1 ères chaleurs'!C95)","v":""},null,null,null,"","",null,"","","","","","","",""]
[null,null,null,{"$f":"IF('[1]1 ères chaleurs'!A96=\"\",\"\",IF('[1]1 ères chaleurs'!A96=\"total général\",\"\",'[1]1 ères chaleurs'!A96))","v":""},{"$f":"IF('[1]1 ères chaleurs'!B96=\"\",\"\",'[1]1 ères chaleurs'!B96)","v":""},{"$f":"IF('[1]1 ères chaleurs'!C96=\"\",\"\",'[1]1 ères chaleurs'!C96)","v":""},null,null,null,"","",null,"","","","","","","",""]
[null,null,null,{"$f":"IF('[1]1 ères chaleurs'!A97=\"\",\"\",IF('[1]1 ères chaleurs'!A97=\"total général\",\"\",'[1]1 ères chaleurs'!A97))","v":""},{"$f":"IF('[1]1 ères chaleurs'!B97=\"\",\"\",'[1]1 ères chaleurs'!B97)","v":""},{"$f":"IF('[1]1 ères chaleurs'!C97=\"\",\"\",'[1]1 ères chaleurs'!C97)","v":""},null,null,null,"","",null,"","","","","","","",""]
[null,null,null,{"$f":"IF('[1]1 ères chaleurs'!A98=\"\",\"\",IF('[1]1 ères chaleurs'!A98=\"total général\",\"\",'[1]1 ères chaleurs'!A98))","v":""},{"$f":"IF('[1]1 ères chaleurs'!B98=\"\",\"\",'[1]1 ères chaleurs'!B98)","v":""},{"$f":"IF('[1]1 ères chaleurs'!C98=\"\",\"\",'[1]1 ères chaleurs'!C98)","v":""},null,null,null,"","",null,"","","","","","","",""]
[null,null,null,{"$f":"IF('[1]1 ères chaleurs'!A99=\"\",\"\",IF('[1]1 ères chaleurs'!A99=\"total général\",\"\",'[1]1 ères chaleurs'!A99))","v":""},{"$f":"IF('[1]1 ères chaleurs'!B99=\"\",\"\",'[1]1 ères chaleurs'!B99)","v":""},{"$f":"IF('[1]1 ères chaleurs'!C99=\"\",\"\",'[1]1 ères chaleurs'!C99)","v":""},null,null,null,"","",null,"","","","","","","",""]
[null,null,null,{"$f":"IF('[1]1 ères chaleurs'!A100=\"\",\"\",IF('[1]1 ères chaleurs'!A100=\"total général\",\"\",'[1]1 ères chaleurs'!A100))","v":""},{"$f":"IF('[1]1 ères chaleurs'!B100=\"\",\"\",'[1]1 ères chaleurs'!B100)","v":""},{"$f":"IF('[1]1 ères chaleurs'!C100=\"\",\"\",'[1]1 ères chaleurs'!C100)","v":""},null,null,null,"","",null,"","","","","","","",""]
[null,null,null,{"$f":"IF('[1]1 ères chaleurs'!A101=\"\",\"\",IF('[1]1 ères chaleurs'!A101=\"total général\",\"\",'[1]1 ères chaleurs'!A101))","v":""},{"$f":"IF('[1]1 ères chaleurs'!B101=\"\",\"\",'[1]1 ères chaleurs'!B101)","v":""},{"$f":"IF('[1]1 ères chaleurs'!C101=\"\",\"\",'[1]1 ères chaleurs'!C101)","v":""},null,null,null,"","",null,"","","","","","","",""]
[null,null,null,{"$f":"IF('[1]1 ères chaleurs'!A102=\"\",\"\",IF('[1]1 ères chaleurs'!A102=\"total général\",\"\",'[1]1 ères chaleurs'!A102))","v":""},{"$f":"IF('[1]1 ères chaleurs'!B102=\"\",\"\",'[1]1 ères chaleurs'!B102)","v":""},{"$f":"IF('[1]1 ères chaleurs'!C102=\"\",\"\",'[1]1 ères chaleurs'!C102)","v":""},null,null,null,"","",null,"","","","","","","",""]
[null,null,null,{"$f":"IF('[1]1 ères chaleurs'!A103=\"\",\"\",IF('[1]1 ères chaleurs'!A103=\"total général\",\"\",'[1]1 ères chaleurs'!A103))","v":""},{"$f":"IF('[1]1 ères chaleurs'!B103=\"\",\"\",'[1]1 ères chaleurs'!B103)","v":""},{"$f":"IF('[1]1 ères chaleurs'!C103=\"\",\"\",'[1]1 ères chaleurs'!C103)","v":""},null,null,null,"","",null,"","","","","","","",""]
[null,null,null,{"$f":"IF('[1]1 ères chaleurs'!A104=\"\",\"\",IF('[1]1 ères chaleurs'!A104=\"total général\",\"\",'[1]1 ères chaleurs'!A104))","v":""},{"$f":"IF('[1]1 ères chaleurs'!B104=\"\",\"\",'[1]1 ères chaleurs'!B104)","v":""},{"$f":"IF('[1]1 ères chaleurs'!C104=\"\",\"\",'[1]1 ères chaleurs'!C104)","v":""},null,null,null,"","",null,"","","","","","","",""]
[null,null,null,{"$f":"IF('[1]1 ères chaleurs'!A105=\"\",\"\",IF('[1]1 ères chaleurs'!A105=\"total général\",\"\",'[1]1 ères chaleurs'!A105))","v":""},{"$f":"IF('[1]1 ères chaleurs'!B105=\"\",\"\",'[1]1 ères chaleurs'!B105)","v":""},{"$f":"IF('[1]1 ères chaleurs'!C105=\"\",\"\",'[1]1 ères chaleurs'!C105)","v":""},null,null,null,"","",null,"","","","","","","",""]
[null,null,null,{"$f":"IF('[1]1 ères chaleurs'!A106=\"\",\"\",IF('[1]1 ères chaleurs'!A106=\"total général\",\"\",'[1]1 ères chaleurs'!A106))","v":""},{"$f":"IF('[1]1 ères chaleurs'!B106=\"\",\"\",'[1]1 ères chaleurs'!B106)","v":""},{"$f":"IF('[1]1 ères chaleurs'!C106=\"\",\"\",'[1]1 ères chaleurs'!C106)","v":""},null,null,null,"","",null,"","","","","","","",""]
[null,null,null,{"$f":"IF('[1]1 ères chaleurs'!A107=\"\",\"\",IF('[1]1 ères chaleurs'!A107=\"total général\",\"\",'[1]1 ères chaleurs'!A107))","v":""},{"$f":"IF('[1]1 ères chaleurs'!B107=\"\",\"\",'[1]1 ères chaleurs'!B107)","v":""},{"$f":"IF('[1]1 ères chaleurs'!C107=\"\",\"\",'[1]1 ères chaleurs'!C107)","v":""},null,null,null,"","",null,"","","","","","","",""]
[null,null,null,{"$f":"IF('[1]1 ères chaleurs'!A108=\"\",\"\",IF('[1]1 ères chaleurs'!A108=\"total général\",\"\",'[1]1 ères chaleurs'!A108))","v":""},{"$f":"IF('[1]1 ères chaleurs'!B108=\"\",\"\",'[1]1 ères chaleurs'!B108)","v":""},{"$f":"IF('[1]1 ères chaleurs'!C108=\"\",\"\",'[1]1 ères chaleurs'!C108)","v":""},null,null,null,"","",null,"","","","","","","",""]
[null,null,null,{"$f":"IF('[1]1 ères chaleurs'!A109=\"\",\"\",IF('[1]1 ères chaleurs'!A109=\"total général\",\"\",'[1]1 ères chaleurs'!A109))","v":""},{"$f":"IF('[1]1 ères chaleurs'!B109=\"\",\"\",'[1]1 ères chaleurs'!B109)","v":""},{"$f":"IF('[1]1 ères chaleurs'!C109=\"\",\"\",'[1]1 ères chaleurs'!C109)","v":""},null,null,null,"","",null,"","","","","","","",""]
[null,null,null,{"$f":"IF('[1]1 ères chaleurs'!A110=\"\",\"\",IF('[1]1 ères chaleurs'!A110=\"total général\",\"\",'[1]1 ères chaleurs'!A110))","v":""},{"$f":"IF('[1]1 ères chaleurs'!B110=\"\",\"\",'[1]1 ères chaleurs'!B110)","v":""},{"$f":"IF('[1]1 ères chaleurs'!C110=\"\",\"\",'[1]1 ères chaleurs'!C110)","v":""},null,null,null,"","",null,"","","","","","","",""]
[null,null,null,{"$f":"IF('[1]1 ères chaleurs'!A111=\"\",\"\",IF('[1]1 ères chaleurs'!A111=\"total général\",\"\",'[1]1 ères chaleurs'!A111))","v":""},{"$f":"IF('[1]1 ères chaleurs'!B111=\"\",\"\",'[1]1 ères chaleurs'!B111)","v":""},{"$f":"IF('[1]1 ères chaleurs'!C111=\"\",\"\",'[1]1 ères chaleurs'!C111)","v":""},null,null,null,"","",null,"","","","","","","",""]
[null,null,null,{"$f":"IF('[1]1 ères chaleurs'!A112=\"\",\"\",IF('[1]1 ères chaleurs'!A112=\"total général\",\"\",'[1]1 ères chaleurs'!A112))","v":""},{"$f":"IF('[1]1 ères chaleurs'!B112=\"\",\"\",'[1]1 ères chaleurs'!B112)","v":""},{"$f":"IF('[1]1 ères chaleurs'!C112=\"\",\"\",'[1]1 ères chaleurs'!C112)","v":""},null,null,null,"","",null,"","","","","","","",""]
[null,null,null,{"$f":"IF('[1]1 ères chaleurs'!A113=\"\",\"\",IF('[1]1 ères chaleurs'!A113=\"total général\",\"\",'[1]1 ères chaleurs'!A113))","v":""},{"$f":"IF('[1]1 ères chaleurs'!B113=\"\",\"\",'[1]1 ères chaleurs'!B113)","v":""},{"$f":"IF('[1]1 ères chaleurs'!C113=\"\",\"\",'[1]1 ères chaleurs'!C113)","v":""},null,null,null,"","",null,"","","","","","","",""]
[null,null,null,{"$f":"IF('[1]1 ères chaleurs'!A114=\"\",\"\",IF('[1]1 ères chaleurs'!A114=\"total général\",\"\",'[1]1 ères chaleurs'!A114))","v":""},{"$f":"IF('[1]1 ères chaleurs'!B114=\"\",\"\",'[1]1 ères chaleurs'!B114)","v":""},{"$f":"IF('[1]1 ères chaleurs'!C114=\"\",\"\",'[1]1 ères chaleurs'!C114)","v":""},null,null,null,"","",null,"","","","","","","",""]
[null,null,null,{"$f":"IF('[1]1 ères chaleurs'!A115=\"\",\"\",IF('[1]1 ères chaleurs'!A115=\"total général\",\"\",'[1]1 ères chaleurs'!A115))","v":""},{"$f":"IF('[1]1 ères chaleurs'!B115=\"\",\"\",'[1]1 ères chaleurs'!B115)","v":""},{"$f":"IF('[1]1 ères chaleurs'!C115=\"\",\"\",'[1]1 ères chaleurs'!C115)","v":""},null,null,null,"","",null,"","","","","","","",""]
[null,null,null,{"$f":"IF('[1]1 ères chaleurs'!A116=\"\",\"\",IF('[1]1 ères chaleurs'!A116=\"total général\",\"\",'[1]1 ères chaleurs'!A116))","v":""},{"$f":"IF('[1]1 ères chaleurs'!B116=\"\",\"\",'[1]1 ères chaleurs'!B116)","v":""},{"$f":"IF('[1]1 ères chaleurs'!C116=\"\",\"\",'[1]1 ères chaleurs'!C116)","v":""},null,null,null,"","",null,"","","","","","","",""]
[null,null,null,{"$f":"IF('[1]1 ères chaleurs'!A117=\"\",\"\",IF('[1]1 ères chaleurs'!A117=\"total général\",\"\",'[1]1 ères chaleurs'!A117))","v":""},{"$f":"IF('[1]1 ères chaleurs'!B117=\"\",\"\",'[1]1 ères chaleurs'!B117)","v":""},{"$f":"IF('[1]1 ères chaleurs'!C117=\"\",\"\",'[1]1 ères chaleurs'!C117)","v":""},null,null,null,"","",null,"","","","","","","",""]
[null,null,null,{"$f":"IF('[1]1 ères chaleurs'!A118=\"\",\"\",IF('[1]1 ères chaleurs'!A118=\"total général\",\"\",'[1]1 ères chaleurs'!A118))","v":""},{"$f":"IF('[1]1 ères chaleurs'!B118=\"\",\"\",'[1]1 ères chaleurs'!B118)","v":""},{"$f":"IF('[1]1 ères chaleurs'!C118=\"\",\"\",'[1]1 ères chaleurs'!C118)","v":""},null,null,null,"","",null,"","","","","","","",""]
[null,null,null,{"$f":"IF('[1]1 ères chaleurs'!A119=\"\",\"\",IF('[1]1 ères chaleurs'!A119=\"total général\",\"\",'[1]1 ères chaleurs'!A119))","v":""},{"$f":"IF('[1]1 ères chaleurs'!B119=\"\",\"\",'[1]1 ères chaleurs'!B119)","v":""},{"$f":"IF('[1]1 ères chaleurs'!C119=\"\",\"\",'[1]1 ères chaleurs'!C119)","v":""},null,null,null,"","",null,"","","","","","","",""]
[null,null,null,{"$f":"IF('[1]1 ères chaleurs'!A120=\"\",\"\",IF('[1]1 ères chaleurs'!A120=\"total général\",\"\",'[1]1 ères chaleurs'!A120))","v":""},{"$f":"IF('[1]1 ères chaleurs'!B120=\"\",\"\",'[1]1 ères chaleurs'!B120)","v":""},{"$f":"IF('[1]1 ères chaleurs'!C120=\"\",\"\",'[1]1 ères chaleurs'!C120)","v":""},null,null,null,"","",null,"","","","","","","",""]
[null,null,null,{"$f":"IF('[1]1 ères chaleurs'!A121=\"\",\"\",IF('[1]1 ères chaleurs'!A121=\"total général\",\"\",'[1]1 ères chaleurs'!A121))","v":""},{"$f":"IF('[1]1 ères chaleurs'!B121=\"\",\"\",'[1]1 ères chaleurs'!B121)","v":""},{"$f":"IF('[1]1 ères chaleurs'!C121=\"\",\"\",'[1]1 ères chaleurs'!C121)","v":""},null,null,null,"","",null,"","","","","","","",""]
[null,null,null,{"$f":"IF('[1]1 ères chaleurs'!A122=\"\",\"\",IF('[1]1 ères chaleurs'!A122=\"total général\",\"\",'[1]1 ères chaleurs'!A122))","v":""},{"$f":"IF('[1]1 ères chaleurs'!B122=\"\",\"\",'[1]1 ères chaleurs'!B122)","v":""},{"$f":"IF('[1]1 ères chaleurs'!C122=\"\",\"\",'[1]1 ères chaleurs'!C122)","v":""},null,null,null,"","",null,"","","","","","","",""]
[null,null,null,{"$f":"IF('[1]1 ères chaleurs'!A123=\"\",\"\",IF('[1]1 ères chaleurs'!A123=\"total général\",\"\",'[1]1 ères chaleurs'!A123))","v":""},{"$f":"IF('[1]1 ères chaleurs'!B123=\"\",\"\",'[1]1 ères chaleurs'!B123)","v":""},{"$f":"IF('[1]1 ères chaleurs'!C123=\"\",\"\",'[1]1 ères chaleurs'!C123)","v":""},null,null,null,"","",null,"","","","","","","",""]
[null,null,null,{"$f":"IF('[1]1 ères chaleurs'!A124=\"\",\"\",IF('[1]1 ères chaleurs'!A124=\"total général\",\"\",'[1]1 ères chaleurs'!A124))","v":""},{"$f":"IF('[1]1 ères chaleurs'!B124=\"\",\"\",'[1]1 ères chaleurs'!B124)","v":""},{"$f":"IF('[1]1 ères chaleurs'!C124=\"\",\"\",'[1]1 ères chaleurs'!C124)","v":""},null,null,null,"","",null,"","","","","","","",""]
[null,null,null,{"$f":"IF('[1]1 ères chaleurs'!A125=\"\",\"\",IF('[1]1 ères chaleurs'!A125=\"total général\",\"\",'[1]1 ères chaleurs'!A125))","v":""},{"$f":"IF('[1]1 ères chaleurs'!B125=\"\",\"\",'[1]1 ères chaleurs'!B125)","v":""},{"$f":"IF('[1]1 ères chaleurs'!C125=\"\",\"\",'[1]1 ères chaleurs'!C125)","v":""},null,null,null,"","",null,"","","","","","","",""]
[null,null,null,{"$f":"IF('[1]1 ères chaleurs'!A126=\"\",\"\",IF('[1]1 ères chaleurs'!A126=\"total général\",\"\",'[1]1 ères chaleurs'!A126))","v":""},{"$f":"IF('[1]1 ères chaleurs'!B126=\"\",\"\",'[1]1 ères chaleurs'!B126)","v":""},{"$f":"IF('[1]1 ères chaleurs'!C126=\"\",\"\",'[1]1 ères chaleurs'!C126)","v":""},null,null,null,"","",null,"","","","","","","",""]
[null,null,null,{"$f":"IF('[1]1 ères chaleurs'!A127=\"\",\"\",IF('[1]1 ères chaleurs'!A127=\"total général\",\"\",'[1]1 ères chaleurs'!A127))","v":""},{"$f":"IF('[1]1 ères chaleurs'!B127=\"\",\"\",'[1]1 ères chaleurs'!B127)","v":""},{"$f":"IF('[1]1 ères chaleurs'!C127=\"\",\"\",'[1]1 ères chaleurs'!C127)","v":""},null,null,null,"","",null,"","","","","","","",""]
[null,null,null,{"$f":"IF('[1]1 ères chaleurs'!A128=\"\",\"\",IF('[1]1 ères chaleurs'!A128=\"total général\",\"\",'[1]1 ères chaleurs'!A128))","v":""},{"$f":"IF('[1]1 ères chaleurs'!B128=\"\",\"\",'[1]1 ères chaleurs'!B128)","v":""},{"$f":"IF('[1]1 ères chaleurs'!C128=\"\",\"\",'[1]1 ères chaleurs'!C128)","v":""},null,null,null,"","",null,"","","","","","","",""]
[null,null,null,{"$f":"IF('[1]1 ères chaleurs'!A129=\"\",\"\",IF('[1]1 ères chaleurs'!A129=\"total général\",\"\",'[1]1 ères chaleurs'!A129))","v":""},{"$f":"IF('[1]1 ères chaleurs'!B129=\"\",\"\",'[1]1 ères chaleurs'!B129)","v":""},{"$f":"IF('[1]1 ères chaleurs'!C129=\"\",\"\",'[1]1 ères chaleurs'!C129)","v":""},null,null,null,"","",null,"","","","","","","",""]
[null,null,null,{"$f":"IF('[1]1 ères chaleurs'!A130=\"\",\"\",IF('[1]1 ères chaleurs'!A130=\"total général\",\"\",'[1]1 ères chaleurs'!A130))","v":""},{"$f":"IF('[1]1 ères chaleurs'!B130=\"\",\"\",'[1]1 ères chaleurs'!B130)","v":""},{"$f":"IF('[1]1 ères chaleurs'!C130=\"\",\"\",'[1]1 ères chaleurs'!C130)","v":""},null,null,null,"","",null,"","","","","","","",""]
[null,null,null,{"$f":"IF('[1]1 ères chaleurs'!A131=\"\",\"\",IF('[1]1 ères chaleurs'!A131=\"total général\",\"\",'[1]1 ères chaleurs'!A131))","v":""},{"$f":"IF('[1]1 ères chaleurs'!B131=\"\",\"\",'[1]1 ères chaleurs'!B131)","v":""},{"$f":"IF('[1]1 ères chaleurs'!C131=\"\",\"\",'[1]1 ères chaleurs'!C131)","v":""},null,null,null,"","",null,"","","","","","","",""]
[null,null,null,{"$f":"IF('[1]1 ères chaleurs'!A132=\"\",\"\",IF('[1]1 ères chaleurs'!A132=\"total général\",\"\",'[1]1 ères chaleurs'!A132))","v":""},{"$f":"IF('[1]1 ères chaleurs'!B132=\"\",\"\",'[1]1 ères chaleurs'!B132)","v":""},{"$f":"IF('[1]1 ères chaleurs'!C132=\"\",\"\",'[1]1 ères chaleurs'!C132)","v":""},null,null,null,"","",null,"","","","","","","",""]
[null,null,null,{"$f":"IF('[1]1 ères chaleurs'!A133=\"\",\"\",IF('[1]1 ères chaleurs'!A133=\"total général\",\"\",'[1]1 ères chaleurs'!A133))","v":""},{"$f":"IF('[1]1 ères chaleurs'!B133=\"\",\"\",'[1]1 ères chaleurs'!B133)","v":""},{"$f":"IF('[1]1 ères chaleurs'!C133=\"\",\"\",'[1]1 ères chaleurs'!C133)","v":""},null,null,null,"","",null,"","","","","","","",""]
[null,null,null,{"$f":"IF('[1]1 ères chaleurs'!A134=\"\",\"\",IF('[1]1 ères chaleurs'!A134=\"total général\",\"\",'[1]1 ères chaleurs'!A134))","v":""},{"$f":"IF('[1]1 ères chaleurs'!B134=\"\",\"\",'[1]1 ères chaleurs'!B134)","v":""},{"$f":"IF('[1]1 ères chaleurs'!C134=\"\",\"\",'[1]1 ères chaleurs'!C134)","v":""},null,null,null,"","",null,"","","","","","","",""]
[null,null,null,{"$f":"IF('[1]1 ères chaleurs'!A135=\"\",\"\",IF('[1]1 ères chaleurs'!A135=\"total général\",\"\",'[1]1 ères chaleurs'!A135))","v":""},{"$f":"IF('[1]1 ères chaleurs'!B135=\"\",\"\",'[1]1 ères chaleurs'!B135)","v":""},{"$f":"IF('[1]1 ères chaleurs'!C135=\"\",\"\",'[1]1 ères chaleurs'!C135)","v":""},null,null,null,"","",null,"","","","","","","",""]
[null,null,null,{"$f":"IF('[1]1 ères chaleurs'!A136=\"\",\"\",IF('[1]1 ères chaleurs'!A136=\"total général\",\"\",'[1]1 ères chaleurs'!A136))","v":""},{"$f":"IF('[1]1 ères chaleurs'!B136=\"\",\"\",'[1]1 ères chaleurs'!B136)","v":""},{"$f":"IF('[1]1 ères chaleurs'!C136=\"\",\"\",'[1]1 ères chaleurs'!C136)","v":""},null,null,null,"","",null,"","","","","","","",""]
[null,null,null,{"$f":"IF('[1]1 ères chaleurs'!A137=\"\",\"\",IF('[1]1 ères chaleurs'!A137=\"total général\",\"\",'[1]1 ères chaleurs'!A137))","v":""},{"$f":"IF('[1]1 ères chaleurs'!B137=\"\",\"\",'[1]1 ères chaleurs'!B137)","v":""},{"$f":"IF('[1]1 ères chaleurs'!C137=\"\",\"\",'[1]1 ères chaleurs'!C137)","v":""},null,null,null,"","",null,"","","","","","","",""]
[null,null,null,{"$f":"IF('[1]1 ères chaleurs'!A138=\"\",\"\",IF('[1]1 ères chaleurs'!A138=\"total général\",\"\",'[1]1 ères chaleurs'!A138))","v":""},{"$f":"IF('[1]1 ères chaleurs'!B138=\"\",\"\",'[1]1 ères chaleurs'!B138)","v":""},{"$f":"IF('[1]1 ères chaleurs'!C138=\"\",\"\",'[1]1 ères chaleurs'!C138)","v":""},null,null,null,"","",null,"","","","","","","",""]
[null,null,null,{"$f":"IF('[1]1 ères chaleurs'!A139=\"\",\"\",IF('[1]1 ères chaleurs'!A139=\"total général\",\"\",'[1]1 ères chaleurs'!A139))","v":""},{"$f":"IF('[1]1 ères chaleurs'!B139=\"\",\"\",'[1]1 ères chaleurs'!B139)","v":""},{"$f":"IF('[1]1 ères chaleurs'!C139=\"\",\"\",'[1]1 ères chaleurs'!C139)","v":""},null,null,null,"","",null,"","",{"$f":"IF(N136=\"\",\"\",IF(N136=1,IF(G136=\"\",\"\",\"XXX\"),\"XXX\"))","v":""},"",{"$f":"IF(P136=\"\",\"\",IF(P136=1,IF(G136=\"\",\"\",\"XXX\"),\"XXX\"))","v":""},{"$f":"IF(P136=\"\",\"\",IF(P136=1,IF(G136=\"\",\"\",\"XXX\"),\"XXX\"))","v":""},{"$f":"IF(R136=\"\",\"\",IF(R136=1,IF(G136=\"\",\"\",\"XXX\"),\"XXX\"))","v":""},""]
[null,null,null,{"$f":"IF('[1]1 ères chaleurs'!A140=\"\",\"\",IF('[1]1 ères chaleurs'!A140=\"total général\",\"\",'[1]1 ères chaleurs'!A140))","v":""},{"$f":"IF('[1]1 ères chaleurs'!B140=\"\",\"\",'[1]1 ères chaleurs'!B140)","v":""},{"$f":"IF('[1]1 ères chaleurs'!C140=\"\",\"\",'[1]1 ères chaleurs'!C140)","v":""},null,null,null,{"$f":"IF(G137=\"\",\"\",\"XXX\")","v":""},"",null,{"$f":"IF(K137=\"\",\"\",IF(K137=1,IF(G137=\"\",\"\",\"XXX\"),\"XXX\"))","v":""},"","","","","","",""]
[null,null,null,{"$f":"IF('[1]1 ères chaleurs'!A141=\"\",\"\",IF('[1]1 ères chaleurs'!A141=\"total général\",\"\",'[1]1 ères chaleurs'!A141))","v":""},{"$f":"IF('[1]1 ères chaleurs'!B141=\"\",\"\",'[1]1 ères chaleurs'!B141)","v":""},{"$f":"IF('[1]1 ères chaleurs'!C141=\"\",\"\",'[1]1 ères chaleurs'!C141)","v":""},null,null,null,"","",null,"","","","","","","",""]
[null,null,null,{"$f":"IF('[1]1 ères chaleurs'!A142=\"\",\"\",IF('[1]1 ères chaleurs'!A142=\"total général\",\"\",'[1]1 ères chaleurs'!A142))","v":""},{"$f":"IF('[1]1 ères chaleurs'!B142=\"\",\"\",'[1]1 ères chaleurs'!B142)","v":""},{"$f":"IF('[1]1 ères chaleurs'!C142=\"\",\"\",'[1]1 ères chaleurs'!C142)","v":""},null,null,null,"","",null,"","","","","","","",""]
[null,null,null,{"$f":"IF('[1]1 ères chaleurs'!A143=\"\",\"\",IF('[1]1 ères chaleurs'!A143=\"total général\",\"\",'[1]1 ères chaleurs'!A143))","v":""},{"$f":"IF('[1]1 ères chaleurs'!B143=\"\",\"\",'[1]1 ères chaleurs'!B143)","v":""},{"$f":"IF('[1]1 ères chaleurs'!C143=\"\",\"\",'[1]1 ères chaleurs'!C143)","v":""},null,null,null,"","",null,"","","","","","","",""]
[null,null,null,{"$f":"IF('[1]1 ères chaleurs'!A144=\"\",\"\",IF('[1]1 ères chaleurs'!A144=\"total général\",\"\",'[1]1 ères chaleurs'!A144))","v":""},{"$f":"IF('[1]1 ères chaleurs'!B144=\"\",\"\",'[1]1 ères chaleurs'!B144)","v":""},{"$f":"IF('[1]1 ères chaleurs'!C144=\"\",\"\",'[1]1 ères chaleurs'!C144)","v":""},null,null,null,"","",null,"","","","","","","",""]
[null,null,null,{"$f":"IF('[1]1 ères chaleurs'!A145=\"\",\"\",IF('[1]1 ères chaleurs'!A145=\"total général\",\"\",'[1]1 ères chaleurs'!A145))","v":""},{"$f":"IF('[1]1 ères chaleurs'!B145=\"\",\"\",'[1]1 ères chaleurs'!B145)","v":""},{"$f":"IF('[1]1 ères chaleurs'!C145=\"\",\"\",'[1]1 ères chaleurs'!C145)","v":""},null,null,null,"","",null,"","","","","","","",""]
[null,null,null,{"$f":"IF('[1]1 ères chaleurs'!A146=\"\",\"\",IF('[1]1 ères chaleurs'!A146=\"total général\",\"\",'[1]1 ères chaleurs'!A146))","v":""},{"$f":"IF('[1]1 ères chaleurs'!B146=\"\",\"\",'[1]1 ères chaleurs'!B146)","v":""},{"$f":"IF('[1]1 ères chaleurs'!C146=\"\",\"\",'[1]1 ères chaleurs'!C146)","v":""},null,null,null,"","",null,"","","","","","","",""]
[null,null,null,{"$f":"IF('[1]1 ères chaleurs'!A147=\"\",\"\",IF('[1]1 ères chaleurs'!A147=\"total général\",\"\",'[1]1 ères chaleurs'!A147))","v":""},{"$f":"IF('[1]1 ères chaleurs'!B147=\"\",\"\",'[1]1 ères chaleurs'!B147)","v":""},{"$f":"IF('[1]1 ères chaleurs'!C147=\"\",\"\",'[1]1 ères chaleurs'!C147)","v":""},null,null,null,"","",null,"","","","","","","",""]
[null,null,null,{"$f":"IF('[1]1 ères chaleurs'!A148=\"\",\"\",IF('[1]1 ères chaleurs'!A148=\"total général\",\"\",'[1]1 ères chaleurs'!A148))","v":""},{"$f":"IF('[1]1 ères chaleurs'!B148=\"\",\"\",'[1]1 ères chaleurs'!B148)","v":""},{"$f":"IF('[1]1 ères chaleurs'!C148=\"\",\"\",'[1]1 ères chaleurs'!C148)","v":""},null,null,null,"","",null,"","","","","","","",""]
[null,null,null,{"$f":"IF('[1]1 ères chaleurs'!A149=\"\",\"\",IF('[1]1 ères chaleurs'!A149=\"total général\",\"\",'[1]1 ères chaleurs'!A149))","v":""},{"$f":"IF('[1]1 ères chaleurs'!B149=\"\",\"\",'[1]1 ères chaleurs'!B149)","v":""},{"$f":"IF('[1]1 ères chaleurs'!C149=\"\",\"\",'[1]1 ères chaleurs'!C149)","v":""},null,null,null,"","",null,"","","","","","","",""]
[null,null,null,{"$f":"IF('[1]1 ères chaleurs'!A150=\"\",\"\",IF('[1]1 ères chaleurs'!A150=\"total général\",\"\",'[1]1 ères chaleurs'!A150))","v":""},{"$f":"IF('[1]1 ères chaleurs'!B150=\"\",\"\",'[1]1 ères chaleurs'!B150)","v":""},{"$f":"IF('[1]1 ères chaleurs'!C150=\"\",\"\",'[1]1 ères chaleurs'!C150)","v":""},null,null,null,"","",null,"","","","","","","",""]
[null,null,null,{"$f":"IF('[1]1 ères chaleurs'!A151=\"\",\"\",IF('[1]1 ères chaleurs'!A151=\"total général\",\"\",'[1]1 ères chaleurs'!A151))","v":""},{"$f":"IF('[1]1 ères chaleurs'!B151=\"\",\"\",'[1]1 ères chaleurs'!B151)","v":""},{"$f":"IF('[1]1 ères chaleurs'!C151=\"\",\"\",'[1]1 ères chaleurs'!C151)","v":""},null,null,null,"","",null,"","","","","","","",""]
[null,null,null,{"$f":"IF('[1]1 ères chaleurs'!A152=\"\",\"\",IF('[1]1 ères chaleurs'!A152=\"total général\",\"\",'[1]1 ères chaleurs'!A152))","v":""},{"$f":"IF('[1]1 ères chaleurs'!B152=\"\",\"\",'[1]1 ères chaleurs'!B152)","v":""},{"$f":"IF('[1]1 ères chaleurs'!C152=\"\",\"\",'[1]1 ères chaleurs'!C152)","v":""},null,null,null,"","",null,"","","","","","","",""]
[null,null,null,{"$f":"IF('[1]1 ères chaleurs'!A153=\"\",\"\",IF('[1]1 ères chaleurs'!A153=\"total général\",\"\",'[1]1 ères chaleurs'!A153))","v":""},{"$f":"IF('[1]1 ères chaleurs'!B153=\"\",\"\",'[1]1 ères chaleurs'!B153)","v":""},{"$f":"IF('[1]1 ères chaleurs'!C153=\"\",\"\",'[1]1 ères chaleurs'!C153)","v":""},null,null,null,"","",null,"","","","","","","",""]
[null,null,null,{"$f":"IF('[1]1 ères chaleurs'!A154=\"\",\"\",IF('[1]1 ères chaleurs'!A154=\"total général\",\"\",'[1]1 ères chaleurs'!A154))","v":""},{"$f":"IF('[1]1 ères chaleurs'!B154=\"\",\"\",'[1]1 ères chaleurs'!B154)","v":""},{"$f":"IF('[1]1 ères chaleurs'!C154=\"\",\"\",'[1]1 ères chaleurs'!C154)","v":""},null,null,null,"","",null,"","","","","","","",""]
[null,null,null,{"$f":"IF('[1]1 ères chaleurs'!A155=\"\",\"\",IF('[1]1 ères chaleurs'!A155=\"total général\",\"\",'[1]1 ères chaleurs'!A155))","v":""},{"$f":"IF('[1]1 ères chaleurs'!B155=\"\",\"\",'[1]1 ères chaleurs'!B155)","v":""},{"$f":"IF('[1]1 ères chaleurs'!C155=\"\",\"\",'[1]1 ères chaleurs'!C155)","v":""},null,null,null,"","",null,"","","","","","","",""]
[null,null,null,{"$f":"IF('[1]1 ères chaleurs'!A156=\"\",\"\",IF('[1]1 ères chaleurs'!A156=\"total général\",\"\",'[1]1 ères chaleurs'!A156))","v":""},{"$f":"IF('[1]1 ères chaleurs'!B156=\"\",\"\",'[1]1 ères chaleurs'!B156)","v":""},{"$f":"IF('[1]1 ères chaleurs'!C156=\"\",\"\",'[1]1 ères chaleurs'!C156)","v":""},null,null,null,"","",null,"","","","","","","",""]
[null,null,null,{"$f":"IF('[1]1 ères chaleurs'!A157=\"\",\"\",IF('[1]1 ères chaleurs'!A157=\"total général\",\"\",'[1]1 ères chaleurs'!A157))","v":""},{"$f":"IF('[1]1 ères chaleurs'!B157=\"\",\"\",'[1]1 ères chaleurs'!B157)","v":""},{"$f":"IF('[1]1 ères chaleurs'!C157=\"\",\"\",'[1]1 ères chaleurs'!C157)","v":""},null,null,null,"","",null,"","","","","","","",""]
[null,null,null,{"$f":"IF('[1]1 ères chaleurs'!A158=\"\",\"\",IF('[1]1 ères chaleurs'!A158=\"total général\",\"\",'[1]1 ères chaleurs'!A158))","v":""},{"$f":"IF('[1]1 ères chaleurs'!B158=\"\",\"\",'[1]1 ères chaleurs'!B158)","v":""},{"$f":"IF('[1]1 ères chaleurs'!C158=\"\",\"\",'[1]1 ères chaleurs'!C158)","v":""},null,null,null,"",{"$f":"IF(G155=\"\",\"\",\"XXX\")","v":""},null,"",{"$f":"IF(K155=\"\",\"\",IF(K155=1,IF(G155=\"\",\"\",\"XXX\"),\"XXX\"))","v":""},"",{"$f":"IF(N155=\"\",\"\",IF(N155=1,IF(G155=\"\",\"\",\"XXX\"),\"XXX\"))","v":""},"","","",{"$f":"IF(R155=\"\",\"\",IF(R155=1,IF(G155=\"\",\"\",\"XXX\"),\"XXX\"))","v":""}]
[null,null,null,{"$f":"IF('[1]1 ères chaleurs'!A159=\"\",\"\",IF('[1]1 ères chaleurs'!A159=\"total général\",\"\",'[1]1 ères chaleurs'!A159))","v":""},{"$f":"IF('[1]1 ères chaleurs'!B159=\"\",\"\",'[1]1 ères chaleurs'!B159)","v":""},{"$f":"IF('[1]1 ères chaleurs'!C159=\"\",\"\",'[1]1 ères chaleurs'!C159)","v":""},null,null,null,"","",null,"","","","","","","",""]
[null,null,null,{"$f":"IF('[1]1 ères chaleurs'!A160=\"\",\"\",IF('[1]1 ères chaleurs'!A160=\"total général\",\"\",'[1]1 ères chaleurs'!A160))","v":""},{"$f":"IF('[1]1 ères chaleurs'!B160=\"\",\"\",'[1]1 ères chaleurs'!B160)","v":""},{"$f":"IF('[1]1 ères chaleurs'!C160=\"\",\"\",'[1]1 ères chaleurs'!C160)","v":""},null,null,null,"","",null,"","","","","","","",""]
[null,null,null,{"$f":"IF('[1]1 ères chaleurs'!A161=\"\",\"\",IF('[1]1 ères chaleurs'!A161=\"total général\",\"\",'[1]1 ères chaleurs'!A161))","v":""},{"$f":"IF('[1]1 ères chaleurs'!B161=\"\",\"\",'[1]1 ères chaleurs'!B161)","v":""},{"$f":"IF('[1]1 ères chaleurs'!C161=\"\",\"\",'[1]1 ères chaleurs'!C161)","v":""},null,null,null,"","",null,"","","","","","","",""]
[null,null,null,{"$f":"IF('[1]1 ères chaleurs'!A162=\"\",\"\",IF('[1]1 ères chaleurs'!A162=\"total général\",\"\",'[1]1 ères chaleurs'!A162))","v":""},{"$f":"IF('[1]1 ères chaleurs'!B162=\"\",\"\",'[1]1 ères chaleurs'!B162)","v":""},{"$f":"IF('[1]1 ères chaleurs'!C162=\"\",\"\",'[1]1 ères chaleurs'!C162)","v":""},null,null,null,"","",null,"","","","","","","",""]
[null,null,null,{"$f":"IF('[1]1 ères chaleurs'!A163=\"\",\"\",IF('[1]1 ères chaleurs'!A163=\"total général\",\"\",'[1]1 ères chaleurs'!A163))","v":""},{"$f":"IF('[1]1 ères chaleurs'!B163=\"\",\"\",'[1]1 ères chaleurs'!B163)","v":""},{"$f":"IF('[1]1 ères chaleurs'!C163=\"\",\"\",'[1]1 ères chaleurs'!C163)","v":""},null,null,null,"","",null,"","","","","","","",""]
[null,null,null,{"$f":"IF('[1]1 ères chaleurs'!A164=\"\",\"\",IF('[1]1 ères chaleurs'!A164=\"total général\",\"\",'[1]1 ères chaleurs'!A164))","v":""},{"$f":"IF('[1]1 ères chaleurs'!B164=\"\",\"\",'[1]1 ères chaleurs'!B164)","v":""},{"$f":"IF('[1]1 ères chaleurs'!C164=\"\",\"\",'[1]1 ères chaleurs'!C164)","v":""},null,null,null,"","",null,"","","","","","","",""]
[null,null,null,{"$f":"IF('[1]1 ères chaleurs'!A165=\"\",\"\",IF('[1]1 ères chaleurs'!A165=\"total général\",\"\",'[1]1 ères chaleurs'!A165))","v":""},{"$f":"IF('[1]1 ères chaleurs'!B165=\"\",\"\",'[1]1 ères chaleurs'!B165)","v":""},{"$f":"IF('[1]1 ères chaleurs'!C165=\"\",\"\",'[1]1 ères chaleurs'!C165)","v":""},null,null,null,"","",null,"","","","","","","",""]
[null,null,null,{"$f":"IF('[1]1 ères chaleurs'!A166=\"\",\"\",IF('[1]1 ères chaleurs'!A166=\"total général\",\"\",'[1]1 ères chaleurs'!A166))","v":""},{"$f":"IF('[1]1 ères chaleurs'!B166=\"\",\"\",'[1]1 ères chaleurs'!B166)","v":""},{"$f":"IF('[1]1 ères chaleurs'!C166=\"\",\"\",'[1]1 ères chaleurs'!C166)","v":""},null,null,null,"","",null,"","","","","","","",""]
[null,null,null,{"$f":"IF('[1]1 ères chaleurs'!A167=\"\",\"\",IF('[1]1 ères chaleurs'!A167=\"total général\",\"\",'[1]1 ères chaleurs'!A167))","v":""},{"$f":"IF('[1]1 ères chaleurs'!B167=\"\",\"\",'[1]1 ères chaleurs'!B167)","v":""},{"$f":"IF('[1]1 ères chaleurs'!C167=\"\",\"\",'[1]1 ères chaleurs'!C167)","v":""},null,null,null,"","",null,"","","","","","","",""]
[null,null,null,{"$f":"IF('[1]1 ères chaleurs'!A168=\"\",\"\",IF('[1]1 ères chaleurs'!A168=\"total général\",\"\",'[1]1 ères chaleurs'!A168))","v":""},{"$f":"IF('[1]1 ères chaleurs'!B168=\"\",\"\",'[1]1 ères chaleurs'!B168)","v":""},{"$f":"IF('[1]1 ères chaleurs'!C168=\"\",\"\",'[1]1 ères chaleurs'!C168)","v":""},null,null,null,"","",null,"","","","","","","",""]
[null,null,null,{"$f":"IF('[1]1 ères chaleurs'!A169=\"\",\"\",IF('[1]1 ères chaleurs'!A169=\"total général\",\"\",'[1]1 ères chaleurs'!A169))","v":""},{"$f":"IF('[1]1 ères chaleurs'!B169=\"\",\"\",'[1]1 ères chaleurs'!B169)","v":""},{"$f":"IF('[1]1 ères chaleurs'!C169=\"\",\"\",'[1]1 ères chaleurs'!C169)","v":""},null,null,null,"","",null,"","","","","","","",""]
[null,null,null,{"$f":"IF('[1]1 ères chaleurs'!A170=\"\",\"\",IF('[1]1 ères chaleurs'!A170=\"total général\",\"\",'[1]1 ères chaleurs'!A170))","v":""},{"$f":"IF('[1]1 ères chaleurs'!B170=\"\",\"\",'[1]1 ères chaleurs'!B170)","v":""},{"$f":"IF('[1]1 ères chaleurs'!C170=\"\",\"\",'[1]1 ères chaleurs'!C170)","v":""},null,null,null,"","",null,"","","","","","","",""]
[null,null,null,{"$f":"IF('[1]1 ères chaleurs'!A171=\"\",\"\",IF('[1]1 ères chaleurs'!A171=\"total général\",\"\",'[1]1 ères chaleurs'!A171))","v":""},{"$f":"IF('[1]1 ères chaleurs'!B171=\"\",\"\",'[1]1 ères chaleurs'!B171)","v":""},{"$f":"IF('[1]1 ères chaleurs'!C171=\"\",\"\",'[1]1 ères chaleurs'!C171)","v":""},null,null,null,"","",null,"","","","","","","",""]
[null,null,null,{"$f":"IF('[1]1 ères chaleurs'!A172=\"\",\"\",IF('[1]1 ères chaleurs'!A172=\"total général\",\"\",'[1]1 ères chaleurs'!A172))","v":""},{"$f":"IF('[1]1 ères chaleurs'!B172=\"\",\"\",'[1]1 ères chaleurs'!B172)","v":""},{"$f":"IF('[1]1 ères chaleurs'!C172=\"\",\"\",'[1]1 ères chaleurs'!C172)","v":""},null,null,null,"","",null,"","","","","","","",""]
[null,null,null,{"$f":"IF('[1]1 ères chaleurs'!A173=\"\",\"\",IF('[1]1 ères chaleurs'!A173=\"total général\",\"\",'[1]1 ères chaleurs'!A173))","v":""},{"$f":"IF('[1]1 ères chaleurs'!B173=\"\",\"\",'[1]1 ères chaleurs'!B173)","v":""},{"$f":"IF('[1]1 ères chaleurs'!C173=\"\",\"\",'[1]1 ères chaleurs'!C173)","v":""},null,null,null,"","",null,"","","","","","","",""]
[null,null,null,{"$f":"IF('[1]1 ères chaleurs'!A174=\"\",\"\",IF('[1]1 ères chaleurs'!A174=\"total général\",\"\",'[1]1 ères chaleurs'!A174))","v":""},{"$f":"IF('[1]1 ères chaleurs'!B174=\"\",\"\",'[1]1 ères chaleurs'!B174)","v":""},{"$f":"IF('[1]1 ères chaleurs'!C174=\"\",\"\",'[1]1 ères chaleurs'!C174)","v":""},null,null,null,"","",null,"","","","","","","",""]
[null,null,null,{"$f":"IF('[1]1 ères chaleurs'!A175=\"\",\"\",IF('[1]1 ères chaleurs'!A175=\"total général\",\"\",'[1]1 ères chaleurs'!A175))","v":""},{"$f":"IF('[1]1 ères chaleurs'!B175=\"\",\"\",'[1]1 ères chaleurs'!B175)","v":""},{"$f":"IF('[1]1 ères chaleurs'!C175=\"\",\"\",'[1]1 ères chaleurs'!C175)","v":""},null,null,null,"","",null,"","","","","","","",""]
[null,null,null,{"$f":"IF('[1]1 ères chaleurs'!A176=\"\",\"\",IF('[1]1 ères chaleurs'!A176=\"total général\",\"\",'[1]1 ères chaleurs'!A176))","v":""},{"$f":"IF('[1]1 ères chaleurs'!B176=\"\",\"\",'[1]1 ères chaleurs'!B176)","v":""},{"$f":"IF('[1]1 ères chaleurs'!C176=\"\",\"\",'[1]1 ères chaleurs'!C176)","v":""},null,null,null,"","",null,"","","","","","","",""]
[null,null,null,{"$f":"IF('[1]1 ères chaleurs'!A177=\"\",\"\",IF('[1]1 ères chaleurs'!A177=\"total général\",\"\",'[1]1 ères chaleurs'!A177))","v":""},{"$f":"IF('[1]1 ères chaleurs'!B177=\"\",\"\",'[1]1 ères chaleurs'!B177)","v":""},{"$f":"IF('[1]1 ères chaleurs'!C177=\"\",\"\",'[1]1 ères chaleurs'!C177)","v":""},null,null,null,"","",null,"","","","","","","",""]
[null,null,null,{"$f":"IF('[1]1 ères chaleurs'!A178=\"\",\"\",IF('[1]1 ères chaleurs'!A178=\"total général\",\"\",'[1]1 ères chaleurs'!A178))","v":""},{"$f":"IF('[1]1 ères chaleurs'!B178=\"\",\"\",'[1]1 ères chaleurs'!B178)","v":""},{"$f":"IF('[1]1 ères chaleurs'!C178=\"\",\"\",'[1]1 ères chaleurs'!C178)","v":""},null,null,null,"","",null,"","","","","","","",""]
[null,null,null,{"$f":"IF('[1]1 ères chaleurs'!A179=\"\",\"\",IF('[1]1 ères chaleurs'!A179=\"total général\",\"\",'[1]1 ères chaleurs'!A179))","v":""},{"$f":"IF('[1]1 ères chaleurs'!B179=\"\",\"\",'[1]1 ères chaleurs'!B179)","v":""},{"$f":"IF('[1]1 ères chaleurs'!C179=\"\",\"\",'[1]1 ères chaleurs'!C179)","v":""},null,null,null,"","",null,"","","","","","","",""]
[null,null,null,{"$f":"IF('[1]1 ères chaleurs'!A180=\"\",\"\",IF('[1]1 ères chaleurs'!A180=\"total général\",\"\",'[1]1 ères chaleurs'!A180))","v":""},{"$f":"IF('[1]1 ères chaleurs'!B180=\"\",\"\",'[1]1 ères chaleurs'!B180)","v":""},{"$f":"IF('[1]1 ères chaleurs'!C180=\"\",\"\",'[1]1 ères chaleurs'!C180)","v":""},null,null,null,"","",null,"","","","","","","",""]
[null,null,null,{"$f":"IF('[1]1 ères chaleurs'!A181=\"\",\"\",IF('[1]1 ères chaleurs'!A181=\"total général\",\"\",'[1]1 ères chaleurs'!A181))","v":""},{"$f":"IF('[1]1 ères chaleurs'!B181=\"\",\"\",'[1]1 ères chaleurs'!B181)","v":""},{"$f":"IF('[1]1 ères chaleurs'!C181=\"\",\"\",'[1]1 ères chaleurs'!C181)","v":""},null,null,null,"","",null,"","","","","","","",""]
[null,null,null,{"$f":"IF('[1]1 ères chaleurs'!A182=\"\",\"\",IF('[1]1 ères chaleurs'!A182=\"total général\",\"\",'[1]1 ères chaleurs'!A182))","v":""},{"$f":"IF('[1]1 ères chaleurs'!B182=\"\",\"\",'[1]1 ères chaleurs'!B182)","v":""},{"$f":"IF('[1]1 ères chaleurs'!C182=\"\",\"\",'[1]1 ères chaleurs'!C182)","v":""},null,null,null,"","",null,"","","","","","","",""]
[null,null,null,{"$f":"IF('[1]1 ères chaleurs'!A183=\"\",\"\",IF('[1]1 ères chaleurs'!A183=\"total général\",\"\",'[1]1 ères chaleurs'!A183))","v":""},{"$f":"IF('[1]1 ères chaleurs'!B183=\"\",\"\",'[1]1 ères chaleurs'!B183)","v":""},{"$f":"IF('[1]1 ères chaleurs'!C183=\"\",\"\",'[1]1 ères chaleurs'!C183)","v":""},null,null,null,"","",null,"","","","","","","",""]
[null,null,null,{"$f":"IF('[1]1 ères chaleurs'!A184=\"\",\"\",IF('[1]1 ères chaleurs'!A184=\"total général\",\"\",'[1]1 ères chaleurs'!A184))","v":""},{"$f":"IF('[1]1 ères chaleurs'!B184=\"\",\"\",'[1]1 ères chaleurs'!B184)","v":""},{"$f":"IF('[1]1 ères chaleurs'!C184=\"\",\"\",'[1]1 ères chaleurs'!C184)","v":""},null,null,null,"","",null,"","","","","","","",""]
[null,null,null,{"$f":"IF('[1]1 ères chaleurs'!A185=\"\",\"\",IF('[1]1 ères chaleurs'!A185=\"total général\",\"\",'[1]1 ères chaleurs'!A185))","v":""},{"$f":"IF('[1]1 ères chaleurs'!B185=\"\",\"\",'[1]1 ères chaleurs'!B185)","v":""},{"$f":"IF('[1]1 ères chaleurs'!C185=\"\",\"\",'[1]1 ères chaleurs'!C185)","v":""},null,null,null,"","",null,"","","","","","","",""]
[null,null,null,{"$f":"IF('[1]1 ères chaleurs'!A186=\"\",\"\",IF('[1]1 ères chaleurs'!A186=\"total général\",\"\",'[1]1 ères chaleurs'!A186))","v":""},{"$f":"IF('[1]1 ères chaleurs'!B186=\"\",\"\",'[1]1 ères chaleurs'!B186)","v":""},{"$f":"IF('[1]1 ères chaleurs'!C186=\"\",\"\",'[1]1 ères chaleurs'!C186)","v":""},null,null,null,"","",null,"","","","","","","",""]
[null,null,null,{"$f":"IF('[1]1 ères chaleurs'!A187=\"\",\"\",IF('[1]1 ères chaleurs'!A187=\"total général\",\"\",'[1]1 ères chaleurs'!A187))","v":""},{"$f":"IF('[1]1 ères chaleurs'!B187=\"\",\"\",'[1]1 ères chaleurs'!B187)","v":""},{"$f":"IF('[1]1 ères chaleurs'!C187=\"\",\"\",'[1]1 ères chaleurs'!C187)","v":""},null,null,null,"","",null,"","","","","","","",""]
[null,null,null,{"$f":"IF('[1]1 ères chaleurs'!A188=\"\",\"\",IF('[1]1 ères chaleurs'!A188=\"total général\",\"\",'[1]1 ères chaleurs'!A188))","v":""},{"$f":"IF('[1]1 ères chaleurs'!B188=\"\",\"\",'[1]1 ères chaleurs'!B188)","v":""},{"$f":"IF('[1]1 ères chaleurs'!C188=\"\",\"\",'[1]1 ères chaleurs'!C188)","v":""},null,null,null,"","",null,"","","","","","","",""]
[null,null,null,{"$f":"IF('[1]1 ères chaleurs'!A189=\"\",\"\",IF('[1]1 ères chaleurs'!A189=\"total général\",\"\",'[1]1 ères chaleurs'!A189))","v":""},{"$f":"IF('[1]1 ères chaleurs'!B189=\"\",\"\",'[1]1 ères chaleurs'!B189)","v":""},{"$f":"IF('[1]1 ères chaleurs'!C189=\"\",\"\",'[1]1 ères chaleurs'!C189)","v":""},null,null,null,"","",null,"","","","","","","",""]
[null,null,null,{"$f":"IF('[1]1 ères chaleurs'!A190=\"\",\"\",IF('[1]1 ères chaleurs'!A190=\"total général\",\"\",'[1]1 ères chaleurs'!A190))","v":""},{"$f":"IF('[1]1 ères chaleurs'!B190=\"\",\"\",'[1]1 ères chaleurs'!B190)","v":""},{"$f":"IF('[1]1 ères chaleurs'!C190=\"\",\"\",'[1]1 ères chaleurs'!C190)","v":""},null,null,null,"","",null,"","","","","","","",""]
[null,null,null,{"$f":"IF('[1]1 ères chaleurs'!A191=\"\",\"\",IF('[1]1 ères chaleurs'!A191=\"total général\",\"\",'[1]1 ères chaleurs'!A191))","v":""},{"$f":"IF('[1]1 ères chaleurs'!B191=\"\",\"\",'[1]1 ères chaleurs'!B191)","v":""},{"$f":"IF('[1]1 ères chaleurs'!C191=\"\",\"\",'[1]1 ères chaleurs'!C191)","v":""},null,null,null,"","",null,"","","","","","","",""]
[null,null,null,{"$f":"IF('[1]1 ères chaleurs'!A192=\"\",\"\",IF('[1]1 ères chaleurs'!A192=\"total général\",\"\",'[1]1 ères chaleurs'!A192))","v":""},{"$f":"IF('[1]1 ères chaleurs'!B192=\"\",\"\",'[1]1 ères chaleurs'!B192)","v":""},{"$f":"IF('[1]1 ères chaleurs'!C192=\"\",\"\",'[1]1 ères chaleurs'!C192)","v":""},null,null,null,"","",null,"","","","","","","",""]
[null,null,null,{"$f":"IF('[1]1 ères chaleurs'!A193=\"\",\"\",IF('[1]1 ères chaleurs'!A193=\"total général\",\"\",'[1]1 ères chaleurs'!A193))","v":""},{"$f":"IF('[1]1 ères chaleurs'!B193=\"\",\"\",'[1]1 ères chaleurs'!B193)","v":""},{"$f":"IF('[1]1 ères chaleurs'!C193=\"\",\"\",'[1]1 ères chaleurs'!C193)","v":""},null,null,null,"","",null,"","","","","","","",""]
[null,null,null,{"$f":"IF('[1]1 ères chaleurs'!A194=\"\",\"\",IF('[1]1 ères chaleurs'!A194=\"total général\",\"\",'[1]1 ères chaleurs'!A194))","v":""},{"$f":"IF('[1]1 ères chaleurs'!B194=\"\",\"\",'[1]1 ères chaleurs'!B194)","v":""},{"$f":"IF('[1]1 ères chaleurs'!C194=\"\",\"\",'[1]1 ères chaleurs'!C194)","v":""},null,null,null,"","",null,"","","","","","","",""]
[null,null,null,{"$f":"IF('[1]1 ères chaleurs'!A195=\"\",\"\",IF('[1]1 ères chaleurs'!A195=\"total général\",\"\",'[1]1 ères chaleurs'!A195))","v":""},{"$f":"IF('[1]1 ères chaleurs'!B195=\"\",\"\",'[1]1 ères chaleurs'!B195)","v":""},{"$f":"IF('[1]1 ères chaleurs'!C195=\"\",\"\",'[1]1 ères chaleurs'!C195)","v":""},null,null,null,"","",null,"","","","","","","",""]
[null,null,null,{"$f":"IF('[1]1 ères chaleurs'!A196=\"\",\"\",IF('[1]1 ères chaleurs'!A196=\"total général\",\"\",'[1]1 ères chaleurs'!A196))","v":""},{"$f":"IF('[1]1 ères chaleurs'!B196=\"\",\"\",'[1]1 ères chaleurs'!B196)","v":""},{"$f":"IF('[1]1 ères chaleurs'!C196=\"\",\"\",'[1]1 ères chaleurs'!C196)","v":""},null,null,null,"","",null,"","","","","","","",""]
[null,null,null,{"$f":"IF('[1]1 ères chaleurs'!A197=\"\",\"\",IF('[1]1 ères chaleurs'!A197=\"total général\",\"\",'[1]1 ères chaleurs'!A197))","v":""},{"$f":"IF('[1]1 ères chaleurs'!B197=\"\",\"\",'[1]1 ères chaleurs'!B197)","v":""},{"$f":"IF('[1]1 ères chaleurs'!C197=\"\",\"\",'[1]1 ères chaleurs'!C197)","v":""},null,null,null,"","",null,"","","","","","","",""]
[null,null,null,{"$f":"IF('[1]1 ères chaleurs'!A198=\"\",\"\",IF('[1]1 ères chaleurs'!A198=\"total général\",\"\",'[1]1 ères chaleurs'!A198))","v":""},{"$f":"IF('[1]1 ères chaleurs'!B198=\"\",\"\",'[1]1 ères chaleurs'!B198)","v":""},{"$f":"IF('[1]1 ères chaleurs'!C198=\"\",\"\",'[1]1 ères chaleurs'!C198)","v":""},null,null,null,"","",null,"","","","","","","",""]
[null,null,null,{"$f":"IF('[1]1 ères chaleurs'!A199=\"\",\"\",IF('[1]1 ères chaleurs'!A199=\"total général\",\"\",'[1]1 ères chaleurs'!A199))","v":""},{"$f":"IF('[1]1 ères chaleurs'!B199=\"\",\"\",'[1]1 ères chaleurs'!B199)","v":""},{"$f":"IF('[1]1 ères chaleurs'!C199=\"\",\"\",'[1]1 ères chaleurs'!C199)","v":""},null,null,null,"","",null,"","","","","","","",""]
[null,null,null,{"$f":"IF('[1]1 ères chaleurs'!A200=\"\",\"\",IF('[1]1 ères chaleurs'!A200=\"total général\",\"\",'[1]1 ères chaleurs'!A200))","v":""},{"$f":"IF('[1]1 ères chaleurs'!B200=\"\",\"\",'[1]1 ères chaleurs'!B200)","v":""},{"$f":"IF('[1]1 ères chaleurs'!C200=\"\",\"\",'[1]1 ères chaleurs'!C200)","v":""},null,null,null,"","",null,"","","","","","","",""]
[null,null,null,{"$f":"IF('[1]1 ères chaleurs'!A201=\"\",\"\",IF('[1]1 ères chaleurs'!A201=\"total général\",\"\",'[1]1 ères chaleurs'!A201))","v":""},{"$f":"IF('[1]1 ères chaleurs'!B201=\"\",\"\",'[1]1 ères chaleurs'!B201)","v":""},{"$f":"IF('[1]1 ères chaleurs'!C201=\"\",\"\",'[1]1 ères chaleurs'!C201)","v":""},null,null,null,"","",null,"","","","","","","",""]
[null,null,null,{"$f":"IF('[1]1 ères chaleurs'!A202=\"\",\"\",IF('[1]1 ères chaleurs'!A202=\"total général\",\"\",'[1]1 ères chaleurs'!A202))","v":""},{"$f":"IF('[1]1 ères chaleurs'!B202=\"\",\"\",'[1]1 ères chaleurs'!B202)","v":""},{"$f":"IF('[1]1 ères chaleurs'!C202=\"\",\"\",'[1]1 ères chaleurs'!C202)","v":""},null,null,null,"","",null,"","","","","","","",""]
[null,null,null,{"$f":"IF('[1]1 ères chaleurs'!A203=\"\",\"\",IF('[1]1 ères chaleurs'!A203=\"total général\",\"\",'[1]1 ères chaleurs'!A203))","v":""},{"$f":"IF('[1]1 ères chaleurs'!B203=\"\",\"\",'[1]1 ères chaleurs'!B203)","v":""},{"$f":"IF('[1]1 ères chaleurs'!C203=\"\",\"\",'[1]1 ères chaleurs'!C203)","v":""},null,null,null,"","",null,"","",{"$f":"IF(N200=\"\",\"\",IF(N200=1,IF(G200=\"\",\"\",\"XXX\"),\"XXX\"))","v":""},"",{"$f":"IF(P200=\"\",\"\",IF(P200=1,IF(G200=\"\",\"\",\"XXX\"),\"XXX\"))","v":""},{"$f":"IF(P200=\"\",\"\",IF(P200=1,IF(G200=\"\",\"\",\"XXX\"),\"XXX\"))","v":""},{"$f":"IF(R200=\"\",\"\",IF(R200=1,IF(G200=\"\",\"\",\"XXX\"),\"XXX\"))","v":""},""]
[null,null,null,{"$f":"IF('[1]1 ères chaleurs'!A204=\"\",\"\",IF('[1]1 ères chaleurs'!A204=\"total général\",\"\",'[1]1 ères chaleurs'!A204))","v":""},{"$f":"IF('[1]1 ères chaleurs'!B204=\"\",\"\",'[1]1 ères chaleurs'!B204)","v":""},{"$f":"IF('[1]1 ères chaleurs'!C204=\"\",\"\",'[1]1 ères chaleurs'!C204)","v":""},null,null,null,{"$f":"IF(G201=\"\",\"\",\"XXX\")","v":""},{"$f":"IF(G201=\"\",\"\",\"XXX\")","v":""},null,{"$f":"IF(K201=\"\",\"\",IF(K201=1,IF(G201=\"\",\"\",\"XXX\"),\"XXX\"))","v":""},{"$f":"IF(K201=\"\",\"\",IF(K201=1,IF(G201=\"\",\"\",\"XXX\"),\"XXX\"))","v":""},"",{"$f":"IF(N201=\"\",\"\",IF(N201=1,IF(G201=\"\",\"\",\"XXX\"),\"XXX\"))","v":""},"","","",{"$f":"IF(R201=\"\",\"\",IF(R201=1,IF(G201=\"\",\"\",\"XXX\"),\"XXX\"))","v":""}]

{"sheet":"intensité chaleurs","index":1,"n_rows":347,"n_cols":30,"rows_kept":347,"cut":false,"hidden":false,"merged":[[4,28,5,28],[4,26,5,26],[4,27,5,27],[4,15,5,15],[4,17,5,17],[4,20,5,20],[4,22,5,22],[4,25,5,25],[4,16,5,16],[4,18,5,18],[4,19,5,19],[4,21,5,21],[4,23,5,23],[4,24,5,24],[4,12,5,12],[1,2,1,28],[3,2,4,2],[3,4,3,8],[3,9,3,13],[3,14,3,18],[3,19,3,23],[3,24,3,28],[4,4,5,4],[4,6,5,6],[4,8,5,8],[4,9,5,9],[4,11,5,11],[4,13,5,13],[4,5,5,5],[4,14,5,14],[1,0,2,1],[4,0,5,1],[4,7,5,7],[3,3,5,3],[4,10,5,10]]}
[]
["retour à la page d'accueil",null,"Intensité des chaleurs pour les vaches (dès le vêlage) et les génisses (de 1 mois avant la période de repro--> fécondation)"]
[]
[null,null,"N° 4 chiffres ","Nom de l'animal","chaleur N°1",null,null,null,null,"chaleur N°2",null,null,null,null,"chaleur N°3",null,null,null,null,"chaleur N°4",null,null,null,null,"chaleur N°5"]
[{"$f":"'[1]IC Vaches et génisses'!$B$2","v":"54474307"},null,null,null," Date ","type","Intensité ","flusching","Lieu"," Date ","type","Intensité ","flusching","Lieu"," Date ","type","Intensité ","flusching","Lieu"," Date ","type","Intensité ","flusching","Lieu"," Date ","type","Intensité ","flusching","Lieu"]
[null,null,null,null,null,null,null,null,null,null,null,null,null,null,null,null,null,null,null,null,null,null,null,null,null,null,null,null,null,"Remarques particulières sur l'animal"]
[null,null,{"$f":"IF('[1]IC Vaches et génisses'!A8=\"\",\"\",IF('[1]IC Vaches et génisses'!A8=\"Total général\",\"\",'[1]IC Vaches et génisses'!A8))","v":"0052"},{"$f":"IF('[1]IC Vaches et génisses'!B8=\"\",\"\",'[1]IC Vaches et génisses'!B8)","v":"UDINE"}]
[null,null,{"$f":"IF('[1]IC Vaches et génisses'!A9=\"\",\"\",IF('[1]IC Vaches et génisses'!A9=\"Total général\",\"\",'[1]IC Vaches et génisses'!A9))","v":"2974"},{"$f":"IF('[1]IC Vaches et génisses'!B9=\"\",\"\",'[1]IC Vaches et génisses'!B9)","v":"ASTONIA"}]
[null,null,{"$f":"IF('[1]IC Vaches et génisses'!A10=\"\",\"\",IF('[1]IC Vaches et génisses'!A10=\"Total général\",\"\",'[1]IC Vaches et génisses'!A10))","v":"3266"},{"$f":"IF('[1]IC Vaches et génisses'!B10=\"\",\"\",'[1]IC Vaches et génisses'!B10)","v":"DECADE"}]
[null,null,{"$f":"IF('[1]IC Vaches et génisses'!A11=\"\",\"\",IF('[1]IC Vaches et génisses'!A11=\"Total général\",\"\",'[1]IC Vaches et génisses'!A11))","v":"3271"},{"$f":"IF('[1]IC Vaches et génisses'!B11=\"\",\"\",'[1]IC Vaches et génisses'!B11)","v":"DOUCETTE"}]
[null,null,{"$f":"IF('[1]IC Vaches et génisses'!A12=\"\",\"\",IF('[1]IC Vaches et génisses'!A12=\"Total général\",\"\",'[1]IC Vaches et génisses'!A12))","v":"3272"},{"$f":"IF('[1]IC Vaches et génisses'!B12=\"\",\"\",'[1]IC Vaches et génisses'!B12)","v":"DANETTE"}]
[null,null,{"$f":"IF('[1]IC Vaches et génisses'!A13=\"\",\"\",IF('[1]IC Vaches et génisses'!A13=\"Total général\",\"\",'[1]IC Vaches et génisses'!A13))","v":"3276"},{"$f":"IF('[1]IC Vaches et génisses'!B13=\"\",\"\",'[1]IC Vaches et génisses'!B13)","v":"DYNAMITE"}]
[null,null,{"$f":"IF('[1]IC Vaches et génisses'!A14=\"\",\"\",IF('[1]IC Vaches et génisses'!A14=\"Total général\",\"\",'[1]IC Vaches et génisses'!A14))","v":"3279"},{"$f":"IF('[1]IC Vaches et génisses'!B14=\"\",\"\",'[1]IC Vaches et génisses'!B14)","v":"DORA"}]
[null,null,{"$f":"IF('[1]IC Vaches et génisses'!A15=\"\",\"\",IF('[1]IC Vaches et génisses'!A15=\"Total général\",\"\",'[1]IC Vaches et génisses'!A15))","v":"3280"},{"$f":"IF('[1]IC Vaches et génisses'!B15=\"\",\"\",'[1]IC Vaches et génisses'!B15)","v":"DOLLY"}]
[null,null,{"$f":"IF('[1]IC Vaches et génisses'!A16=\"\",\"\",IF('[1]IC Vaches et génisses'!A16=\"Total général\",\"\",'[1]IC Vaches et génisses'!A16))","v":"3285"},{"$f":"IF('[1]IC Vaches et génisses'!B16=\"\",\"\",'[1]IC Vaches et génisses'!B16)","v":"DORINE"}]
[null,null,{"$f":"IF('[1]IC Vaches et génisses'!A17=\"\",\"\",IF('[1]IC Vaches et génisses'!A17=\"Total général\",\"\",'[1]IC Vaches et génisses'!A17))","v":"3292"},{"$f":"IF('[1]IC Vaches et génisses'!B17=\"\",\"\",'[1]IC Vaches et génisses'!B17)","v":"DIGITALE"}]
[null,null,{"$f":"IF('[1]IC Vaches et génisses'!A18=\"\",\"\",IF('[1]IC Vaches et génisses'!A18=\"Total général\",\"\",'[1]IC Vaches et génisses'!A18))","v":"3294"},{"$f":"IF('[1]IC Vaches et génisses'!B18=\"\",\"\",'[1]IC Vaches et génisses'!B18)","v":"EXTRA"}]
[null,null,{"$f":"IF('[1]IC Vaches et génisses'!A19=\"\",\"\",IF('[1]IC Vaches et génisses'!A19=\"Total général\",\"\",'[1]IC Vaches et génisses'!A19))","v":"3568"},{"$f":"IF('[1]IC Vaches et génisses'!B19=\"\",\"\",'[1]IC Vaches et génisses'!B19)","v":"BUVEE"}]
[null,null,{"$f":"IF('[1]IC Vaches et génisses'!A20=\"\",\"\",IF('[1]IC Vaches et génisses'!A20=\"Total général\",\"\",'[1]IC Vaches et génisses'!A20))","v":"4211"},{"$f":"IF('[1]IC Vaches et génisses'!B20=\"\",\"\",'[1]IC Vaches et génisses'!B20)","v":"FANTA"}]
[null,null,{"$f":"IF('[1]IC Vaches et génisses'!A21=\"\",\"\",IF('[1]IC Vaches et génisses'!A21=\"Total général\",\"\",'[1]IC Vaches et génisses'!A21))","v":"4212"},{"$f":"IF('[1]IC Vaches et génisses'!B21=\"\",\"\",'[1]IC Vaches et génisses'!B21)","v":"FLORA"}]
[null,null,{"$f":"IF('[1]IC Vaches et génisses'!A22=\"\",\"\",IF('[1]IC Vaches et génisses'!A22=\"Total général\",\"\",'[1]IC Vaches et génisses'!A22))","v":"4213"},{"$f":"IF('[1]IC Vaches et génisses'!B22=\"\",\"\",'[1]IC Vaches et génisses'!B22)","v":"FIDELIA"}]
[null,null,{"$f":"IF('[1]IC Vaches et génisses'!A23=\"\",\"\",IF('[1]IC Vaches et génisses'!A23=\"Total général\",\"\",'[1]IC Vaches et génisses'!A23))","v":"4214"},{"$f":"IF('[1]IC Vaches et génisses'!B23=\"\",\"\",'[1]IC Vaches et génisses'!B23)","v":"FIESTA"}]
[null,null,{"$f":"IF('[1]IC Vaches et génisses'!A24=\"\",\"\",IF('[1]IC Vaches et génisses'!A24=\"Total général\",\"\",'[1]IC Vaches et génisses'!A24))","v":"4215"},{"$f":"IF('[1]IC Vaches et génisses'!B24=\"\",\"\",'[1]IC Vaches et génisses'!B24)","v":"FIFI"}]
[null,null,{"$f":"IF('[1]IC Vaches et génisses'!A25=\"\",\"\",IF('[1]IC Vaches et génisses'!A25=\"Total général\",\"\",'[1]IC Vaches et génisses'!A25))","v":"4216"},{"$f":"IF('[1]IC Vaches et génisses'!B25=\"\",\"\",'[1]IC Vaches et génisses'!B25)","v":"FARCE"}]
[null,null,{"$f":"IF('[1]IC Vaches et génisses'!A26=\"\",\"\",IF('[1]IC Vaches et génisses'!A26=\"Total général\",\"\",'[1]IC Vaches et génisses'!A26))","v":"4217"},{"$f":"IF('[1]IC Vaches et génisses'!B26=\"\",\"\",'[1]IC Vaches et génisses'!B26)","v":"FAUVETTE"}]
[null,null,{"$f":"IF('[1]IC Vaches et génisses'!A27=\"\",\"\",IF('[1]IC Vaches et génisses'!A27=\"Total général\",\"\",'[1]IC Vaches et génisses'!A27))","v":"4223"},{"$f":"IF('[1]IC Vaches et génisses'!B27=\"\",\"\",'[1]IC Vaches et génisses'!B27)","v":"FEA"}]
[null,null,{"$f":"IF('[1]IC Vaches et génisses'!A28=\"\",\"\",IF('[1]IC Vaches et génisses'!A28=\"Total général\",\"\",'[1]IC Vaches et génisses'!A28))","v":"4226"},{"$f":"IF('[1]IC Vaches et génisses'!B28=\"\",\"\",'[1]IC Vaches et génisses'!B28)","v":"FIONA"}]
[null,null,{"$f":"IF('[1]IC Vaches et génisses'!A29=\"\",\"\",IF('[1]IC Vaches et génisses'!A29=\"Total général\",\"\",'[1]IC Vaches et génisses'!A29))","v":"4232"},{"$f":"IF('[1]IC Vaches et génisses'!B29=\"\",\"\",'[1]IC Vaches et génisses'!B29)","v":"FARIBOLE"}]
[null,null,{"$f":"IF('[1]IC Vaches et génisses'!A30=\"\",\"\",IF('[1]IC Vaches et génisses'!A30=\"Total général\",\"\",'[1]IC Vaches et génisses'!A30))","v":"4236"},{"$f":"IF('[1]IC Vaches et génisses'!B30=\"\",\"\",'[1]IC Vaches et génisses'!B30)","v":"FELLA"}]
[null,null,{"$f":"IF('[1]IC Vaches et génisses'!A31=\"\",\"\",IF('[1]IC Vaches et génisses'!A31=\"Total général\",\"\",'[1]IC Vaches et génisses'!A31))","v":"4506"},{"$f":"IF('[1]IC Vaches et génisses'!B31=\"\",\"\",'[1]IC Vaches et génisses'!B31)","v":"ILONA"}]
[null,null,{"$f":"IF('[1]IC Vaches et génisses'!A32=\"\",\"\",IF('[1]IC Vaches et génisses'!A32=\"Total général\",\"\",'[1]IC Vaches et génisses'!A32))","v":"4619"},{"$f":"IF('[1]IC Vaches et génisses'!B32=\"\",\"\",'[1]IC Vaches et génisses'!B32)","v":"HERITIERE"}]
[null,null,{"$f":"IF('[1]IC Vaches et génisses'!A33=\"\",\"\",IF('[1]IC Vaches et génisses'!A33=\"Total général\",\"\",'[1]IC Vaches et génisses'!A33))","v":"4886"},{"$f":"IF('[1]IC Vaches et génisses'!B33=\"\",\"\",'[1]IC Vaches et génisses'!B33)","v":"JELLY"}]
[null,null,{"$f":"IF('[1]IC Vaches et génisses'!A34=\"\",\"\",IF('[1]IC Vaches et génisses'!A34=\"Total général\",\"\",'[1]IC Vaches et génisses'!A34))","v":"4887"},{"$f":"IF('[1]IC Vaches et génisses'!B34=\"\",\"\",'[1]IC Vaches et génisses'!B34)","v":"JACYNTHE"}]
[null,null,{"$f":"IF('[1]IC Vaches et génisses'!A35=\"\",\"\",IF('[1]IC Vaches et génisses'!A35=\"Total général\",\"\",'[1]IC Vaches et génisses'!A35))","v":"4888"},{"$f":"IF('[1]IC Vaches et génisses'!B35=\"\",\"\",'[1]IC Vaches et génisses'!B35)","v":"JASMINE"}]
[null,null,{"$f":"IF('[1]IC Vaches et génisses'!A36=\"\",\"\",IF('[1]IC Vaches et génisses'!A36=\"Total général\",\"\",'[1]IC Vaches et génisses'!A36))","v":"4889"},{"$f":"IF('[1]IC Vaches et génisses'!B36=\"\",\"\",'[1]IC Vaches et génisses'!B36)","v":"JALA"}]
[null,null,{"$f":"IF('[1]IC Vaches et génisses'!A37=\"\",\"\",IF('[1]IC Vaches et génisses'!A37=\"Total général\",\"\",'[1]IC Vaches et génisses'!A37))","v":"4890"},{"$f":"IF('[1]IC Vaches et génisses'!B37=\"\",\"\",'[1]IC Vaches et génisses'!B37)","v":"JENNA"}]
[null,null,{"$f":"IF('[1]IC Vaches et génisses'!A38=\"\",\"\",IF('[1]IC Vaches et génisses'!A38=\"Total général\",\"\",'[1]IC Vaches et génisses'!A38))","v":"4891"},{"$f":"IF('[1]IC Vaches et génisses'!B38=\"\",\"\",'[1]IC Vaches et génisses'!B38)","v":"JIXIE"}]
[null,null,{"$f":"IF('[1]IC Vaches et génisses'!A39=\"\",\"\",IF('[1]IC Vaches et génisses'!A39=\"Total général\",\"\",'[1]IC Vaches et génisses'!A39))","v":"4892"},{"$f":"IF('[1]IC Vaches et génisses'!B39=\"\",\"\",'[1]IC Vaches et génisses'!B39)","v":"JAMAIQUE"}]
[null,null,{"$f":"IF('[1]IC Vaches et génisses'!A40=\"\",\"\",IF('[1]IC Vaches et génisses'!A40=\"Total général\",\"\",'[1]IC Vaches et génisses'!A40))","v":"4893"},{"$f":"IF('[1]IC Vaches et génisses'!B40=\"\",\"\",'[1]IC Vaches et génisses'!B40)","v":"JACOTTE"}]
[null,null,{"$f":"IF('[1]IC Vaches et génisses'!A41=\"\",\"\",IF('[1]IC Vaches et génisses'!A41=\"Total général\",\"\",'[1]IC Vaches et génisses'!A41))","v":"4894"},{"$f":"IF('[1]IC Vaches et génisses'!B41=\"\",\"\",'[1]IC Vaches et génisses'!B41)","v":"JOCONDE"}]
[null,null,{"$f":"IF('[1]IC Vaches et génisses'!A42=\"\",\"\",IF('[1]IC Vaches et génisses'!A42=\"Total général\",\"\",'[1]IC Vaches et génisses'!A42))","v":"4895"},{"$f":"IF('[1]IC Vaches et génisses'!B42=\"\",\"\",'[1]IC Vaches et génisses'!B42)","v":"JETSET"}]
[null,null,{"$f":"IF('[1]IC Vaches et génisses'!A43=\"\",\"\",IF('[1]IC Vaches et génisses'!A43=\"Total général\",\"\",'[1]IC Vaches et génisses'!A43))","v":"4896"},{"$f":"IF('[1]IC Vaches et génisses'!B43=\"\",\"\",'[1]IC Vaches et génisses'!B43)","v":"JOY"}]
[null,null,{"$f":"IF('[1]IC Vaches et génisses'!A44=\"\",\"\",IF('[1]IC Vaches et génisses'!A44=\"Total général\",\"\",'[1]IC Vaches et génisses'!A44))","v":"4897"},{"$f":"IF('[1]IC Vaches et génisses'!B44=\"\",\"\",'[1]IC Vaches et génisses'!B44)","v":"JASMA"}]
[null,null,{"$f":"IF('[1]IC Vaches et génisses'!A45=\"\",\"\",IF('[1]IC Vaches et génisses'!A45=\"Total général\",\"\",'[1]IC Vaches et génisses'!A45))","v":"4898"},{"$f":"IF('[1]IC Vaches et génisses'!B45=\"\",\"\",'[1]IC Vaches et génisses'!B45)","v":"JAMIE"}]
[null,null,{"$f":"IF('[1]IC Vaches et génisses'!A46=\"\",\"\",IF('[1]IC Vaches et génisses'!A46=\"Total général\",\"\",'[1]IC Vaches et génisses'!A46))","v":"4899"},{"$f":"IF('[1]IC Vaches et génisses'!B46=\"\",\"\",'[1]IC Vaches et génisses'!B46)","v":"JALNA"}]
[null,null,{"$f":"IF('[1]IC Vaches et génisses'!A47=\"\",\"\",IF('[1]IC Vaches et génisses'!A47=\"Total général\",\"\",'[1]IC Vaches et génisses'!A47))","v":"4901"},{"$f":"IF('[1]IC Vaches et génisses'!B47=\"\",\"\",'[1]IC Vaches et génisses'!B47)","v":"JODIE"}]
[null,null,{"$f":"IF('[1]IC Vaches et génisses'!A48=\"\",\"\",IF('[1]IC Vaches et génisses'!A48=\"Total général\",\"\",'[1]IC Vaches et génisses'!A48))","v":"4902"},{"$f":"IF('[1]IC Vaches et génisses'!B48=\"\",\"\",'[1]IC Vaches et génisses'!B48)","v":"JUNGLE"}]
[null,null,{"$f":"IF('[1]IC Vaches et génisses'!A49=\"\",\"\",IF('[1]IC Vaches et génisses'!A49=\"Total général\",\"\",'[1]IC Vaches et génisses'!A49))","v":"4903"},{"$f":"IF('[1]IC Vaches et génisses'!B49=\"\",\"\",'[1]IC Vaches et génisses'!B49)","v":"JELENE"}]
[null,null,{"$f":"IF('[1]IC Vaches et génisses'!A50=\"\",\"\",IF('[1]IC Vaches et génisses'!A50=\"Total général\",\"\",'[1]IC Vaches et génisses'!A50))","v":"4904"},{"$f":"IF('[1]IC Vaches et génisses'!B50=\"\",\"\",'[1]IC Vaches et génisses'!B50)","v":"JAMBETTE"}]
[null,null,{"$f":"IF('[1]IC Vaches et génisses'!A51=\"\",\"\",IF('[1]IC Vaches et génisses'!A51=\"Total général\",\"\",'[1]IC Vaches et génisses'!A51))","v":"4905"},{"$f":"IF('[1]IC Vaches et génisses'!B51=\"\",\"\",'[1]IC Vaches et génisses'!B51)","v":"JOLIE"}]
[null,null,{"$f":"IF('[1]IC Vaches et génisses'!A52=\"\",\"\",IF('[1]IC Vaches et génisses'!A52=\"Total général\",\"\",'[1]IC Vaches et génisses'!A52))","v":"4906"},{"$f":"IF('[1]IC Vaches et génisses'!B52=\"\",\"\",'[1]IC Vaches et génisses'!B52)","v":"JOYEUSE"}]
[null,null,{"$f":"IF('[1]IC Vaches et génisses'!A53=\"\",\"\",IF('[1]IC Vaches et génisses'!A53=\"Total général\",\"\",'[1]IC Vaches et génisses'!A53))","v":"4907"},{"$f":"IF('[1]IC Vaches et génisses'!B53=\"\",\"\",'[1]IC Vaches et génisses'!B53)","v":"JORDANIE"}]
[null,null,{"$f":"IF('[1]IC Vaches et génisses'!A54=\"\",\"\",IF('[1]IC Vaches et génisses'!A54=\"Total général\",\"\",'[1]IC Vaches et génisses'!A54))","v":"4908"},{"$f":"IF('[1]IC Vaches et génisses'!B54=\"\",\"\",'[1]IC Vaches et génisses'!B54)","v":"LACUNE"}]
[null,null,{"$f":"IF('[1]IC Vaches et génisses'!A55=\"\",\"\",IF('[1]IC Vaches et génisses'!A55=\"Total général\",\"\",'[1]IC Vaches et génisses'!A55))","v":"4909"},{"$f":"IF('[1]IC Vaches et génisses'!B55=\"\",\"\",'[1]IC Vaches et génisses'!B55)","v":"LIQUEUR"}]
[null,null,{"$f":"IF('[1]IC Vaches et génisses'!A56=\"\",\"\",IF('[1]IC Vaches et génisses'!A56=\"Total général\",\"\",'[1]IC Vaches et génisses'!A56))","v":"4910"},{"$f":"IF('[1]IC Vaches et génisses'!B56=\"\",\"\",'[1]IC Vaches et génisses'!B56)","v":"LITURGIE"}]
[null,null,{"$f":"IF('[1]IC Vaches et génisses'!A57=\"\",\"\",IF('[1]IC Vaches et génisses'!A57=\"Total général\",\"\",'[1]IC Vaches et génisses'!A57))","v":"4911"},{"$f":"IF('[1]IC Vaches et génisses'!B57=\"\",\"\",'[1]IC Vaches et génisses'!B57)","v":"LAINE"}]
[null,null,{"$f":"IF('[1]IC Vaches et génisses'!A58=\"\",\"\",IF('[1]IC Vaches et génisses'!A58=\"Total général\",\"\",'[1]IC Vaches et génisses'!A58))","v":"5200"},{"$f":"IF('[1]IC Vaches et génisses'!B58=\"\",\"\",'[1]IC Vaches et génisses'!B58)","v":"CENDRILLON"}]
[null,null,{"$f":"IF('[1]IC Vaches et génisses'!A59=\"\",\"\",IF('[1]IC Vaches et génisses'!A59=\"Total général\",\"\",'[1]IC Vaches et génisses'!A59))","v":"5321"},{"$f":"IF('[1]IC Vaches et génisses'!B59=\"\",\"\",'[1]IC Vaches et génisses'!B59)","v":"ACTION"}]
[null,null,{"$f":"IF('[1]IC Vaches et génisses'!A60=\"\",\"\",IF('[1]IC Vaches et génisses'!A60=\"Total général\",\"\",'[1]IC Vaches et génisses'!A60))","v":"5327"},{"$f":"IF('[1]IC Vaches et génisses'!B60=\"\",\"\",'[1]IC Vaches et génisses'!B60)","v":"AUTRUCHE"}]
[null,null,{"$f":"IF('[1]IC Vaches et génisses'!A61=\"\",\"\",IF('[1]IC Vaches et génisses'!A61=\"Total général\",\"\",'[1]IC Vaches et génisses'!A61))","v":"5567"},{"$f":"IF('[1]IC Vaches et génisses'!B61=\"\",\"\",'[1]IC Vaches et génisses'!B61)","v":"ETOILE"}]
[null,null,{"$f":"IF('[1]IC Vaches et génisses'!A62=\"\",\"\",IF('[1]IC Vaches et génisses'!A62=\"Total général\",\"\",'[1]IC Vaches et génisses'!A62))","v":"5571"},{"$f":"IF('[1]IC Vaches et génisses'!B62=\"\",\"\",'[1]IC Vaches et génisses'!B62)","v":"EBENE"}]
[null,null,{"$f":"IF('[1]IC Vaches et génisses'!A63=\"\",\"\",IF('[1]IC Vaches et génisses'!A63=\"Total général\",\"\",'[1]IC Vaches et génisses'!A63))","v":"5572"},{"$f":"IF('[1]IC Vaches et génisses'!B63=\"\",\"\",'[1]IC Vaches et génisses'!B63)","v":"EDINA"}]
[null,null,{"$f":"IF('[1]IC Vaches et génisses'!A64=\"\",\"\",IF('[1]IC Vaches et génisses'!A64=\"Total général\",\"\",'[1]IC Vaches et génisses'!A64))","v":"5573"},{"$f":"IF('[1]IC Vaches et génisses'!B64=\"\",\"\",'[1]IC Vaches et génisses'!B64)","v":"ELAURA"}]
[null,null,{"$f":"IF('[1]IC Vaches et génisses'!A65=\"\",\"\",IF('[1]IC Vaches et génisses'!A65=\"Total général\",\"\",'[1]IC Vaches et génisses'!A65))","v":"5574"},{"$f":"IF('[1]IC Vaches et génisses'!B65=\"\",\"\",'[1]IC Vaches et génisses'!B65)","v":"EUROPA"}]
[null,null,{"$f":"IF('[1]IC Vaches et génisses'!A66=\"\",\"\",IF('[1]IC Vaches et génisses'!A66=\"Total général\",\"\",'[1]IC Vaches et génisses'!A66))","v":"5575"},{"$f":"IF('[1]IC Vaches et génisses'!B66=\"\",\"\",'[1]IC Vaches et génisses'!B66)","v":"ELSA"}]
[null,null,{"$f":"IF('[1]IC Vaches et génisses'!A67=\"\",\"\",IF('[1]IC Vaches et génisses'!A67=\"Total général\",\"\",'[1]IC Vaches et génisses'!A67))","v":"5579"},{"$f":"IF('[1]IC Vaches et génisses'!B67=\"\",\"\",'[1]IC Vaches et génisses'!B67)","v":"ENJY"}]
[null,null,{"$f":"IF('[1]IC Vaches et génisses'!A68=\"\",\"\",IF('[1]IC Vaches et génisses'!A68=\"Total général\",\"\",'[1]IC Vaches et génisses'!A68))","v":"5583"},{"$f":"IF('[1]IC Vaches et génisses'!B68=\"\",\"\",'[1]IC Vaches et génisses'!B68)","v":"ELODIE"}]
[null,null,{"$f":"IF('[1]IC Vaches et génisses'!A69=\"\",\"\",IF('[1]IC Vaches et génisses'!A69=\"Total général\",\"\",'[1]IC Vaches et génisses'!A69))","v":"5588"},{"$f":"IF('[1]IC Vaches et génisses'!B69=\"\",\"\",'[1]IC Vaches et génisses'!B69)","v":"FABULEUSE"}]
[null,null,{"$f":"IF('[1]IC Vaches et génisses'!A70=\"\",\"\",IF('[1]IC Vaches et génisses'!A70=\"Total général\",\"\",'[1]IC Vaches et génisses'!A70))","v":"5914"},{"$f":"IF('[1]IC Vaches et génisses'!B70=\"\",\"\",'[1]IC Vaches et génisses'!B70)","v":"IRIS"}]
[null,null,{"$f":"IF('[1]IC Vaches et génisses'!A71=\"\",\"\",IF('[1]IC Vaches et génisses'!A71=\"Total général\",\"\",'[1]IC Vaches et génisses'!A71))","v":"5916"},{"$f":"IF('[1]IC Vaches et génisses'!B71=\"\",\"\",'[1]IC Vaches et génisses'!B71)","v":"IMAGE"}]
[null,null,{"$f":"IF('[1]IC Vaches et génisses'!A72=\"\",\"\",IF('[1]IC Vaches et génisses'!A72=\"Total général\",\"\",'[1]IC Vaches et génisses'!A72))","v":"5917"},{"$f":"IF('[1]IC Vaches et génisses'!B72=\"\",\"\",'[1]IC Vaches et génisses'!B72)","v":"ITALIE"}]
[null,null,{"$f":"IF('[1]IC Vaches et génisses'!A73=\"\",\"\",IF('[1]IC Vaches et génisses'!A73=\"Total général\",\"\",'[1]IC Vaches et génisses'!A73))","v":"5918"},{"$f":"IF('[1]IC Vaches et génisses'!B73=\"\",\"\",'[1]IC Vaches et génisses'!B73)","v":"ISIS"}]
[null,null,{"$f":"IF('[1]IC Vaches et génisses'!A74=\"\",\"\",IF('[1]IC Vaches et génisses'!A74=\"Total général\",\"\",'[1]IC Vaches et génisses'!A74))","v":"5919"},{"$f":"IF('[1]IC Vaches et génisses'!B74=\"\",\"\",'[1]IC Vaches et génisses'!B74)","v":"ISAURE"}]
[null,null,{"$f":"IF('[1]IC Vaches et génisses'!A75=\"\",\"\",IF('[1]IC Vaches et génisses'!A75=\"Total général\",\"\",'[1]IC Vaches et génisses'!A75))","v":"5920"},{"$f":"IF('[1]IC Vaches et génisses'!B75=\"\",\"\",'[1]IC Vaches et génisses'!B75)","v":"ILDA"}]
[null,null,{"$f":"IF('[1]IC Vaches et génisses'!A76=\"\",\"\",IF('[1]IC Vaches et génisses'!A76=\"Total général\",\"\",'[1]IC Vaches et génisses'!A76))","v":"5921"},{"$f":"IF('[1]IC Vaches et génisses'!B76=\"\",\"\",'[1]IC Vaches et génisses'!B76)","v":"INDIA"}]
[null,null,{"$f":"IF('[1]IC Vaches et génisses'!A77=\"\",\"\",IF('[1]IC Vaches et génisses'!A77=\"Total général\",\"\",'[1]IC Vaches et génisses'!A77))","v":"5922"},{"$f":"IF('[1]IC Vaches et génisses'!B77=\"\",\"\",'[1]IC Vaches et génisses'!B77)","v":"ICONE"}]
[null,null,{"$f":"IF('[1]IC Vaches et génisses'!A78=\"\",\"\",IF('[1]IC Vaches et génisses'!A78=\"Total général\",\"\",'[1]IC Vaches et génisses'!A78))","v":"5924"},{"$f":"IF('[1]IC Vaches et génisses'!B78=\"\",\"\",'[1]IC Vaches et génisses'!B78)","v":"INES"}]
[null,null,{"$f":"IF('[1]IC Vaches et génisses'!A79=\"\",\"\",IF('[1]IC Vaches et génisses'!A79=\"Total général\",\"\",'[1]IC Vaches et génisses'!A79))","v":"5925"},{"$f":"IF('[1]IC Vaches et génisses'!B79=\"\",\"\",'[1]IC Vaches et génisses'!B79)","v":"INDIANA"}]
[null,null,{"$f":"IF('[1]IC Vaches et génisses'!A80=\"\",\"\",IF('[1]IC Vaches et génisses'!A80=\"Total général\",\"\",'[1]IC Vaches et génisses'!A80))","v":"5927"},{"$f":"IF('[1]IC Vaches et génisses'!B80=\"\",\"\",'[1]IC Vaches et génisses'!B80)","v":"IDOLE"}]
[null,null,{"$f":"IF('[1]IC Vaches et génisses'!A81=\"\",\"\",IF('[1]IC Vaches et génisses'!A81=\"Total général\",\"\",'[1]IC Vaches et génisses'!A81))","v":"5928"},{"$f":"IF('[1]IC Vaches et génisses'!B81=\"\",\"\",'[1]IC Vaches et génisses'!B81)","v":"ILONA"}]
[null,null,{"$f":"IF('[1]IC Vaches et génisses'!A82=\"\",\"\",IF('[1]IC Vaches et génisses'!A82=\"Total général\",\"\",'[1]IC Vaches et génisses'!A82))","v":"5929"},{"$f":"IF('[1]IC Vaches et génisses'!B82=\"\",\"\",'[1]IC Vaches et génisses'!B82)","v":"IOLA"}]
[null,null,{"$f":"IF('[1]IC Vaches et génisses'!A83=\"\",\"\",IF('[1]IC Vaches et génisses'!A83=\"Total général\",\"\",'[1]IC Vaches et génisses'!A83))","v":"5930"},{"$f":"IF('[1]IC Vaches et génisses'!B83=\"\",\"\",'[1]IC Vaches et génisses'!B83)","v":"ILANA"}]
[null,null,{"$f":"IF('[1]IC Vaches et génisses'!A84=\"\",\"\",IF('[1]IC Vaches et génisses'!A84=\"Total général\",\"\",'[1]IC Vaches et génisses'!A84))","v":"5931"},{"$f":"IF('[1]IC Vaches et génisses'!B84=\"\",\"\",'[1]IC Vaches et génisses'!B84)","v":"INOVA"}]
[null,null,{"$f":"IF('[1]IC Vaches et génisses'!A85=\"\",\"\",IF('[1]IC Vaches et génisses'!A85=\"Total général\",\"\",'[1]IC Vaches et génisses'!A85))","v":"5932"},{"$f":"IF('[1]IC Vaches et génisses'!B85=\"\",\"\",'[1]IC Vaches et génisses'!B85)","v":"IDA"}]
[null,null,{"$f":"IF('[1]IC Vaches et génisses'!A86=\"\",\"\",IF('[1]IC Vaches et génisses'!A86=\"Total général\",\"\",'[1]IC Vaches et génisses'!A86))","v":"5934"},{"$f":"IF('[1]IC Vaches et génisses'!B86=\"\",\"\",'[1]IC Vaches et génisses'!B86)","v":"ISERE"}]
[null,null,{"$f":"IF('[1]IC Vaches et génisses'!A87=\"\",\"\",IF('[1]IC Vaches et génisses'!A87=\"Total général\",\"\",'[1]IC Vaches et génisses'!A87))","v":"5935"},{"$f":"IF('[1]IC Vaches et génisses'!B87=\"\",\"\",'[1]IC Vaches et génisses'!B87)","v":"INFUSION"}]
[null,null,{"$f":"IF('[1]IC Vaches et génisses'!A88=\"\",\"\",IF('[1]IC Vaches et génisses'!A88=\"Total général\",\"\",'[1]IC Vaches et génisses'!A88))","v":"5936"},{"$f":"IF('[1]IC Vaches et génisses'!B88=\"\",\"\",'[1]IC Vaches et génisses'!B88)","v":"IRINA"}]
[null,null,{"$f":"IF('[1]IC Vaches et génisses'!A89=\"\",\"\",IF('[1]IC Vaches et génisses'!A89=\"Total général\",\"\",'[1]IC Vaches et génisses'!A89))","v":"5937"},{"$f":"IF('[1]IC Vaches et génisses'!B89=\"\",\"\",'[1]IC Vaches et génisses'!B89)","v":"IMPERIALE"}]
[null,null,{"$f":"IF('[1]IC Vaches et génisses'!A90=\"\",\"\",IF('[1]IC Vaches et génisses'!A90=\"Total général\",\"\",'[1]IC Vaches et génisses'!A90))","v":"5946"},{"$f":"IF('[1]IC Vaches et génisses'!B90=\"\",\"\",'[1]IC Vaches et génisses'!B90)","v":"JARDINE"}]
[null,null,{"$f":"IF('[1]IC Vaches et génisses'!A91=\"\",\"\",IF('[1]IC Vaches et génisses'!A91=\"Total général\",\"\",'[1]IC Vaches et génisses'!A91))","v":"5948"},{"$f":"IF('[1]IC Vaches et génisses'!B91=\"\",\"\",'[1]IC Vaches et génisses'!B91)","v":"JUPETTE"}]
[null,null,{"$f":"IF('[1]IC Vaches et génisses'!A92=\"\",\"\",IF('[1]IC Vaches et génisses'!A92=\"Total général\",\"\",'[1]IC Vaches et génisses'!A92))","v":"5949"},{"$f":"IF('[1]IC Vaches et génisses'!B92=\"\",\"\",'[1]IC Vaches et génisses'!B92)","v":"JALIE"}]
[null,null,{"$f":"IF('[1]IC Vaches et génisses'!A93=\"\",\"\",IF('[1]IC Vaches et génisses'!A93=\"Total général\",\"\",'[1]IC Vaches et génisses'!A93))","v":"6456"},{"$f":"IF('[1]IC Vaches et génisses'!B93=\"\",\"\",'[1]IC Vaches et génisses'!B93)","v":"BATAVIA"}]
[null,null,{"$f":"IF('[1]IC Vaches et génisses'!A94=\"\",\"\",IF('[1]IC Vaches et génisses'!A94=\"Total général\",\"\",'[1]IC Vaches et génisses'!A94))","v":"6461"},{"$f":"IF('[1]IC Vaches et génisses'!B94=\"\",\"\",'[1]IC Vaches et génisses'!B94)","v":"BABOUCHE"}]
[null,null,{"$f":"IF('[1]IC Vaches et génisses'!A95=\"\",\"\",IF('[1]IC Vaches et génisses'!A95=\"Total général\",\"\",'[1]IC Vaches et génisses'!A95))","v":"6462"},{"$f":"IF('[1]IC Vaches et génisses'!B95=\"\",\"\",'[1]IC Vaches et génisses'!B95)","v":"BLANCHETTE"}]
[null,null,{"$f":"IF('[1]IC Vaches et génisses'!A96=\"\",\"\",IF('[1]IC Vaches et génisses'!A96=\"Total général\",\"\",'[1]IC Vaches et génisses'!A96))","v":"6665"},{"$f":"IF('[1]IC Vaches et génisses'!B96=\"\",\"\",'[1]IC Vaches et génisses'!B96)","v":"GALINETTE"}]
[null,null,{"$f":"IF('[1]IC Vaches et génisses'!A97=\"\",\"\",IF('[1]IC Vaches et génisses'!A97=\"Total général\",\"\",'[1]IC Vaches et génisses'!A97))","v":"6666"},{"$f":"IF('[1]IC Vaches et génisses'!B97=\"\",\"\",'[1]IC Vaches et génisses'!B97)","v":"GALIPETTE"}]
[null,null,{"$f":"IF('[1]IC Vaches et génisses'!A98=\"\",\"\",IF('[1]IC Vaches et génisses'!A98=\"Total général\",\"\",'[1]IC Vaches et génisses'!A98))","v":"6667"},{"$f":"IF('[1]IC Vaches et génisses'!B98=\"\",\"\",'[1]IC Vaches et génisses'!B98)","v":"GIPSY"}]
[null,null,{"$f":"IF('[1]IC Vaches et génisses'!A99=\"\",\"\",IF('[1]IC Vaches et génisses'!A99=\"Total général\",\"\",'[1]IC Vaches et génisses'!A99))","v":"6668"},{"$f":"IF('[1]IC Vaches et génisses'!B99=\"\",\"\",'[1]IC Vaches et génisses'!B99)","v":"GRACE"}]
[null,null,{"$f":"IF('[1]IC Vaches et génisses'!A100=\"\",\"\",IF('[1]IC Vaches et génisses'!A100=\"Total général\",\"\",'[1]IC Vaches et génisses'!A100))","v":"6669"},{"$f":"IF('[1]IC Vaches et génisses'!B100=\"\",\"\",'[1]IC Vaches et génisses'!B100)","v":"GAMINE"}]
[null,null,{"$f":"IF('[1]IC Vaches et génisses'!A101=\"\",\"\",IF('[1]IC Vaches et génisses'!A101=\"Total général\",\"\",'[1]IC Vaches et génisses'!A101))","v":"6670"},{"$f":"IF('[1]IC Vaches et génisses'!B101=\"\",\"\",'[1]IC Vaches et génisses'!B101)","v":"GEORGIE"}]
[null,null,{"$f":"IF('[1]IC Vaches et génisses'!A102=\"\",\"\",IF('[1]IC Vaches et génisses'!A102=\"Total général\",\"\",'[1]IC Vaches et génisses'!A102))","v":"6672"},{"$f":"IF('[1]IC Vaches et génisses'!B102=\"\",\"\",'[1]IC Vaches et génisses'!B102)","v":"GALAXIE"}]
[null,null,{"$f":"IF('[1]IC Vaches et génisses'!A103=\"\",\"\",IF('[1]IC Vaches et génisses'!A103=\"Total général\",\"\",'[1]IC Vaches et génisses'!A103))","v":"6675"},{"$f":"IF('[1]IC Vaches et génisses'!B103=\"\",\"\",'[1]IC Vaches et génisses'!B103)","v":"GLORIA"}]
[null,null,{"$f":"IF('[1]IC Vaches et génisses'!A104=\"\",\"\",IF('[1]IC Vaches et génisses'!A104=\"Total général\",\"\",'[1]IC Vaches et génisses'!A104))","v":"6676"},{"$f":"IF('[1]IC Vaches et génisses'!B104=\"\",\"\",'[1]IC Vaches et génisses'!B104)","v":"GINA"}]
[null,null,{"$f":"IF('[1]IC Vaches et génisses'!A105=\"\",\"\",IF('[1]IC Vaches et génisses'!A105=\"Total général\",\"\",'[1]IC Vaches et génisses'!A105))","v":"6677"},{"$f":"IF('[1]IC Vaches et génisses'!B105=\"\",\"\",'[1]IC Vaches et génisses'!B105)","v":"GERANIUM"}]
[null,null,{"$f":"IF('[1]IC Vaches et génisses'!A106=\"\",\"\",IF('[1]IC Vaches et génisses'!A106=\"Total général\",\"\",'[1]IC Vaches et génisses'!A106))","v":"6678"},{"$f":"IF('[1]IC Vaches et génisses'!B106=\"\",\"\",'[1]IC Vaches et génisses'!B106)","v":"GITANE"}]
[null,null,{"$f":"IF('[1]IC Vaches et génisses'!A107=\"\",\"\",IF('[1]IC Vaches et génisses'!A107=\"Total général\",\"\",'[1]IC Vaches et génisses'!A107))","v":"6680"},{"$f":"IF('[1]IC Vaches et génisses'!B107=\"\",\"\",'[1]IC Vaches et génisses'!B107)","v":"GIGI"}]
[null,null,{"$f":"IF('[1]IC Vaches et génisses'!A108=\"\",\"\",IF('[1]IC Vaches et génisses'!A108=\"Total général\",\"\",'[1]IC Vaches et génisses'!A108))","v":"6684"},{"$f":"IF('[1]IC Vaches et génisses'!B108=\"\",\"\",'[1]IC Vaches et génisses'!B108)","v":"GAZOLINE"}]
[null,null,{"$f":"IF('[1]IC Vaches et génisses'!A109=\"\",\"\",IF('[1]IC Vaches et génisses'!A109=\"Total général\",\"\",'[1]IC Vaches et génisses'!A109))","v":"6685"},{"$f":"IF('[1]IC Vaches et génisses'!B109=\"\",\"\",'[1]IC Vaches et génisses'!B109)","v":"GINETTE"}]
[null,null,{"$f":"IF('[1]IC Vaches et génisses'!A110=\"\",\"\",IF('[1]IC Vaches et génisses'!A110=\"Total général\",\"\",'[1]IC Vaches et génisses'!A110))","v":"6686"},{"$f":"IF('[1]IC Vaches et génisses'!B110=\"\",\"\",'[1]IC Vaches et génisses'!B110)","v":"GLACE"}]
[null,null,{"$f":"IF('[1]IC Vaches et génisses'!A111=\"\",\"\",IF('[1]IC Vaches et génisses'!A111=\"Total général\",\"\",'[1]IC Vaches et génisses'!A111))","v":"6687"},{"$f":"IF('[1]IC Vaches et génisses'!B111=\"\",\"\",'[1]IC Vaches et génisses'!B111)","v":"GUESS"}]
[null,null,{"$f":"IF('[1]IC Vaches et génisses'!A112=\"\",\"\",IF('[1]IC Vaches et génisses'!A112=\"Total général\",\"\",'[1]IC Vaches et génisses'!A112))","v":"6690"},{"$f":"IF('[1]IC Vaches et génisses'!B112=\"\",\"\",'[1]IC Vaches et génisses'!B112)","v":"(vide)"}]
[null,null,{"$f":"IF('[1]IC Vaches et génisses'!A113=\"\",\"\",IF('[1]IC Vaches et génisses'!A113=\"Total général\",\"\",'[1]IC Vaches et génisses'!A113))","v":"6691"},{"$f":"IF('[1]IC Vaches et génisses'!B113=\"\",\"\",'[1]IC Vaches et génisses'!B113)","v":"GIORGIA"}]
[null,null,{"$f":"IF('[1]IC Vaches et génisses'!A114=\"\",\"\",IF('[1]IC Vaches et génisses'!A114=\"Total général\",\"\",'[1]IC Vaches et génisses'!A114))","v":"6694"},{"$f":"IF('[1]IC Vaches et génisses'!B114=\"\",\"\",'[1]IC Vaches et génisses'!B114)","v":"GOMETTE"}]
[null,null,{"$f":"IF('[1]IC Vaches et génisses'!A115=\"\",\"\",IF('[1]IC Vaches et génisses'!A115=\"Total général\",\"\",'[1]IC Vaches et génisses'!A115))","v":"9693"},{"$f":"IF('[1]IC Vaches et génisses'!B115=\"\",\"\",'[1]IC Vaches et génisses'!B115)","v":"HONDA"}]
[null,null,{"$f":"IF('[1]IC Vaches et génisses'!A116=\"\",\"\",IF('[1]IC Vaches et génisses'!A116=\"Total général\",\"\",'[1]IC Vaches et génisses'!A116))","v":"9694"},{"$f":"IF('[1]IC Vaches et génisses'!B116=\"\",\"\",'[1]IC Vaches et génisses'!B116)","v":"HASTONIA"}]
[null,null,{"$f":"IF('[1]IC Vaches et génisses'!A117=\"\",\"\",IF('[1]IC Vaches et génisses'!A117=\"Total général\",\"\",'[1]IC Vaches et génisses'!A117))","v":"9695"},{"$f":"IF('[1]IC Vaches et génisses'!B117=\"\",\"\",'[1]IC Vaches et génisses'!B117)","v":"HAMELIA"}]
[null,null,{"$f":"IF('[1]IC Vaches et génisses'!A118=\"\",\"\",IF('[1]IC Vaches et génisses'!A118=\"Total général\",\"\",'[1]IC Vaches et génisses'!A118))","v":"9696"},{"$f":"IF('[1]IC Vaches et génisses'!B118=\"\",\"\",'[1]IC Vaches et génisses'!B118)","v":"HIRANA"}]
[null,null,{"$f":"IF('[1]IC Vaches et génisses'!A119=\"\",\"\",IF('[1]IC Vaches et génisses'!A119=\"Total général\",\"\",'[1]IC Vaches et génisses'!A119))","v":"9697"},{"$f":"IF('[1]IC Vaches et génisses'!B119=\"\",\"\",'[1]IC Vaches et génisses'!B119)","v":"HALPHA"}]
[null,null,{"$f":"IF('[1]IC Vaches et génisses'!A120=\"\",\"\",IF('[1]IC Vaches et génisses'!A120=\"Total général\",\"\",'[1]IC Vaches et génisses'!A120))","v":"9698"},{"$f":"IF('[1]IC Vaches et génisses'!B120=\"\",\"\",'[1]IC Vaches et génisses'!B120)","v":"HAJAX"}]
[null,null,{"$f":"IF('[1]IC Vaches et génisses'!A121=\"\",\"\",IF('[1]IC Vaches et génisses'!A121=\"Total général\",\"\",'[1]IC Vaches et génisses'!A121))","v":"9699"},{"$f":"IF('[1]IC Vaches et génisses'!B121=\"\",\"\",'[1]IC Vaches et génisses'!B121)","v":"HORTENCE"}]
[null,null,{"$f":"IF('[1]IC Vaches et génisses'!A122=\"\",\"\",IF('[1]IC Vaches et génisses'!A122=\"Total général\",\"\",'[1]IC Vaches et génisses'!A122))","v":"9700"},{"$f":"IF('[1]IC Vaches et génisses'!B122=\"\",\"\",'[1]IC Vaches et génisses'!B122)","v":"HAVANA"}]
[null,null,{"$f":"IF('[1]IC Vaches et génisses'!A123=\"\",\"\",IF('[1]IC Vaches et génisses'!A123=\"Total général\",\"\",'[1]IC Vaches et génisses'!A123))","v":"9701"},{"$f":"IF('[1]IC Vaches et génisses'!B123=\"\",\"\",'[1]IC Vaches et génisses'!B123)","v":"HIMALAYA"}]
[null,null,{"$f":"IF('[1]IC Vaches et génisses'!A124=\"\",\"\",IF('[1]IC Vaches et génisses'!A124=\"Total général\",\"\",'[1]IC Vaches et génisses'!A124))","v":"9704"},{"$f":"IF('[1]IC Vaches et génisses'!B124=\"\",\"\",'[1]IC Vaches et génisses'!B124)","v":"HIRIS"}]
[null,null,{"$f":"IF('[1]IC Vaches et génisses'!A125=\"\",\"\",IF('[1]IC Vaches et génisses'!A125=\"Total général\",\"\",'[1]IC Vaches et génisses'!A125))","v":"9705"},{"$f":"IF('[1]IC Vaches et génisses'!B125=\"\",\"\",'[1]IC Vaches et génisses'!B125)","v":"HUGNY"}]
[null,null,{"$f":"IF('[1]IC Vaches et génisses'!A126=\"\",\"\",IF('[1]IC Vaches et génisses'!A126=\"Total général\",\"\",'[1]IC Vaches et génisses'!A126))","v":"9706"},{"$f":"IF('[1]IC Vaches et génisses'!B126=\"\",\"\",'[1]IC Vaches et génisses'!B126)","v":"HADDITION"}]
[null,null,{"$f":"IF('[1]IC Vaches et génisses'!A127=\"\",\"\",IF('[1]IC Vaches et génisses'!A127=\"Total général\",\"\",'[1]IC Vaches et génisses'!A127))","v":"9707"},{"$f":"IF('[1]IC Vaches et génisses'!B127=\"\",\"\",'[1]IC Vaches et génisses'!B127)","v":"HACHETTE"}]
[null,null,{"$f":"IF('[1]IC Vaches et génisses'!A128=\"\",\"\",IF('[1]IC Vaches et génisses'!A128=\"Total général\",\"\",'[1]IC Vaches et génisses'!A128))","v":"9709"},{"$f":"IF('[1]IC Vaches et génisses'!B128=\"\",\"\",'[1]IC Vaches et génisses'!B128)","v":"HANASTASIA"}]
[null,null,{"$f":"IF('[1]IC Vaches et génisses'!A129=\"\",\"\",IF('[1]IC Vaches et génisses'!A129=\"Total général\",\"\",'[1]IC Vaches et génisses'!A129))","v":"9710"},{"$f":"IF('[1]IC Vaches et génisses'!B129=\"\",\"\",'[1]IC Vaches et génisses'!B129)","v":"HINDRA"}]
[null,null,{"$f":"IF('[1]IC Vaches et génisses'!A130=\"\",\"\",IF('[1]IC Vaches et génisses'!A130=\"Total général\",\"\",'[1]IC Vaches et génisses'!A130))","v":"9711"},{"$f":"IF('[1]IC Vaches et génisses'!B130=\"\",\"\",'[1]IC Vaches et génisses'!B130)","v":"HAUTAINE"}]
[null,null,{"$f":"IF('[1]IC Vaches et génisses'!A131=\"\",\"\",IF('[1]IC Vaches et génisses'!A131=\"Total général\",\"\",'[1]IC Vaches et génisses'!A131))","v":"9713"},{"$f":"IF('[1]IC Vaches et génisses'!B131=\"\",\"\",'[1]IC Vaches et génisses'!B131)","v":"HANEMONE"}]
[null,null,{"$f":"IF('[1]IC Vaches et génisses'!A132=\"\",\"\",IF('[1]IC Vaches et génisses'!A132=\"Total général\",\"\",'[1]IC Vaches et génisses'!A132))","v":"9714"},{"$f":"IF('[1]IC Vaches et génisses'!B132=\"\",\"\",'[1]IC Vaches et génisses'!B132)","v":"HALTESSE"}]
[null,null,{"$f":"IF('[1]IC Vaches et génisses'!A133=\"\",\"\",IF('[1]IC Vaches et génisses'!A133=\"Total général\",\"\",'[1]IC Vaches et génisses'!A133))","v":"9715"},{"$f":"IF('[1]IC Vaches et génisses'!B133=\"\",\"\",'[1]IC Vaches et génisses'!B133)","v":"HACALINE"}]
[null,null,{"$f":"IF('[1]IC Vaches et génisses'!A134=\"\",\"\",IF('[1]IC Vaches et génisses'!A134=\"Total général\",\"\",'[1]IC Vaches et génisses'!A134))","v":"9834"},{"$f":"IF('[1]IC Vaches et génisses'!B134=\"\",\"\",'[1]IC Vaches et génisses'!B134)","v":"CALINE"}]
[null,null,{"$f":"IF('[1]IC Vaches et génisses'!A135=\"\",\"\",IF('[1]IC Vaches et génisses'!A135=\"Total général\",\"\",'[1]IC Vaches et génisses'!A135))","v":"9836"},{"$f":"IF('[1]IC Vaches et génisses'!B135=\"\",\"\",'[1]IC Vaches et génisses'!B135)","v":"CABINE"}]
[null,null,{"$f":"IF('[1]IC Vaches et génisses'!A136=\"\",\"\",IF('[1]IC Vaches et génisses'!A136=\"Total général\",\"\",'[1]IC Vaches et génisses'!A136))","v":"9839"},{"$f":"IF('[1]IC Vaches et génisses'!B136=\"\",\"\",'[1]IC Vaches et génisses'!B136)","v":"CERISE"}]
[null,null,{"$f":"IF('[1]IC Vaches et génisses'!A137=\"\",\"\",IF('[1]IC Vaches et génisses'!A137=\"Total général\",\"\",'[1]IC Vaches et génisses'!A137))","v":"9840"},{"$f":"IF('[1]IC Vaches et génisses'!B137=\"\",\"\",'[1]IC Vaches et génisses'!B137)","v":"CHATAIGNE"}]
[null,null,{"$f":"IF('[1]IC Vaches et génisses'!A138=\"\",\"\",IF('[1]IC Vaches et génisses'!A138=\"Total général\",\"\",'[1]IC Vaches et génisses'!A138))","v":"9846"},{"$f":"IF('[1]IC Vaches et génisses'!B138=\"\",\"\",'[1]IC Vaches et génisses'!B138)","v":"CONCORDE"}]
[null,null,{"$f":"IF('[1]IC Vaches et génisses'!A139=\"\",\"\",IF('[1]IC Vaches et génisses'!A139=\"Total général\",\"\",'[1]IC Vaches et génisses'!A139))","v":"9852"},{"$f":"IF('[1]IC Vaches et génisses'!B139=\"\",\"\",'[1]IC Vaches et génisses'!B139)","v":"CATALANE"}]
[null,null,{"$f":"IF('[1]IC Vaches et génisses'!A140=\"\",\"\",IF('[1]IC Vaches et génisses'!A140=\"Total général\",\"\",'[1]IC Vaches et génisses'!A140))","v":"9853"},{"$f":"IF('[1]IC Vaches et génisses'!B140=\"\",\"\",'[1]IC Vaches et génisses'!B140)","v":"CLEMENTINE"}]
[null,null,{"$f":"IF('[1]IC Vaches et génisses'!A141=\"\",\"\",IF('[1]IC Vaches et génisses'!A141=\"Total général\",\"\",'[1]IC Vaches et génisses'!A141))","v":"9857"},{"$f":"IF('[1]IC Vaches et génisses'!B141=\"\",\"\",'[1]IC Vaches et génisses'!B141)","v":"DIABLESSE"}]
[null,null,{"$f":"IF('[1]IC Vaches et génisses'!A142=\"\",\"\",IF('[1]IC Vaches et génisses'!A142=\"Total général\",\"\",'[1]IC Vaches et génisses'!A142))","v":""},{"$f":"IF('[1]IC Vaches et génisses'!B142=\"\",\"\",'[1]IC Vaches et génisses'!B142)","v":""}]
[null,null,{"$f":"IF('[1]IC Vaches et génisses'!A143=\"\",\"\",IF('[1]IC Vaches et génisses'!A143=\"Total général\",\"\",'[1]IC Vaches et génisses'!A143))","v":""},{"$f":"IF('[1]IC Vaches et génisses'!B143=\"\",\"\",'[1]IC Vaches et génisses'!B143)","v":""}]
[null,null,{"$f":"IF('[1]IC Vaches et génisses'!A144=\"\",\"\",IF('[1]IC Vaches et génisses'!A144=\"Total général\",\"\",'[1]IC Vaches et génisses'!A144))","v":""},{"$f":"IF('[1]IC Vaches et génisses'!B144=\"\",\"\",'[1]IC Vaches et génisses'!B144)","v":""}]
[null,null,{"$f":"IF('[1]IC Vaches et génisses'!A145=\"\",\"\",IF('[1]IC Vaches et génisses'!A145=\"Total général\",\"\",'[1]IC Vaches et génisses'!A145))","v":""},{"$f":"IF('[1]IC Vaches et génisses'!B145=\"\",\"\",'[1]IC Vaches et génisses'!B145)","v":""}]
[null,null,{"$f":"IF('[1]IC Vaches et génisses'!A146=\"\",\"\",IF('[1]IC Vaches et génisses'!A146=\"Total général\",\"\",'[1]IC Vaches et génisses'!A146))","v":""},{"$f":"IF('[1]IC Vaches et génisses'!B146=\"\",\"\",'[1]IC Vaches et génisses'!B146)","v":""}]
[null,null,{"$f":"IF('[1]IC Vaches et génisses'!A147=\"\",\"\",IF('[1]IC Vaches et génisses'!A147=\"Total général\",\"\",'[1]IC Vaches et génisses'!A147))","v":""},{"$f":"IF('[1]IC Vaches et génisses'!B147=\"\",\"\",'[1]IC Vaches et génisses'!B147)","v":""}]
[null,null,{"$f":"IF('[1]IC Vaches et génisses'!A148=\"\",\"\",IF('[1]IC Vaches et génisses'!A148=\"Total général\",\"\",'[1]IC Vaches et génisses'!A148))","v":""},{"$f":"IF('[1]IC Vaches et génisses'!B148=\"\",\"\",'[1]IC Vaches et génisses'!B148)","v":""}]
[null,null,{"$f":"IF('[1]IC Vaches et génisses'!A149=\"\",\"\",IF('[1]IC Vaches et génisses'!A149=\"Total général\",\"\",'[1]IC Vaches et génisses'!A149))","v":""},{"$f":"IF('[1]IC Vaches et génisses'!B149=\"\",\"\",'[1]IC Vaches et génisses'!B149)","v":""}]
[null,null,{"$f":"IF('[1]IC Vaches et génisses'!A150=\"\",\"\",IF('[1]IC Vaches et génisses'!A150=\"Total général\",\"\",'[1]IC Vaches et génisses'!A150))","v":""},{"$f":"IF('[1]IC Vaches et génisses'!B150=\"\",\"\",'[1]IC Vaches et génisses'!B150)","v":""}]
[null,null,{"$f":"IF('[1]IC Vaches et génisses'!A151=\"\",\"\",IF('[1]IC Vaches et génisses'!A151=\"Total général\",\"\",'[1]IC Vaches et génisses'!A151))","v":""},{"$f":"IF('[1]IC Vaches et génisses'!B151=\"\",\"\",'[1]IC Vaches et génisses'!B151)","v":""}]
[null,null,{"$f":"IF('[1]IC Vaches et génisses'!A152=\"\",\"\",IF('[1]IC Vaches et génisses'!A152=\"Total général\",\"\",'[1]IC Vaches et génisses'!A152))","v":""},{"$f":"IF('[1]IC Vaches et génisses'!B152=\"\",\"\",'[1]IC Vaches et génisses'!B152)","v":""}]
[null,null,{"$f":"IF('[1]IC Vaches et génisses'!A153=\"\",\"\",IF('[1]IC Vaches et génisses'!A153=\"Total général\",\"\",'[1]IC Vaches et génisses'!A153))","v":""},{"$f":"IF('[1]IC Vaches et génisses'!B153=\"\",\"\",'[1]IC Vaches et génisses'!B153)","v":""}]
[null,null,{"$f":"IF('[1]IC Vaches et génisses'!A154=\"\",\"\",IF('[1]IC Vaches et génisses'!A154=\"Total général\",\"\",'[1]IC Vaches et génisses'!A154))","v":""},{"$f":"IF('[1]IC Vaches et génisses'!B154=\"\",\"\",'[1]IC Vaches et génisses'!B154)","v":""}]
[null,null,{"$f":"IF('[1]IC Vaches et génisses'!A155=\"\",\"\",IF('[1]IC Vaches et génisses'!A155=\"Total général\",\"\",'[1]IC Vaches et génisses'!A155))","v":""},{"$f":"IF('[1]IC Vaches et génisses'!B155=\"\",\"\",'[1]IC Vaches et génisses'!B155)","v":""}]
[null,null,{"$f":"IF('[1]IC Vaches et génisses'!A156=\"\",\"\",IF('[1]IC Vaches et génisses'!A156=\"Total général\",\"\",'[1]IC Vaches et génisses'!A156))","v":""},{"$f":"IF('[1]IC Vaches et génisses'!B156=\"\",\"\",'[1]IC Vaches et génisses'!B156)","v":""}]
[null,null,{"$f":"IF('[1]IC Vaches et génisses'!A157=\"\",\"\",IF('[1]IC Vaches et génisses'!A157=\"Total général\",\"\",'[1]IC Vaches et génisses'!A157))","v":""},{"$f":"IF('[1]IC Vaches et génisses'!B157=\"\",\"\",'[1]IC Vaches et génisses'!B157)","v":""}]
[null,null,{"$f":"IF('[1]IC Vaches et génisses'!A158=\"\",\"\",IF('[1]IC Vaches et génisses'!A158=\"Total général\",\"\",'[1]IC Vaches et génisses'!A158))","v":""},{"$f":"IF('[1]IC Vaches et génisses'!B158=\"\",\"\",'[1]IC Vaches et génisses'!B158)","v":""}]
[null,null,{"$f":"IF('[1]IC Vaches et génisses'!A159=\"\",\"\",IF('[1]IC Vaches et génisses'!A159=\"Total général\",\"\",'[1]IC Vaches et génisses'!A159))","v":""},{"$f":"IF('[1]IC Vaches et génisses'!B159=\"\",\"\",'[1]IC Vaches et génisses'!B159)","v":""}]
[null,null,{"$f":"IF('[1]IC Vaches et génisses'!A160=\"\",\"\",IF('[1]IC Vaches et génisses'!A160=\"Total général\",\"\",'[1]IC Vaches et génisses'!A160))","v":""},{"$f":"IF('[1]IC Vaches et génisses'!B160=\"\",\"\",'[1]IC Vaches et génisses'!B160)","v":""}]
[null,null,{"$f":"IF('[1]IC Vaches et génisses'!A161=\"\",\"\",IF('[1]IC Vaches et génisses'!A161=\"Total général\",\"\",'[1]IC Vaches et génisses'!A161))","v":""},{"$f":"IF('[1]IC Vaches et génisses'!B161=\"\",\"\",'[1]IC Vaches et génisses'!B161)","v":""}]
[null,null,{"$f":"IF('[1]IC Vaches et génisses'!A162=\"\",\"\",IF('[1]IC Vaches et génisses'!A162=\"Total général\",\"\",'[1]IC Vaches et génisses'!A162))","v":""},{"$f":"IF('[1]IC Vaches et génisses'!B162=\"\",\"\",'[1]IC Vaches et génisses'!B162)","v":""}]
[null,null,{"$f":"IF('[1]IC Vaches et génisses'!A163=\"\",\"\",IF('[1]IC Vaches et génisses'!A163=\"Total général\",\"\",'[1]IC Vaches et génisses'!A163))","v":""},{"$f":"IF('[1]IC Vaches et génisses'!B163=\"\",\"\",'[1]IC Vaches et génisses'!B163)","v":""}]
[null,null,{"$f":"IF('[1]IC Vaches et génisses'!A164=\"\",\"\",IF('[1]IC Vaches et génisses'!A164=\"Total général\",\"\",'[1]IC Vaches et génisses'!A164))","v":""},{"$f":"IF('[1]IC Vaches et génisses'!B164=\"\",\"\",'[1]IC Vaches et génisses'!B164)","v":""}]
[null,null,{"$f":"IF('[1]IC Vaches et génisses'!A165=\"\",\"\",IF('[1]IC Vaches et génisses'!A165=\"Total général\",\"\",'[1]IC Vaches et génisses'!A165))","v":""},{"$f":"IF('[1]IC Vaches et génisses'!B165=\"\",\"\",'[1]IC Vaches et génisses'!B165)","v":""}]
[null,null,{"$f":"IF('[1]IC Vaches et génisses'!A166=\"\",\"\",IF('[1]IC Vaches et génisses'!A166=\"Total général\",\"\",'[1]IC Vaches et génisses'!A166))","v":""},{"$f":"IF('[1]IC Vaches et génisses'!B166=\"\",\"\",'[1]IC Vaches et génisses'!B166)","v":""}]
[null,null,{"$f":"IF('[1]IC Vaches et génisses'!A167=\"\",\"\",IF('[1]IC Vaches et génisses'!A167=\"Total général\",\"\",'[1]IC Vaches et génisses'!A167))","v":""},{"$f":"IF('[1]IC Vaches et génisses'!B167=\"\",\"\",'[1]IC Vaches et génisses'!B167)","v":""}]
[null,null,{"$f":"IF('[1]IC Vaches et génisses'!A168=\"\",\"\",IF('[1]IC Vaches et génisses'!A168=\"Total général\",\"\",'[1]IC Vaches et génisses'!A168))","v":""},{"$f":"IF('[1]IC Vaches et génisses'!B168=\"\",\"\",'[1]IC Vaches et génisses'!B168)","v":""}]
[null,null,{"$f":"IF('[1]IC Vaches et génisses'!A169=\"\",\"\",IF('[1]IC Vaches et génisses'!A169=\"Total général\",\"\",'[1]IC Vaches et génisses'!A169))","v":""},{"$f":"IF('[1]IC Vaches et génisses'!B169=\"\",\"\",'[1]IC Vaches et génisses'!B169)","v":""}]
[null,null,{"$f":"IF('[1]IC Vaches et génisses'!A170=\"\",\"\",IF('[1]IC Vaches et génisses'!A170=\"Total général\",\"\",'[1]IC Vaches et génisses'!A170))","v":""},{"$f":"IF('[1]IC Vaches et génisses'!B170=\"\",\"\",'[1]IC Vaches et génisses'!B170)","v":""}]
[null,null,{"$f":"IF('[1]IC Vaches et génisses'!A171=\"\",\"\",IF('[1]IC Vaches et génisses'!A171=\"Total général\",\"\",'[1]IC Vaches et génisses'!A171))","v":""},{"$f":"IF('[1]IC Vaches et génisses'!B171=\"\",\"\",'[1]IC Vaches et génisses'!B171)","v":""}]
[null,null,{"$f":"IF('[1]IC Vaches et génisses'!A172=\"\",\"\",IF('[1]IC Vaches et génisses'!A172=\"Total général\",\"\",'[1]IC Vaches et génisses'!A172))","v":""},{"$f":"IF('[1]IC Vaches et génisses'!B172=\"\",\"\",'[1]IC Vaches et génisses'!B172)","v":""}]
[null,null,{"$f":"IF('[1]IC Vaches et génisses'!A173=\"\",\"\",IF('[1]IC Vaches et génisses'!A173=\"Total général\",\"\",'[1]IC Vaches et génisses'!A173))","v":""},{"$f":"IF('[1]IC Vaches et génisses'!B173=\"\",\"\",'[1]IC Vaches et génisses'!B173)","v":""}]
[null,null,{"$f":"IF('[1]IC Vaches et génisses'!A174=\"\",\"\",IF('[1]IC Vaches et génisses'!A174=\"Total général\",\"\",'[1]IC Vaches et génisses'!A174))","v":""},{"$f":"IF('[1]IC Vaches et génisses'!B174=\"\",\"\",'[1]IC Vaches et génisses'!B174)","v":""}]
[null,null,{"$f":"IF('[1]IC Vaches et génisses'!A175=\"\",\"\",IF('[1]IC Vaches et génisses'!A175=\"Total général\",\"\",'[1]IC Vaches et génisses'!A175))","v":""},{"$f":"IF('[1]IC Vaches et génisses'!B175=\"\",\"\",'[1]IC Vaches et génisses'!B175)","v":""}]
[null,null,{"$f":"IF('[1]IC Vaches et génisses'!A176=\"\",\"\",IF('[1]IC Vaches et génisses'!A176=\"Total général\",\"\",'[1]IC Vaches et génisses'!A176))","v":""},{"$f":"IF('[1]IC Vaches et génisses'!B176=\"\",\"\",'[1]IC Vaches et génisses'!B176)","v":""}]
[null,null,{"$f":"IF('[1]IC Vaches et génisses'!A177=\"\",\"\",IF('[1]IC Vaches et génisses'!A177=\"Total général\",\"\",'[1]IC Vaches et génisses'!A177))","v":""},{"$f":"IF('[1]IC Vaches et génisses'!B177=\"\",\"\",'[1]IC Vaches et génisses'!B177)","v":""}]
[null,null,{"$f":"IF('[1]IC Vaches et génisses'!A178=\"\",\"\",IF('[1]IC Vaches et génisses'!A178=\"Total général\",\"\",'[1]IC Vaches et génisses'!A178))","v":""},{"$f":"IF('[1]IC Vaches et génisses'!B178=\"\",\"\",'[1]IC Vaches et génisses'!B178)","v":""}]
[null,null,{"$f":"IF('[1]IC Vaches et génisses'!A179=\"\",\"\",IF('[1]IC Vaches et génisses'!A179=\"Total général\",\"\",'[1]IC Vaches et génisses'!A179))","v":""},{"$f":"IF('[1]IC Vaches et génisses'!B179=\"\",\"\",'[1]IC Vaches et génisses'!B179)","v":""}]
[null,null,{"$f":"IF('[1]IC Vaches et génisses'!A180=\"\",\"\",IF('[1]IC Vaches et génisses'!A180=\"Total général\",\"\",'[1]IC Vaches et génisses'!A180))","v":""},{"$f":"IF('[1]IC Vaches et génisses'!B180=\"\",\"\",'[1]IC Vaches et génisses'!B180)","v":""}]
[null,null,{"$f":"IF('[1]IC Vaches et génisses'!A181=\"\",\"\",IF('[1]IC Vaches et génisses'!A181=\"Total général\",\"\",'[1]IC Vaches et génisses'!A181))","v":""},{"$f":"IF('[1]IC Vaches et génisses'!B181=\"\",\"\",'[1]IC Vaches et génisses'!B181)","v":""}]
[null,null,{"$f":"IF('[1]IC Vaches et génisses'!A182=\"\",\"\",IF('[1]IC Vaches et génisses'!A182=\"Total général\",\"\",'[1]IC Vaches et génisses'!A182))","v":""},{"$f":"IF('[1]IC Vaches et génisses'!B182=\"\",\"\",'[1]IC Vaches et génisses'!B182)","v":""}]
[null,null,{"$f":"IF('[1]IC Vaches et génisses'!A183=\"\",\"\",IF('[1]IC Vaches et génisses'!A183=\"Total général\",\"\",'[1]IC Vaches et génisses'!A183))","v":""},{"$f":"IF('[1]IC Vaches et génisses'!B183=\"\",\"\",'[1]IC Vaches et génisses'!B183)","v":""}]
[null,null,{"$f":"IF('[1]IC Vaches et génisses'!A184=\"\",\"\",IF('[1]IC Vaches et génisses'!A184=\"Total général\",\"\",'[1]IC Vaches et génisses'!A184))","v":""},{"$f":"IF('[1]IC Vaches et génisses'!B184=\"\",\"\",'[1]IC Vaches et génisses'!B184)","v":""}]
[null,null,{"$f":"IF('[1]IC Vaches et génisses'!A185=\"\",\"\",IF('[1]IC Vaches et génisses'!A185=\"Total général\",\"\",'[1]IC Vaches et génisses'!A185))","v":""},{"$f":"IF('[1]IC Vaches et génisses'!B185=\"\",\"\",'[1]IC Vaches et génisses'!B185)","v":""}]
[null,null,{"$f":"IF('[1]IC Vaches et génisses'!A186=\"\",\"\",IF('[1]IC Vaches et génisses'!A186=\"Total général\",\"\",'[1]IC Vaches et génisses'!A186))","v":""},{"$f":"IF('[1]IC Vaches et génisses'!B186=\"\",\"\",'[1]IC Vaches et génisses'!B186)","v":""}]
[null,null,{"$f":"IF('[1]IC Vaches et génisses'!A187=\"\",\"\",IF('[1]IC Vaches et génisses'!A187=\"Total général\",\"\",'[1]IC Vaches et génisses'!A187))","v":""},{"$f":"IF('[1]IC Vaches et génisses'!B187=\"\",\"\",'[1]IC Vaches et génisses'!B187)","v":""}]
[null,null,{"$f":"IF('[1]IC Vaches et génisses'!A188=\"\",\"\",IF('[1]IC Vaches et génisses'!A188=\"Total général\",\"\",'[1]IC Vaches et génisses'!A188))","v":""},{"$f":"IF('[1]IC Vaches et génisses'!B188=\"\",\"\",'[1]IC Vaches et génisses'!B188)","v":""}]
[null,null,{"$f":"IF('[1]IC Vaches et génisses'!A189=\"\",\"\",IF('[1]IC Vaches et génisses'!A189=\"Total général\",\"\",'[1]IC Vaches et génisses'!A189))","v":""},{"$f":"IF('[1]IC Vaches et génisses'!B189=\"\",\"\",'[1]IC Vaches et génisses'!B189)","v":""}]
[null,null,{"$f":"IF('[1]IC Vaches et génisses'!A190=\"\",\"\",IF('[1]IC Vaches et génisses'!A190=\"Total général\",\"\",'[1]IC Vaches et génisses'!A190))","v":""},{"$f":"IF('[1]IC Vaches et génisses'!B190=\"\",\"\",'[1]IC Vaches et génisses'!B190)","v":""}]
[null,null,{"$f":"IF('[1]IC Vaches et génisses'!A191=\"\",\"\",IF('[1]IC Vaches et génisses'!A191=\"Total général\",\"\",'[1]IC Vaches et génisses'!A191))","v":""},{"$f":"IF('[1]IC Vaches et génisses'!B191=\"\",\"\",'[1]IC Vaches et génisses'!B191)","v":""}]
[null,null,{"$f":"IF('[1]IC Vaches et génisses'!A192=\"\",\"\",IF('[1]IC Vaches et génisses'!A192=\"Total général\",\"\",'[1]IC Vaches et génisses'!A192))","v":""},{"$f":"IF('[1]IC Vaches et génisses'!B192=\"\",\"\",'[1]IC Vaches et génisses'!B192)","v":""}]
[null,null,{"$f":"IF('[1]IC Vaches et génisses'!A193=\"\",\"\",IF('[1]IC Vaches et génisses'!A193=\"Total général\",\"\",'[1]IC Vaches et génisses'!A193))","v":""},{"$f":"IF('[1]IC Vaches et génisses'!B193=\"\",\"\",'[1]IC Vaches et génisses'!B193)","v":""}]
[null,null,{"$f":"IF('[1]IC Vaches et génisses'!A194=\"\",\"\",IF('[1]IC Vaches et génisses'!A194=\"Total général\",\"\",'[1]IC Vaches et génisses'!A194))","v":""},{"$f":"IF('[1]IC Vaches et génisses'!B194=\"\",\"\",'[1]IC Vaches et génisses'!B194)","v":""}]
[null,null,{"$f":"IF('[1]IC Vaches et génisses'!A195=\"\",\"\",IF('[1]IC Vaches et génisses'!A195=\"Total général\",\"\",'[1]IC Vaches et génisses'!A195))","v":""},{"$f":"IF('[1]IC Vaches et génisses'!B195=\"\",\"\",'[1]IC Vaches et génisses'!B195)","v":""}]
[null,null,{"$f":"IF('[1]IC Vaches et génisses'!A196=\"\",\"\",IF('[1]IC Vaches et génisses'!A196=\"Total général\",\"\",'[1]IC Vaches et génisses'!A196))","v":""},{"$f":"IF('[1]IC Vaches et génisses'!B196=\"\",\"\",'[1]IC Vaches et génisses'!B196)","v":""}]
[null,null,{"$f":"IF('[1]IC Vaches et génisses'!A197=\"\",\"\",IF('[1]IC Vaches et génisses'!A197=\"Total général\",\"\",'[1]IC Vaches et génisses'!A197))","v":""},{"$f":"IF('[1]IC Vaches et génisses'!B197=\"\",\"\",'[1]IC Vaches et génisses'!B197)","v":""}]
[null,null,{"$f":"IF('[1]IC Vaches et génisses'!A198=\"\",\"\",IF('[1]IC Vaches et génisses'!A198=\"Total général\",\"\",'[1]IC Vaches et génisses'!A198))","v":""},{"$f":"IF('[1]IC Vaches et génisses'!B198=\"\",\"\",'[1]IC Vaches et génisses'!B198)","v":""}]
[null,null,{"$f":"IF('[1]IC Vaches et génisses'!A199=\"\",\"\",IF('[1]IC Vaches et génisses'!A199=\"Total général\",\"\",'[1]IC Vaches et génisses'!A199))","v":""},{"$f":"IF('[1]IC Vaches et génisses'!B199=\"\",\"\",'[1]IC Vaches et génisses'!B199)","v":""}]
[null,null,{"$f":"IF('[1]IC Vaches et génisses'!A200=\"\",\"\",IF('[1]IC Vaches et génisses'!A200=\"Total général\",\"\",'[1]IC Vaches et génisses'!A200))","v":""},{"$f":"IF('[1]IC Vaches et génisses'!B200=\"\",\"\",'[1]IC Vaches et génisses'!B200)","v":""}]
[null,null,{"$f":"IF('[1]IC Vaches et génisses'!A201=\"\",\"\",IF('[1]IC Vaches et génisses'!A201=\"Total général\",\"\",'[1]IC Vaches et génisses'!A201))","v":""},{"$f":"IF('[1]IC Vaches et génisses'!B201=\"\",\"\",'[1]IC Vaches et génisses'!B201)","v":""}]
[null,null,{"$f":"IF('[1]IC Vaches et génisses'!A202=\"\",\"\",IF('[1]IC Vaches et génisses'!A202=\"Total général\",\"\",'[1]IC Vaches et génisses'!A202))","v":""},{"$f":"IF('[1]IC Vaches et génisses'!B202=\"\",\"\",'[1]IC Vaches et génisses'!B202)","v":""}]
[null,null,{"$f":"IF('[1]IC Vaches et génisses'!A203=\"\",\"\",IF('[1]IC Vaches et génisses'!A203=\"Total général\",\"\",'[1]IC Vaches et génisses'!A203))","v":""},{"$f":"IF('[1]IC Vaches et génisses'!B203=\"\",\"\",'[1]IC Vaches et génisses'!B203)","v":""}]
[null,null,{"$f":"IF('[1]IC Vaches et génisses'!A204=\"\",\"\",IF('[1]IC Vaches et génisses'!A204=\"Total général\",\"\",'[1]IC Vaches et génisses'!A204))","v":""},{"$f":"IF('[1]IC Vaches et génisses'!B204=\"\",\"\",'[1]IC Vaches et génisses'!B204)","v":""}]
[null,null,{"$f":"IF('[1]IC Vaches et génisses'!A205=\"\",\"\",IF('[1]IC Vaches et génisses'!A205=\"Total général\",\"\",'[1]IC Vaches et génisses'!A205))","v":""},{"$f":"IF('[1]IC Vaches et génisses'!B205=\"\",\"\",'[1]IC Vaches et génisses'!B205)","v":""}]
[null,null,{"$f":"IF('[1]IC Vaches et génisses'!A206=\"\",\"\",IF('[1]IC Vaches et génisses'!A206=\"Total général\",\"\",'[1]IC Vaches et génisses'!A206))","v":""},{"$f":"IF('[1]IC Vaches et génisses'!B206=\"\",\"\",'[1]IC Vaches et génisses'!B206)","v":""}]
[null,null,{"$f":"IF('[1]IC Vaches et génisses'!A207=\"\",\"\",IF('[1]IC Vaches et génisses'!A207=\"Total général\",\"\",'[1]IC Vaches et génisses'!A207))","v":""},{"$f":"IF('[1]IC Vaches et génisses'!B207=\"\",\"\",'[1]IC Vaches et génisses'!B207)","v":""}]
[null,null,{"$f":"IF('[1]IC Vaches et génisses'!A208=\"\",\"\",IF('[1]IC Vaches et génisses'!A208=\"Total général\",\"\",'[1]IC Vaches et génisses'!A208))","v":""},{"$f":"IF('[1]IC Vaches et génisses'!B208=\"\",\"\",'[1]IC Vaches et génisses'!B208)","v":""}]
[null,null,{"$f":"IF('[1]IC Vaches et génisses'!A209=\"\",\"\",IF('[1]IC Vaches et génisses'!A209=\"Total général\",\"\",'[1]IC Vaches et génisses'!A209))","v":""},{"$f":"IF('[1]IC Vaches et génisses'!B209=\"\",\"\",'[1]IC Vaches et génisses'!B209)","v":""}]
[null,null,{"$f":"IF('[1]IC Vaches et génisses'!A210=\"\",\"\",IF('[1]IC Vaches et génisses'!A210=\"Total général\",\"\",'[1]IC Vaches et génisses'!A210))","v":""},{"$f":"IF('[1]IC Vaches et génisses'!B210=\"\",\"\",'[1]IC Vaches et génisses'!B210)","v":""}]
[null,null,{"$f":"IF('[1]IC Vaches et génisses'!A211=\"\",\"\",IF('[1]IC Vaches et génisses'!A211=\"Total général\",\"\",'[1]IC Vaches et génisses'!A211))","v":""},{"$f":"IF('[1]IC Vaches et génisses'!B211=\"\",\"\",'[1]IC Vaches et génisses'!B211)","v":""}]
[null,null,{"$f":"IF('[1]IC Vaches et génisses'!A212=\"\",\"\",IF('[1]IC Vaches et génisses'!A212=\"Total général\",\"\",'[1]IC Vaches et génisses'!A212))","v":""},{"$f":"IF('[1]IC Vaches et génisses'!B212=\"\",\"\",'[1]IC Vaches et génisses'!B212)","v":""}]
[null,null,{"$f":"IF('[1]IC Vaches et génisses'!A213=\"\",\"\",IF('[1]IC Vaches et génisses'!A213=\"Total général\",\"\",'[1]IC Vaches et génisses'!A213))","v":""},{"$f":"IF('[1]IC Vaches et génisses'!B213=\"\",\"\",'[1]IC Vaches et génisses'!B213)","v":""}]
[null,null,{"$f":"IF('[1]IC Vaches et génisses'!A214=\"\",\"\",IF('[1]IC Vaches et génisses'!A214=\"Total général\",\"\",'[1]IC Vaches et génisses'!A214))","v":""},{"$f":"IF('[1]IC Vaches et génisses'!B214=\"\",\"\",'[1]IC Vaches et génisses'!B214)","v":""}]
[null,null,{"$f":"IF('[1]IC Vaches et génisses'!A215=\"\",\"\",IF('[1]IC Vaches et génisses'!A215=\"Total général\",\"\",'[1]IC Vaches et génisses'!A215))","v":""},{"$f":"IF('[1]IC Vaches et génisses'!B215=\"\",\"\",'[1]IC Vaches et génisses'!B215)","v":""}]
[null,null,{"$f":"IF('[1]IC Vaches et génisses'!A216=\"\",\"\",IF('[1]IC Vaches et génisses'!A216=\"Total général\",\"\",'[1]IC Vaches et génisses'!A216))","v":""},{"$f":"IF('[1]IC Vaches et génisses'!B216=\"\",\"\",'[1]IC Vaches et génisses'!B216)","v":""}]
[null,null,{"$f":"IF('[1]IC Vaches et génisses'!A217=\"\",\"\",IF('[1]IC Vaches et génisses'!A217=\"Total général\",\"\",'[1]IC Vaches et génisses'!A217))","v":""},{"$f":"IF('[1]IC Vaches et génisses'!B217=\"\",\"\",'[1]IC Vaches et génisses'!B217)","v":""}]
[null,null,{"$f":"IF('[1]IC Vaches et génisses'!A218=\"\",\"\",IF('[1]IC Vaches et génisses'!A218=\"Total général\",\"\",'[1]IC Vaches et génisses'!A218))","v":""},{"$f":"IF('[1]IC Vaches et génisses'!B218=\"\",\"\",'[1]IC Vaches et génisses'!B218)","v":""}]
[null,null,{"$f":"IF('[1]IC Vaches et génisses'!A219=\"\",\"\",IF('[1]IC Vaches et génisses'!A219=\"Total général\",\"\",'[1]IC Vaches et génisses'!A219))","v":""},{"$f":"IF('[1]IC Vaches et génisses'!B219=\"\",\"\",'[1]IC Vaches et génisses'!B219)","v":""}]
[null,null,{"$f":"IF('[1]IC Vaches et génisses'!A220=\"\",\"\",IF('[1]IC Vaches et génisses'!A220=\"Total général\",\"\",'[1]IC Vaches et génisses'!A220))","v":""},{"$f":"IF('[1]IC Vaches et génisses'!B220=\"\",\"\",'[1]IC Vaches et génisses'!B220)","v":""}]
[null,null,{"$f":"IF('[1]IC Vaches et génisses'!A221=\"\",\"\",IF('[1]IC Vaches et génisses'!A221=\"Total général\",\"\",'[1]IC Vaches et génisses'!A221))","v":""},{"$f":"IF('[1]IC Vaches et génisses'!B221=\"\",\"\",'[1]IC Vaches et génisses'!B221)","v":""}]
[null,null,{"$f":"IF('[1]IC Vaches et génisses'!A222=\"\",\"\",IF('[1]IC Vaches et génisses'!A222=\"Total général\",\"\",'[1]IC Vaches et génisses'!A222))","v":""},{"$f":"IF('[1]IC Vaches et génisses'!B222=\"\",\"\",'[1]IC Vaches et génisses'!B222)","v":""}]
[null,null,{"$f":"IF('[1]IC Vaches et génisses'!A223=\"\",\"\",IF('[1]IC Vaches et génisses'!A223=\"Total général\",\"\",'[1]IC Vaches et génisses'!A223))","v":""},{"$f":"IF('[1]IC Vaches et génisses'!B223=\"\",\"\",'[1]IC Vaches et génisses'!B223)","v":""}]
[null,null,{"$f":"IF('[1]IC Vaches et génisses'!A224=\"\",\"\",IF('[1]IC Vaches et génisses'!A224=\"Total général\",\"\",'[1]IC Vaches et génisses'!A224))","v":""},{"$f":"IF('[1]IC Vaches et génisses'!B224=\"\",\"\",'[1]IC Vaches et génisses'!B224)","v":""}]
[null,null,{"$f":"IF('[1]IC Vaches et génisses'!A225=\"\",\"\",IF('[1]IC Vaches et génisses'!A225=\"Total général\",\"\",'[1]IC Vaches et génisses'!A225))","v":""},{"$f":"IF('[1]IC Vaches et génisses'!B225=\"\",\"\",'[1]IC Vaches et génisses'!B225)","v":""}]
[null,null,{"$f":"IF('[1]IC Vaches et génisses'!A226=\"\",\"\",IF('[1]IC Vaches et génisses'!A226=\"Total général\",\"\",'[1]IC Vaches et génisses'!A226))","v":""},{"$f":"IF('[1]IC Vaches et génisses'!B226=\"\",\"\",'[1]IC Vaches et génisses'!B226)","v":""}]
[null,null,{"$f":"IF('[1]IC Vaches et génisses'!A227=\"\",\"\",IF('[1]IC Vaches et génisses'!A227=\"Total général\",\"\",'[1]IC Vaches et génisses'!A227))","v":""},{"$f":"IF('[1]IC Vaches et génisses'!B227=\"\",\"\",'[1]IC Vaches et génisses'!B227)","v":""}]
[null,null,{"$f":"IF('[1]IC Vaches et génisses'!A228=\"\",\"\",IF('[1]IC Vaches et génisses'!A228=\"Total général\",\"\",'[1]IC Vaches et génisses'!A228))","v":""},{"$f":"IF('[1]IC Vaches et génisses'!B228=\"\",\"\",'[1]IC Vaches et génisses'!B228)","v":""}]
[null,null,{"$f":"IF('[1]IC Vaches et génisses'!A229=\"\",\"\",IF('[1]IC Vaches et génisses'!A229=\"Total général\",\"\",'[1]IC Vaches et génisses'!A229))","v":""},{"$f":"IF('[1]IC Vaches et génisses'!B229=\"\",\"\",'[1]IC Vaches et génisses'!B229)","v":""}]
[null,null,{"$f":"IF('[1]IC Vaches et génisses'!A230=\"\",\"\",IF('[1]IC Vaches et génisses'!A230=\"Total général\",\"\",'[1]IC Vaches et génisses'!A230))","v":""},{"$f":"IF('[1]IC Vaches et génisses'!B230=\"\",\"\",'[1]IC Vaches et génisses'!B230)","v":""}]
[null,null,{"$f":"IF('[1]IC Vaches et génisses'!A231=\"\",\"\",IF('[1]IC Vaches et génisses'!A231=\"Total général\",\"\",'[1]IC Vaches et génisses'!A231))","v":""},{"$f":"IF('[1]IC Vaches et génisses'!B231=\"\",\"\",'[1]IC Vaches et génisses'!B231)","v":""}]
[null,null,{"$f":"IF('[1]IC Vaches et génisses'!A232=\"\",\"\",IF('[1]IC Vaches et génisses'!A232=\"Total général\",\"\",'[1]IC Vaches et génisses'!A232))","v":""},{"$f":"IF('[1]IC Vaches et génisses'!B232=\"\",\"\",'[1]IC Vaches et génisses'!B232)","v":""}]
[null,null,{"$f":"IF('[1]IC Vaches et génisses'!A233=\"\",\"\",IF('[1]IC Vaches et génisses'!A233=\"Total général\",\"\",'[1]IC Vaches et génisses'!A233))","v":""},{"$f":"IF('[1]IC Vaches et génisses'!B233=\"\",\"\",'[1]IC Vaches et génisses'!B233)","v":""}]
[null,null,{"$f":"IF('[1]IC Vaches et génisses'!A234=\"\",\"\",IF('[1]IC Vaches et génisses'!A234=\"Total général\",\"\",'[1]IC Vaches et génisses'!A234))","v":""},{"$f":"IF('[1]IC Vaches et génisses'!B234=\"\",\"\",'[1]IC Vaches et génisses'!B234)","v":""}]
[null,null,{"$f":"IF('[1]IC Vaches et génisses'!A235=\"\",\"\",IF('[1]IC Vaches et génisses'!A235=\"Total général\",\"\",'[1]IC Vaches et génisses'!A235))","v":""},{"$f":"IF('[1]IC Vaches et génisses'!B235=\"\",\"\",'[1]IC Vaches et génisses'!B235)","v":""}]
[null,null,{"$f":"IF('[1]IC Vaches et génisses'!A236=\"\",\"\",IF('[1]IC Vaches et génisses'!A236=\"Total général\",\"\",'[1]IC Vaches et génisses'!A236))","v":""},{"$f":"IF('[1]IC Vaches et génisses'!B236=\"\",\"\",'[1]IC Vaches et génisses'!B236)","v":""}]
[null,null,{"$f":"IF('[1]IC Vaches et génisses'!A237=\"\",\"\",IF('[1]IC Vaches et génisses'!A237=\"Total général\",\"\",'[1]IC Vaches et génisses'!A237))","v":""},{"$f":"IF('[1]IC Vaches et génisses'!B237=\"\",\"\",'[1]IC Vaches et génisses'!B237)","v":""}]
[null,null,{"$f":"IF('[1]IC Vaches et génisses'!A238=\"\",\"\",IF('[1]IC Vaches et génisses'!A238=\"Total général\",\"\",'[1]IC Vaches et génisses'!A238))","v":""},{"$f":"IF('[1]IC Vaches et génisses'!B238=\"\",\"\",'[1]IC Vaches et génisses'!B238)","v":""}]
[null,null,{"$f":"IF('[1]IC Vaches et génisses'!A239=\"\",\"\",IF('[1]IC Vaches et génisses'!A239=\"Total général\",\"\",'[1]IC Vaches et génisses'!A239))","v":""},{"$f":"IF('[1]IC Vaches et génisses'!B239=\"\",\"\",'[1]IC Vaches et génisses'!B239)","v":""}]
[null,null,{"$f":"IF('[1]IC Vaches et génisses'!A240=\"\",\"\",IF('[1]IC Vaches et génisses'!A240=\"Total général\",\"\",'[1]IC Vaches et génisses'!A240))","v":""},{"$f":"IF('[1]IC Vaches et génisses'!B240=\"\",\"\",'[1]IC Vaches et génisses'!B240)","v":""}]
[null,null,{"$f":"IF('[1]IC Vaches et génisses'!A241=\"\",\"\",IF('[1]IC Vaches et génisses'!A241=\"Total général\",\"\",'[1]IC Vaches et génisses'!A241))","v":""},{"$f":"IF('[1]IC Vaches et génisses'!B241=\"\",\"\",'[1]IC Vaches et génisses'!B241)","v":""}]
[null,null,{"$f":"IF('[1]IC Vaches et génisses'!A242=\"\",\"\",IF('[1]IC Vaches et génisses'!A242=\"Total général\",\"\",'[1]IC Vaches et génisses'!A242))","v":""},{"$f":"IF('[1]IC Vaches et génisses'!B242=\"\",\"\",'[1]IC Vaches et génisses'!B242)","v":""}]
[null,null,{"$f":"IF('[1]IC Vaches et génisses'!A243=\"\",\"\",IF('[1]IC Vaches et génisses'!A243=\"Total général\",\"\",'[1]IC Vaches et génisses'!A243))","v":""},{"$f":"IF('[1]IC Vaches et génisses'!B243=\"\",\"\",'[1]IC Vaches et génisses'!B243)","v":""}]
[null,null,{"$f":"IF('[1]IC Vaches et génisses'!A244=\"\",\"\",IF('[1]IC Vaches et génisses'!A244=\"Total général\",\"\",'[1]IC Vaches et génisses'!A244))","v":""},{"$f":"IF('[1]IC Vaches et génisses'!B244=\"\",\"\",'[1]IC Vaches et génisses'!B244)","v":""}]
[null,null,{"$f":"IF('[1]IC Vaches et génisses'!A245=\"\",\"\",IF('[1]IC Vaches et génisses'!A245=\"Total général\",\"\",'[1]IC Vaches et génisses'!A245))","v":""},{"$f":"IF('[1]IC Vaches et génisses'!B245=\"\",\"\",'[1]IC Vaches et génisses'!B245)","v":""}]
[null,null,{"$f":"IF('[1]IC Vaches et génisses'!A246=\"\",\"\",IF('[1]IC Vaches et génisses'!A246=\"Total général\",\"\",'[1]IC Vaches et génisses'!A246))","v":""},{"$f":"IF('[1]IC Vaches et génisses'!B246=\"\",\"\",'[1]IC Vaches et génisses'!B246)","v":""}]
[null,null,{"$f":"IF('[1]IC Vaches et génisses'!A247=\"\",\"\",IF('[1]IC Vaches et génisses'!A247=\"Total général\",\"\",'[1]IC Vaches et génisses'!A247))","v":""},{"$f":"IF('[1]IC Vaches et génisses'!B247=\"\",\"\",'[1]IC Vaches et génisses'!B247)","v":""}]
[null,null,{"$f":"IF('[1]IC Vaches et génisses'!A248=\"\",\"\",IF('[1]IC Vaches et génisses'!A248=\"Total général\",\"\",'[1]IC Vaches et génisses'!A248))","v":""},{"$f":"IF('[1]IC Vaches et génisses'!B248=\"\",\"\",'[1]IC Vaches et génisses'!B248)","v":""}]
[null,null,{"$f":"IF('[1]IC Vaches et génisses'!A249=\"\",\"\",IF('[1]IC Vaches et génisses'!A249=\"Total général\",\"\",'[1]IC Vaches et génisses'!A249))","v":""},{"$f":"IF('[1]IC Vaches et génisses'!B249=\"\",\"\",'[1]IC Vaches et génisses'!B249)","v":""}]
[null,null,{"$f":"IF('[1]IC Vaches et génisses'!A250=\"\",\"\",IF('[1]IC Vaches et génisses'!A250=\"Total général\",\"\",'[1]IC Vaches et génisses'!A250))","v":""},{"$f":"IF('[1]IC Vaches et génisses'!B250=\"\",\"\",'[1]IC Vaches et génisses'!B250)","v":""}]
[null,null,{"$f":"IF('[1]IC Vaches et génisses'!A251=\"\",\"\",IF('[1]IC Vaches et génisses'!A251=\"Total général\",\"\",'[1]IC Vaches et génisses'!A251))","v":""},{"$f":"IF('[1]IC Vaches et génisses'!B251=\"\",\"\",'[1]IC Vaches et génisses'!B251)","v":""}]
[null,null,{"$f":"IF('[1]IC Vaches et génisses'!A252=\"\",\"\",IF('[1]IC Vaches et génisses'!A252=\"Total général\",\"\",'[1]IC Vaches et génisses'!A252))","v":""},{"$f":"IF('[1]IC Vaches et génisses'!B252=\"\",\"\",'[1]IC Vaches et génisses'!B252)","v":""}]
[null,null,{"$f":"IF('[1]IC Vaches et génisses'!A253=\"\",\"\",IF('[1]IC Vaches et génisses'!A253=\"Total général\",\"\",'[1]IC Vaches et génisses'!A253))","v":""},{"$f":"IF('[1]IC Vaches et génisses'!B253=\"\",\"\",'[1]IC Vaches et génisses'!B253)","v":""}]
[null,null,{"$f":"IF('[1]IC Vaches et génisses'!A254=\"\",\"\",IF('[1]IC Vaches et génisses'!A254=\"Total général\",\"\",'[1]IC Vaches et génisses'!A254))","v":""},{"$f":"IF('[1]IC Vaches et génisses'!B254=\"\",\"\",'[1]IC Vaches et génisses'!B254)","v":""}]
[null,null,{"$f":"IF('[1]IC Vaches et génisses'!A255=\"\",\"\",IF('[1]IC Vaches et génisses'!A255=\"Total général\",\"\",'[1]IC Vaches et génisses'!A255))","v":""},{"$f":"IF('[1]IC Vaches et génisses'!B255=\"\",\"\",'[1]IC Vaches et génisses'!B255)","v":""}]
[null,null,{"$f":"IF('[1]IC Vaches et génisses'!A256=\"\",\"\",IF('[1]IC Vaches et génisses'!A256=\"Total général\",\"\",'[1]IC Vaches et génisses'!A256))","v":""},{"$f":"IF('[1]IC Vaches et génisses'!B256=\"\",\"\",'[1]IC Vaches et génisses'!B256)","v":""}]
[null,null,{"$f":"IF('[1]IC Vaches et génisses'!A257=\"\",\"\",IF('[1]IC Vaches et génisses'!A257=\"Total général\",\"\",'[1]IC Vaches et génisses'!A257))","v":""},{"$f":"IF('[1]IC Vaches et génisses'!B257=\"\",\"\",'[1]IC Vaches et génisses'!B257)","v":""}]
[null,null,{"$f":"IF('[1]IC Vaches et génisses'!A258=\"\",\"\",IF('[1]IC Vaches et génisses'!A258=\"Total général\",\"\",'[1]IC Vaches et génisses'!A258))","v":""},{"$f":"IF('[1]IC Vaches et génisses'!B258=\"\",\"\",'[1]IC Vaches et génisses'!B258)","v":""}]
[null,null,{"$f":"IF('[1]IC Vaches et génisses'!A259=\"\",\"\",IF('[1]IC Vaches et génisses'!A259=\"Total général\",\"\",'[1]IC Vaches et génisses'!A259))","v":""},{"$f":"IF('[1]IC Vaches et génisses'!B259=\"\",\"\",'[1]IC Vaches et génisses'!B259)","v":""}]
[null,null,{"$f":"IF('[1]IC Vaches et génisses'!A260=\"\",\"\",IF('[1]IC Vaches et génisses'!A260=\"Total général\",\"\",'[1]IC Vaches et génisses'!A260))","v":""},{"$f":"IF('[1]IC Vaches et génisses'!B260=\"\",\"\",'[1]IC Vaches et génisses'!B260)","v":""}]
[null,null,{"$f":"IF('[1]IC Vaches et génisses'!A261=\"\",\"\",IF('[1]IC Vaches et génisses'!A261=\"Total général\",\"\",'[1]IC Vaches et génisses'!A261))","v":""},{"$f":"IF('[1]IC Vaches et génisses'!B261=\"\",\"\",'[1]IC Vaches et génisses'!B261)","v":""}]
[null,null,{"$f":"IF('[1]IC Vaches et génisses'!A262=\"\",\"\",IF('[1]IC Vaches et génisses'!A262=\"Total général\",\"\",'[1]IC Vaches et génisses'!A262))","v":""},{"$f":"IF('[1]IC Vaches et génisses'!B262=\"\",\"\",'[1]IC Vaches et génisses'!B262)","v":""}]
[null,null,{"$f":"IF('[1]IC Vaches et génisses'!A263=\"\",\"\",IF('[1]IC Vaches et génisses'!A263=\"Total général\",\"\",'[1]IC Vaches et génisses'!A263))","v":""},{"$f":"IF('[1]IC Vaches et génisses'!B263=\"\",\"\",'[1]IC Vaches et génisses'!B263)","v":""}]
[null,null,{"$f":"IF('[1]IC Vaches et génisses'!A264=\"\",\"\",IF('[1]IC Vaches et génisses'!A264=\"Total général\",\"\",'[1]IC Vaches et génisses'!A264))","v":""},{"$f":"IF('[1]IC Vaches et génisses'!B264=\"\",\"\",'[1]IC Vaches et génisses'!B264)","v":""}]
[null,null,{"$f":"IF('[1]IC Vaches et génisses'!A265=\"\",\"\",IF('[1]IC Vaches et génisses'!A265=\"Total général\",\"\",'[1]IC Vaches et génisses'!A265))","v":""},{"$f":"IF('[1]IC Vaches et génisses'!B265=\"\",\"\",'[1]IC Vaches et génisses'!B265)","v":""}]
[null,null,{"$f":"IF('[1]IC Vaches et génisses'!A266=\"\",\"\",IF('[1]IC Vaches et génisses'!A266=\"Total général\",\"\",'[1]IC Vaches et génisses'!A266))","v":""},{"$f":"IF('[1]IC Vaches et génisses'!B266=\"\",\"\",'[1]IC Vaches et génisses'!B266)","v":""}]
[null,null,{"$f":"IF('[1]IC Vaches et génisses'!A267=\"\",\"\",IF('[1]IC Vaches et génisses'!A267=\"Total général\",\"\",'[1]IC Vaches et génisses'!A267))","v":""},{"$f":"IF('[1]IC Vaches et génisses'!B267=\"\",\"\",'[1]IC Vaches et génisses'!B267)","v":""}]
[null,null,{"$f":"IF('[1]IC Vaches et génisses'!A268=\"\",\"\",IF('[1]IC Vaches et génisses'!A268=\"Total général\",\"\",'[1]IC Vaches et génisses'!A268))","v":""},{"$f":"IF('[1]IC Vaches et génisses'!B268=\"\",\"\",'[1]IC Vaches et génisses'!B268)","v":""}]
[null,null,{"$f":"IF('[1]IC Vaches et génisses'!A269=\"\",\"\",IF('[1]IC Vaches et génisses'!A269=\"Total général\",\"\",'[1]IC Vaches et génisses'!A269))","v":""},{"$f":"IF('[1]IC Vaches et génisses'!B269=\"\",\"\",'[1]IC Vaches et génisses'!B269)","v":""}]
[null,null,{"$f":"IF('[1]IC Vaches et génisses'!A270=\"\",\"\",IF('[1]IC Vaches et génisses'!A270=\"Total général\",\"\",'[1]IC Vaches et génisses'!A270))","v":""},{"$f":"IF('[1]IC Vaches et génisses'!B270=\"\",\"\",'[1]IC Vaches et génisses'!B270)","v":""}]
[null,null,{"$f":"IF('[1]IC Vaches et génisses'!A271=\"\",\"\",IF('[1]IC Vaches et génisses'!A271=\"Total général\",\"\",'[1]IC Vaches et génisses'!A271))","v":""},{"$f":"IF('[1]IC Vaches et génisses'!B271=\"\",\"\",'[1]IC Vaches et génisses'!B271)","v":""}]
[null,null,{"$f":"IF('[1]IC Vaches et génisses'!A272=\"\",\"\",IF('[1]IC Vaches et génisses'!A272=\"Total général\",\"\",'[1]IC Vaches et génisses'!A272))","v":""},{"$f":"IF('[1]IC Vaches et génisses'!B272=\"\",\"\",'[1]IC Vaches et génisses'!B272)","v":""}]
[null,null,{"$f":"IF('[1]IC Vaches et génisses'!A273=\"\",\"\",IF('[1]IC Vaches et génisses'!A273=\"Total général\",\"\",'[1]IC Vaches et génisses'!A273))","v":""},{"$f":"IF('[1]IC Vaches et génisses'!B273=\"\",\"\",'[1]IC Vaches et génisses'!B273)","v":""}]
[null,null,{"$f":"IF('[1]IC Vaches et génisses'!A274=\"\",\"\",IF('[1]IC Vaches et génisses'!A274=\"Total général\",\"\",'[1]IC Vaches et génisses'!A274))","v":""},{"$f":"IF('[1]IC Vaches et génisses'!B274=\"\",\"\",'[1]IC Vaches et génisses'!B274)","v":""}]
[null,null,{"$f":"IF('[1]IC Vaches et génisses'!A275=\"\",\"\",IF('[1]IC Vaches et génisses'!A275=\"Total général\",\"\",'[1]IC Vaches et génisses'!A275))","v":""},{"$f":"IF('[1]IC Vaches et génisses'!B275=\"\",\"\",'[1]IC Vaches et génisses'!B275)","v":""}]
[null,null,{"$f":"IF('[1]IC Vaches et génisses'!A276=\"\",\"\",IF('[1]IC Vaches et génisses'!A276=\"Total général\",\"\",'[1]IC Vaches et génisses'!A276))","v":""},{"$f":"IF('[1]IC Vaches et génisses'!B276=\"\",\"\",'[1]IC Vaches et génisses'!B276)","v":""}]
[null,null,{"$f":"IF('[1]IC Vaches et génisses'!A277=\"\",\"\",IF('[1]IC Vaches et génisses'!A277=\"Total général\",\"\",'[1]IC Vaches et génisses'!A277))","v":""},{"$f":"IF('[1]IC Vaches et génisses'!B277=\"\",\"\",'[1]IC Vaches et génisses'!B277)","v":""}]
[null,null,{"$f":"IF('[1]IC Vaches et génisses'!A278=\"\",\"\",IF('[1]IC Vaches et génisses'!A278=\"Total général\",\"\",'[1]IC Vaches et génisses'!A278))","v":""},{"$f":"IF('[1]IC Vaches et génisses'!B278=\"\",\"\",'[1]IC Vaches et génisses'!B278)","v":""}]
[null,null,{"$f":"IF('[1]IC Vaches et génisses'!A279=\"\",\"\",IF('[1]IC Vaches et génisses'!A279=\"Total général\",\"\",'[1]IC Vaches et génisses'!A279))","v":""},{"$f":"IF('[1]IC Vaches et génisses'!B279=\"\",\"\",'[1]IC Vaches et génisses'!B279)","v":""}]
[null,null,{"$f":"IF('[1]IC Vaches et génisses'!A280=\"\",\"\",IF('[1]IC Vaches et génisses'!A280=\"Total général\",\"\",'[1]IC Vaches et génisses'!A280))","v":""},{"$f":"IF('[1]IC Vaches et génisses'!B280=\"\",\"\",'[1]IC Vaches et génisses'!B280)","v":""}]
[null,null,{"$f":"IF('[1]IC Vaches et génisses'!A281=\"\",\"\",IF('[1]IC Vaches et génisses'!A281=\"Total général\",\"\",'[1]IC Vaches et génisses'!A281))","v":""},{"$f":"IF('[1]IC Vaches et génisses'!B281=\"\",\"\",'[1]IC Vaches et génisses'!B281)","v":""}]
[null,null,{"$f":"IF('[1]IC Vaches et génisses'!A282=\"\",\"\",IF('[1]IC Vaches et génisses'!A282=\"Total général\",\"\",'[1]IC Vaches et génisses'!A282))","v":""},{"$f":"IF('[1]IC Vaches et génisses'!B282=\"\",\"\",'[1]IC Vaches et génisses'!B282)","v":""}]
[null,null,{"$f":"IF('[1]IC Vaches et génisses'!A283=\"\",\"\",IF('[1]IC Vaches et génisses'!A283=\"Total général\",\"\",'[1]IC Vaches et génisses'!A283))","v":""},{"$f":"IF('[1]IC Vaches et génisses'!B283=\"\",\"\",'[1]IC Vaches et génisses'!B283)","v":""}]
[null,null,{"$f":"IF('[1]IC Vaches et génisses'!A284=\"\",\"\",IF('[1]IC Vaches et génisses'!A284=\"Total général\",\"\",'[1]IC Vaches et génisses'!A284))","v":""},{"$f":"IF('[1]IC Vaches et génisses'!B284=\"\",\"\",'[1]IC Vaches et génisses'!B284)","v":""}]
[null,null,{"$f":"IF('[1]IC Vaches et génisses'!A285=\"\",\"\",IF('[1]IC Vaches et génisses'!A285=\"Total général\",\"\",'[1]IC Vaches et génisses'!A285))","v":""},{"$f":"IF('[1]IC Vaches et génisses'!B285=\"\",\"\",'[1]IC Vaches et génisses'!B285)","v":""}]
[null,null,{"$f":"IF('[1]IC Vaches et génisses'!A286=\"\",\"\",IF('[1]IC Vaches et génisses'!A286=\"Total général\",\"\",'[1]IC Vaches et génisses'!A286))","v":""},{"$f":"IF('[1]IC Vaches et génisses'!B286=\"\",\"\",'[1]IC Vaches et génisses'!B286)","v":""}]
[null,null,{"$f":"IF('[1]IC Vaches et génisses'!A287=\"\",\"\",IF('[1]IC Vaches et génisses'!A287=\"Total général\",\"\",'[1]IC Vaches et génisses'!A287))","v":""},{"$f":"IF('[1]IC Vaches et génisses'!B287=\"\",\"\",'[1]IC Vaches et génisses'!B287)","v":""}]
[null,null,{"$f":"IF('[1]IC Vaches et génisses'!A288=\"\",\"\",IF('[1]IC Vaches et génisses'!A288=\"Total général\",\"\",'[1]IC Vaches et génisses'!A288))","v":""},{"$f":"IF('[1]IC Vaches et génisses'!B288=\"\",\"\",'[1]IC Vaches et génisses'!B288)","v":""}]
[null,null,{"$f":"IF('[1]IC Vaches et génisses'!A289=\"\",\"\",IF('[1]IC Vaches et génisses'!A289=\"Total général\",\"\",'[1]IC Vaches et génisses'!A289))","v":""},{"$f":"IF('[1]IC Vaches et génisses'!B289=\"\",\"\",'[1]IC Vaches et génisses'!B289)","v":""}]
[null,null,{"$f":"IF('[1]IC Vaches et génisses'!A290=\"\",\"\",IF('[1]IC Vaches et génisses'!A290=\"Total général\",\"\",'[1]IC Vaches et génisses'!A290))","v":""},{"$f":"IF('[1]IC Vaches et génisses'!B290=\"\",\"\",'[1]IC Vaches et génisses'!B290)","v":""}]
[null,null,{"$f":"IF('[1]IC Vaches et génisses'!A291=\"\",\"\",IF('[1]IC Vaches et génisses'!A291=\"Total général\",\"\",'[1]IC Vaches et génisses'!A291))","v":""},{"$f":"IF('[1]IC Vaches et génisses'!B291=\"\",\"\",'[1]IC Vaches et génisses'!B291)","v":""}]
[null,null,{"$f":"IF('[1]IC Vaches et génisses'!A292=\"\",\"\",IF('[1]IC Vaches et génisses'!A292=\"Total général\",\"\",'[1]IC Vaches et génisses'!A292))","v":""},{"$f":"IF('[1]IC Vaches et génisses'!B292=\"\",\"\",'[1]IC Vaches et génisses'!B292)","v":""}]
[null,null,{"$f":"IF('[1]IC Vaches et génisses'!A293=\"\",\"\",IF('[1]IC Vaches et génisses'!A293=\"Total général\",\"\",'[1]IC Vaches et génisses'!A293))","v":""},{"$f":"IF('[1]IC Vaches et génisses'!B293=\"\",\"\",'[1]IC Vaches et génisses'!B293)","v":""}]
[null,null,{"$f":"IF('[1]IC Vaches et génisses'!A294=\"\",\"\",IF('[1]IC Vaches et génisses'!A294=\"Total général\",\"\",'[1]IC Vaches et génisses'!A294))","v":""},{"$f":"IF('[1]IC Vaches et génisses'!B294=\"\",\"\",'[1]IC Vaches et génisses'!B294)","v":""}]
[null,null,{"$f":"IF('[1]IC Vaches et génisses'!A295=\"\",\"\",IF('[1]IC Vaches et génisses'!A295=\"Total général\",\"\",'[1]IC Vaches et génisses'!A295))","v":""},{"$f":"IF('[1]IC Vaches et génisses'!B295=\"\",\"\",'[1]IC Vaches et génisses'!B295)","v":""}]
[null,null,{"$f":"IF('[1]IC Vaches et génisses'!A296=\"\",\"\",IF('[1]IC Vaches et génisses'!A296=\"Total général\",\"\",'[1]IC Vaches et génisses'!A296))","v":""},{"$f":"IF('[1]IC Vaches et génisses'!B296=\"\",\"\",'[1]IC Vaches et génisses'!B296)","v":""}]
[null,null,{"$f":"IF('[1]IC Vaches et génisses'!A297=\"\",\"\",IF('[1]IC Vaches et génisses'!A297=\"Total général\",\"\",'[1]IC Vaches et génisses'!A297))","v":""},{"$f":"IF('[1]IC Vaches et génisses'!B297=\"\",\"\",'[1]IC Vaches et génisses'!B297)","v":""}]
[null,null,{"$f":"IF('[1]IC Vaches et génisses'!A298=\"\",\"\",IF('[1]IC Vaches et génisses'!A298=\"Total général\",\"\",'[1]IC Vaches et génisses'!A298))","v":""},{"$f":"IF('[1]IC Vaches et génisses'!B298=\"\",\"\",'[1]IC Vaches et génisses'!B298)","v":""}]
[null,null,{"$f":"IF('[1]IC Vaches et génisses'!A299=\"\",\"\",IF('[1]IC Vaches et génisses'!A299=\"Total général\",\"\",'[1]IC Vaches et génisses'!A299))","v":""},{"$f":"IF('[1]IC Vaches et génisses'!B299=\"\",\"\",'[1]IC Vaches et génisses'!B299)","v":""}]
[null,null,{"$f":"IF('[1]IC Vaches et génisses'!A300=\"\",\"\",IF('[1]IC Vaches et génisses'!A300=\"Total général\",\"\",'[1]IC Vaches et génisses'!A300))","v":""},{"$f":"IF('[1]IC Vaches et génisses'!B300=\"\",\"\",'[1]IC Vaches et génisses'!B300)","v":""}]
[null,null,{"$f":"IF('[1]IC Vaches et génisses'!A301=\"\",\"\",IF('[1]IC Vaches et génisses'!A301=\"Total général\",\"\",'[1]IC Vaches et génisses'!A301))","v":""},{"$f":"IF('[1]IC Vaches et génisses'!B301=\"\",\"\",'[1]IC Vaches et génisses'!B301)","v":""}]
[null,null,{"$f":"IF('[1]IC Vaches et génisses'!A302=\"\",\"\",IF('[1]IC Vaches et génisses'!A302=\"Total général\",\"\",'[1]IC Vaches et génisses'!A302))","v":""},{"$f":"IF('[1]IC Vaches et génisses'!B302=\"\",\"\",'[1]IC Vaches et génisses'!B302)","v":""}]
[null,null,{"$f":"IF('[1]IC Vaches et génisses'!A303=\"\",\"\",IF('[1]IC Vaches et génisses'!A303=\"Total général\",\"\",'[1]IC Vaches et génisses'!A303))","v":""},{"$f":"IF('[1]IC Vaches et génisses'!B303=\"\",\"\",'[1]IC Vaches et génisses'!B303)","v":""}]
[null,null,{"$f":"IF('[1]IC Vaches et génisses'!A304=\"\",\"\",IF('[1]IC Vaches et génisses'!A304=\"Total général\",\"\",'[1]IC Vaches et génisses'!A304))","v":""},{"$f":"IF('[1]IC Vaches et génisses'!B304=\"\",\"\",'[1]IC Vaches et génisses'!B304)","v":""}]
[null,null,{"$f":"IF('[1]IC Vaches et génisses'!A305=\"\",\"\",IF('[1]IC Vaches et génisses'!A305=\"Total général\",\"\",'[1]IC Vaches et génisses'!A305))","v":""},{"$f":"IF('[1]IC Vaches et génisses'!B305=\"\",\"\",'[1]IC Vaches et génisses'!B305)","v":""}]
[null,null,{"$f":"IF('[1]IC Vaches et génisses'!A306=\"\",\"\",IF('[1]IC Vaches et génisses'!A306=\"Total général\",\"\",'[1]IC Vaches et génisses'!A306))","v":""},{"$f":"IF('[1]IC Vaches et génisses'!B306=\"\",\"\",'[1]IC Vaches et génisses'!B306)","v":""}]
[null,null,{"$f":"IF('[1]IC Vaches et génisses'!A307=\"\",\"\",IF('[1]IC Vaches et génisses'!A307=\"Total général\",\"\",'[1]IC Vaches et génisses'!A307))","v":""},{"$f":"IF('[1]IC Vaches et génisses'!B307=\"\",\"\",'[1]IC Vaches et génisses'!B307)","v":""}]
[null,null,{"$f":"IF('[1]IC Vaches et génisses'!A308=\"\",\"\",IF('[1]IC Vaches et génisses'!A308=\"Total général\",\"\",'[1]IC Vaches et génisses'!A308))","v":""},{"$f":"IF('[1]IC Vaches et génisses'!B308=\"\",\"\",'[1]IC Vaches et génisses'!B308)","v":""}]
[null,null,{"$f":"IF('[1]IC Vaches et génisses'!A309=\"\",\"\",IF('[1]IC Vaches et génisses'!A309=\"Total général\",\"\",'[1]IC Vaches et génisses'!A309))","v":""},{"$f":"IF('[1]IC Vaches et génisses'!B309=\"\",\"\",'[1]IC Vaches et génisses'!B309)","v":""}]
[null,null,{"$f":"IF('[1]IC Vaches et génisses'!A310=\"\",\"\",IF('[1]IC Vaches et génisses'!A310=\"Total général\",\"\",'[1]IC Vaches et génisses'!A310))","v":""},{"$f":"IF('[1]IC Vaches et génisses'!B310=\"\",\"\",'[1]IC Vaches et génisses'!B310)","v":""}]
[null,null,{"$f":"IF('[1]IC Vaches et génisses'!A311=\"\",\"\",IF('[1]IC Vaches et génisses'!A311=\"Total général\",\"\",'[1]IC Vaches et génisses'!A311))","v":""},{"$f":"IF('[1]IC Vaches et génisses'!B311=\"\",\"\",'[1]IC Vaches et génisses'!B311)","v":""}]
[null,null,{"$f":"IF('[1]IC Vaches et génisses'!A312=\"\",\"\",IF('[1]IC Vaches et génisses'!A312=\"Total général\",\"\",'[1]IC Vaches et génisses'!A312))","v":""},{"$f":"IF('[1]IC Vaches et génisses'!B312=\"\",\"\",'[1]IC Vaches et génisses'!B312)","v":""}]
[null,null,{"$f":"IF('[1]IC Vaches et génisses'!A313=\"\",\"\",IF('[1]IC Vaches et génisses'!A313=\"Total général\",\"\",'[1]IC Vaches et génisses'!A313))","v":""},{"$f":"IF('[1]IC Vaches et génisses'!B313=\"\",\"\",'[1]IC Vaches et génisses'!B313)","v":""}]
[null,null,{"$f":"IF('[1]IC Vaches et génisses'!A314=\"\",\"\",IF('[1]IC Vaches et génisses'!A314=\"Total général\",\"\",'[1]IC Vaches et génisses'!A314))","v":""},{"$f":"IF('[1]IC Vaches et génisses'!B314=\"\",\"\",'[1]IC Vaches et génisses'!B314)","v":""}]
[null,null,{"$f":"IF('[1]IC Vaches et génisses'!A315=\"\",\"\",IF('[1]IC Vaches et génisses'!A315=\"Total général\",\"\",'[1]IC Vaches et génisses'!A315))","v":""},{"$f":"IF('[1]IC Vaches et génisses'!B315=\"\",\"\",'[1]IC Vaches et génisses'!B315)","v":""}]
[null,null,{"$f":"IF('[1]IC Vaches et génisses'!A316=\"\",\"\",IF('[1]IC Vaches et génisses'!A316=\"Total général\",\"\",'[1]IC Vaches et génisses'!A316))","v":""},{"$f":"IF('[1]IC Vaches et génisses'!B316=\"\",\"\",'[1]IC Vaches et génisses'!B316)","v":""}]
[null,null,{"$f":"IF('[1]IC Vaches et génisses'!A317=\"\",\"\",IF('[1]IC Vaches et génisses'!A317=\"Total général\",\"\",'[1]IC Vaches et génisses'!A317))","v":""},{"$f":"IF('[1]IC Vaches et génisses'!B317=\"\",\"\",'[1]IC Vaches et génisses'!B317)","v":""}]
[null,null,{"$f":"IF('[1]IC Vaches et génisses'!A318=\"\",\"\",IF('[1]IC Vaches et génisses'!A318=\"Total général\",\"\",'[1]IC Vaches et génisses'!A318))","v":""},{"$f":"IF('[1]IC Vaches et génisses'!B318=\"\",\"\",'[1]IC Vaches et génisses'!B318)","v":""}]
[null,null,{"$f":"IF('[1]IC Vaches et génisses'!A319=\"\",\"\",IF('[1]IC Vaches et génisses'!A319=\"Total général\",\"\",'[1]IC Vaches et génisses'!A319))","v":""},{"$f":"IF('[1]IC Vaches et génisses'!B319=\"\",\"\",'[1]IC Vaches et génisses'!B319)","v":""}]
[null,null,{"$f":"IF('[1]IC Vaches et génisses'!A320=\"\",\"\",IF('[1]IC Vaches et génisses'!A320=\"Total général\",\"\",'[1]IC Vaches et génisses'!A320))","v":""},{"$f":"IF('[1]IC Vaches et génisses'!B320=\"\",\"\",'[1]IC Vaches et génisses'!B320)","v":""}]
[null,null,{"$f":"IF('[1]IC Vaches et génisses'!A321=\"\",\"\",IF('[1]IC Vaches et génisses'!A321=\"Total général\",\"\",'[1]IC Vaches et génisses'!A321))","v":""},{"$f":"IF('[1]IC Vaches et génisses'!B321=\"\",\"\",'[1]IC Vaches et génisses'!B321)","v":""}]
[null,null,{"$f":"IF('[1]IC Vaches et génisses'!A322=\"\",\"\",IF('[1]IC Vaches et génisses'!A322=\"Total général\",\"\",'[1]IC Vaches et génisses'!A322))","v":""},{"$f":"IF('[1]IC Vaches et génisses'!B322=\"\",\"\",'[1]IC Vaches et génisses'!B322)","v":""}]
[null,null,{"$f":"IF('[1]IC Vaches et génisses'!A323=\"\",\"\",IF('[1]IC Vaches et génisses'!A323=\"Total général\",\"\",'[1]IC Vaches et génisses'!A323))","v":""},{"$f":"IF('[1]IC Vaches et génisses'!B323=\"\",\"\",'[1]IC Vaches et génisses'!B323)","v":""}]
[null,null,{"$f":"IF('[1]IC Vaches et génisses'!A324=\"\",\"\",IF('[1]IC Vaches et génisses'!A324=\"Total général\",\"\",'[1]IC Vaches et génisses'!A324))","v":""},{"$f":"IF('[1]IC Vaches et génisses'!B324=\"\",\"\",'[1]IC Vaches et génisses'!B324)","v":""}]
[null,null,{"$f":"IF('[1]IC Vaches et génisses'!A325=\"\",\"\",IF('[1]IC Vaches et génisses'!A325=\"Total général\",\"\",'[1]IC Vaches et génisses'!A325))","v":""},{"$f":"IF('[1]IC Vaches et génisses'!B325=\"\",\"\",'[1]IC Vaches et génisses'!B325)","v":""}]
[null,null,{"$f":"IF('[1]IC Vaches et génisses'!A326=\"\",\"\",IF('[1]IC Vaches et génisses'!A326=\"Total général\",\"\",'[1]IC Vaches et génisses'!A326))","v":""},{"$f":"IF('[1]IC Vaches et génisses'!B326=\"\",\"\",'[1]IC Vaches et génisses'!B326)","v":""}]
[null,null,{"$f":"IF('[1]IC Vaches et génisses'!A327=\"\",\"\",IF('[1]IC Vaches et génisses'!A327=\"Total général\",\"\",'[1]IC Vaches et génisses'!A327))","v":""},{"$f":"IF('[1]IC Vaches et génisses'!B327=\"\",\"\",'[1]IC Vaches et génisses'!B327)","v":""}]
[null,null,{"$f":"IF('[1]IC Vaches et génisses'!A328=\"\",\"\",IF('[1]IC Vaches et génisses'!A328=\"Total général\",\"\",'[1]IC Vaches et génisses'!A328))","v":""},{"$f":"IF('[1]IC Vaches et génisses'!B328=\"\",\"\",'[1]IC Vaches et génisses'!B328)","v":""}]
[null,null,{"$f":"IF('[1]IC Vaches et génisses'!A329=\"\",\"\",IF('[1]IC Vaches et génisses'!A329=\"Total général\",\"\",'[1]IC Vaches et génisses'!A329))","v":""},{"$f":"IF('[1]IC Vaches et génisses'!B329=\"\",\"\",'[1]IC Vaches et génisses'!B329)","v":""}]
[null,null,{"$f":"IF('[1]IC Vaches et génisses'!A330=\"\",\"\",IF('[1]IC Vaches et génisses'!A330=\"Total général\",\"\",'[1]IC Vaches et génisses'!A330))","v":""},{"$f":"IF('[1]IC Vaches et génisses'!B330=\"\",\"\",'[1]IC Vaches et génisses'!B330)","v":""}]
[null,null,{"$f":"IF('[1]IC Vaches et génisses'!A331=\"\",\"\",IF('[1]IC Vaches et génisses'!A331=\"Total général\",\"\",'[1]IC Vaches et génisses'!A331))","v":""},{"$f":"IF('[1]IC Vaches et génisses'!B331=\"\",\"\",'[1]IC Vaches et génisses'!B331)","v":""}]
[null,null,{"$f":"IF('[1]IC Vaches et génisses'!A332=\"\",\"\",IF('[1]IC Vaches et génisses'!A332=\"Total général\",\"\",'[1]IC Vaches et génisses'!A332))","v":""},{"$f":"IF('[1]IC Vaches et génisses'!B332=\"\",\"\",'[1]IC Vaches et génisses'!B332)","v":""}]
[null,null,{"$f":"IF('[1]IC Vaches et génisses'!A333=\"\",\"\",IF('[1]IC Vaches et génisses'!A333=\"Total général\",\"\",'[1]IC Vaches et génisses'!A333))","v":""},{"$f":"IF('[1]IC Vaches et génisses'!B333=\"\",\"\",'[1]IC Vaches et génisses'!B333)","v":""}]
[null,null,{"$f":"IF('[1]IC Vaches et génisses'!A334=\"\",\"\",IF('[1]IC Vaches et génisses'!A334=\"Total général\",\"\",'[1]IC Vaches et génisses'!A334))","v":""},{"$f":"IF('[1]IC Vaches et génisses'!B334=\"\",\"\",'[1]IC Vaches et génisses'!B334)","v":""}]
[null,null,{"$f":"IF('[1]IC Vaches et génisses'!A335=\"\",\"\",IF('[1]IC Vaches et génisses'!A335=\"Total général\",\"\",'[1]IC Vaches et génisses'!A335))","v":""},{"$f":"IF('[1]IC Vaches et génisses'!B335=\"\",\"\",'[1]IC Vaches et génisses'!B335)","v":""}]
[null,null,{"$f":"IF('[1]IC Vaches et génisses'!A336=\"\",\"\",IF('[1]IC Vaches et génisses'!A336=\"Total général\",\"\",'[1]IC Vaches et génisses'!A336))","v":""},{"$f":"IF('[1]IC Vaches et génisses'!B336=\"\",\"\",'[1]IC Vaches et génisses'!B336)","v":""}]
[null,null,{"$f":"IF('[1]IC Vaches et génisses'!A337=\"\",\"\",IF('[1]IC Vaches et génisses'!A337=\"Total général\",\"\",'[1]IC Vaches et génisses'!A337))","v":""},{"$f":"IF('[1]IC Vaches et génisses'!B337=\"\",\"\",'[1]IC Vaches et génisses'!B337)","v":""}]
[null,null,{"$f":"IF('[1]IC Vaches et génisses'!A338=\"\",\"\",IF('[1]IC Vaches et génisses'!A338=\"Total général\",\"\",'[1]IC Vaches et génisses'!A338))","v":""},{"$f":"IF('[1]IC Vaches et génisses'!B338=\"\",\"\",'[1]IC Vaches et génisses'!B338)","v":""}]
[null,null,{"$f":"IF('[1]IC Vaches et génisses'!A339=\"\",\"\",IF('[1]IC Vaches et génisses'!A339=\"Total général\",\"\",'[1]IC Vaches et génisses'!A339))","v":""},{"$f":"IF('[1]IC Vaches et génisses'!B339=\"\",\"\",'[1]IC Vaches et génisses'!B339)","v":""}]
[null,null,{"$f":"IF('[1]IC Vaches et génisses'!A340=\"\",\"\",IF('[1]IC Vaches et génisses'!A340=\"Total général\",\"\",'[1]IC Vaches et génisses'!A340))","v":""},{"$f":"IF('[1]IC Vaches et génisses'!B340=\"\",\"\",'[1]IC Vaches et génisses'!B340)","v":""}]
[null,null,{"$f":"IF('[1]IC Vaches et génisses'!A341=\"\",\"\",IF('[1]IC Vaches et génisses'!A341=\"Total général\",\"\",'[1]IC Vaches et génisses'!A341))","v":""},{"$f":"IF('[1]IC Vaches et génisses'!B341=\"\",\"\",'[1]IC Vaches et génisses'!B341)","v":""}]
[null,null,{"$f":"IF('[1]IC Vaches et génisses'!A342=\"\",\"\",IF('[1]IC Vaches et génisses'!A342=\"Total général\",\"\",'[1]IC Vaches et génisses'!A342))","v":""},{"$f":"IF('[1]IC Vaches et génisses'!B342=\"\",\"\",'[1]IC Vaches et génisses'!B342)","v":""}]
[null,null,{"$f":"IF('[1]IC Vaches et génisses'!A343=\"\",\"\",IF('[1]IC Vaches et génisses'!A343=\"Total général\",\"\",'[1]IC Vaches et génisses'!A343))","v":""},{"$f":"IF('[1]IC Vaches et génisses'!B343=\"\",\"\",'[1]IC Vaches et génisses'!B343)","v":""}]
[null,null,{"$f":"IF('[1]IC Vaches et génisses'!A364=\"\",\"\",IF('[1]IC Vaches et génisses'!A364=\"Total général\",\"\",'[1]IC Vaches et génisses'!A364))","v":""},{"$f":"IF('[1]IC Vaches et génisses'!B344=\"\",\"\",'[1]IC Vaches et génisses'!B344)","v":""}]
[null,null,{"$f":"IF('[1]IC Vaches et génisses'!A365=\"\",\"\",IF('[1]IC Vaches et génisses'!A365=\"Total général\",\"\",'[1]IC Vaches et génisses'!A365))","v":""},{"$f":"IF('[1]IC Vaches et génisses'!B345=\"\",\"\",'[1]IC Vaches et génisses'!B345)","v":""}]
[null,null,{"$f":"IF('[1]IC Vaches et génisses'!A366=\"\",\"\",IF('[1]IC Vaches et génisses'!A366=\"Total général\",\"\",'[1]IC Vaches et génisses'!A366))","v":""},{"$f":"IF('[1]IC Vaches et génisses'!B346=\"\",\"\",'[1]IC Vaches et génisses'!B346)","v":""}]
[null,null,{"$f":"IF('[1]IC Vaches et génisses'!A367=\"\",\"\",IF('[1]IC Vaches et génisses'!A367=\"Total général\",\"\",'[1]IC Vaches et génisses'!A367))","v":""},{"$f":"IF('[1]IC Vaches et génisses'!B347=\"\",\"\",'[1]IC Vaches et génisses'!B347)","v":""}]
[null,null,{"$f":"IF('[1]IC Vaches et génisses'!A368=\"\",\"\",IF('[1]IC Vaches et génisses'!A368=\"Total général\",\"\",'[1]IC Vaches et génisses'!A368))","v":""},{"$f":"IF('[1]IC Vaches et génisses'!B348=\"\",\"\",'[1]IC Vaches et génisses'!B348)","v":""}]

{"sheet":"saillies naturelles","index":2,"n_rows":6,"n_cols":15,"rows_kept":6,"cut":false,"hidden":false,"merged":[[1,2,1,13],[3,2,4,2],[1,0,2,1],[3,4,5,4],[3,11,5,11],[3,10,5,10],[3,12,5,12],[3,13,5,13],[4,0,5,1],[3,6,5,6],[3,8,5,8],[3,5,5,5],[3,7,5,7],[3,9,5,9],[3,3,5,3]]}
[]
["retour à la page d'accueil",null,"Enregistrement des saillies naturelles"]
[]
[null,null,"N° 4 chiffres ","Nom facultatif sauf si n° 4 chiffres identiques "," Date de la saillie naturelle N°1","N° du taureau"," Date de la saillie naturelle N°2","N° du taureau"," Date de la saillie naturelle N°3","N° du taureau"," Date de la saillie naturelle N°4","N° du taureau"," Date de la saillie naturelle N°5","N° du taureau"]
[{"$f":"[1]SN!$B$1","v":"54474307"}]
[null,null,null,null,null,null,null,null,null,null,null,null,null,null,"Remarques particulières sur l'animal"]

{"sheet":"syncros","index":3,"n_rows":7,"n_cols":60,"rows_kept":7,"cut":false,"hidden":false,"merged":[[13,19,13,20],[13,24,13,25],[13,29,13,30],[13,34,13,35],[13,39,13,40],[13,44,13,45],[13,49,13,50],[13,54,13,55],[13,59,13,60],[12,19,12,20],[12,24,12,25],[12,29,12,30],[12,34,12,35],[12,39,12,40],[12,44,12,45],[12,49,12,50],[12,54,12,55],[12,59,12,60],[9,4,9,5],[9,9,9,10],[9,14,9,15],[8,4,8,5],[8,9,8,10],[8,14,8,15],[2,2,2,15],[4,4,4,6],[4,9,4,10],[6,2,7,2],[6,3,7,3],[6,4,7,5],[6,7,7,7],[6,8,7,8],[6,9,7,10],[6,12,7,12],[6,13,7,13],[6,14,7,15],[4,0,4,2],[18,14,18,15],[10,4,10,5],[10,9,10,10],[10,14,10,15],[16,4,16,5],[16,9,16,10],[16,14,16,15],[11,4,11,5],[14,4,14,5],[15,4,15,5],[11,9,11,10],[14,9,14,10],[15,9,15,10],[11,14,11,15],[14,14,14,15],[15,14,15,15],[12,4,12,5],[12,9,12,10],[12,14,12,15],[13,4,13,5],[13,9,13,10],[13,14,13,15],[0,0,0,2],[21,4,21,5],[21,9,21,10],[21,14,21,15],[24,4,24,5],[24,9,24,10],[24,14,24,15],[22,4,22,5],[22,9,22,10],[22,14,22,15],[23,4,23,5],[23,9,23,10],[23,14,23,15],[19,4,19,5],[19,9,19,10],[19,14,19,15],[20,4,20,5],[20,9,20,10],[20,14,20,15],[17,4,17,5],[17,9,17,10],[17,14,17,15],[18,4,18,5],[18,9,18,10],[2,17,2,30],[4,19,4,21],[4,24,4,25],[6,17,7,17],[6,18,7,18],[6,19,7,20],[6,22,7,22],[6,23,7,23],[6,24,7,25],[6,27,7,27],[6,28,7,28],[6,29,7,30],[10,19,10,20],[10,24,10,25],[10,29,10,30],[11,19,11,20],[11,24,11,25],[11,29,11,30],[8,19,8,20],[8,24,8,25],[8,29,8,30],[9,19,9,20],[9,24,9,25],[9,29,9,30],[16,29,16,30],[17,19,17,20],[17,24,17,25],[17,29,17,30],[14,19,14,20],[14,24,14,25],[14,29,14,30],[15,19,15,20],[15,24,15,25],[15,29,15,30],[10,34,10,35],[24,19,24,20],[24,24,24,25],[24,29,24,30],[22,19,22,20],[22,24,22,25],[22,29,22,30],[23,19,23,20],[23,24,23,25],[23,29,23,30],[20,19,20,20],[20,24,20,25],[20,29,20,30],[21,19,21,20],[21,24,21,25],[21,29,21,30],[18,19,18,20],[18,24,18,25],[18,29,18,30],[19,19,19,20],[19,24,19,25],[19,29,19,30],[16,19,16,20],[16,24,16,25],[2,47,2,60],[4,34,4,36],[4,39,4,40],[4,49,4,51],[4,54,4,55],[2,32,2,45],[6,32,7,32],[6,33,7,33],[6,34,7,35],[6,37,7,37],[6,38,7,38],[6,39,7,40],[6,42,7,42],[6,43,7,43],[6,44,7,45],[9,34,9,35],[9,39,9,40],[9,44,9,45],[9,49,9,50],[9,54,9,55],[9,59,9,60],[6,54,7,55],[6,57,7,57],[6,58,7,58],[6,59,7,60],[6,47,7,47],[6,48,7,48],[6,49,7,50],[6,52,7,52],[6,53,7,53],[8,34,8,35],[8,39,8,40],[10,39,10,40],[10,44,10,45],[10,49,10,50],[10,54,10,55],[10,59,10,60],[8,44,8,45],[8,49,8,50],[8,54,8,55],[8,59,8,60],[11,59,11,60],[14,34,14,35],[14,39,14,40],[14,44,14,45],[14,49,14,50],[14,54,14,55],[14,59,14,60],[11,34,11,35],[11,39,11,40],[11,44,11,45],[11,49,11,50],[11,54,11,55],[15,59,15,60],[16,34,16,35],[16,39,16,40],[16,44,16,45],[16,49,16,50],[16,54,16,55],[16,59,16,60],[15,34,15,35],[15,39,15,40],[15,44,15,45],[15,49,15,50],[15,54,15,55],[17,59,17,60],[18,34,18,35],[18,39,18,40],[18,44,18,45],[18,49,18,50],[18,54,18,55],[18,59,18,60],[17,34,17,35],[17,39,17,40],[17,44,17,45],[17,49,17,50],[17,54,17,55],[19,59,19,60],[20,34,20,35],[20,39,20,40],[20,44,20,45],[20,49,20,50],[20,54,20,55],[20,59,20,60],[19,34,19,35],[19,39,19,40],[19,44,19,45],[19,49,19,50],[19,54,19,55],[21,59,21,60],[22,34,22,35],[22,39,22,40],[22,44,22,45],[22,49,22,50],[22,54,22,55],[22,59,22,60],[21,34,21,35],[21,39,21,40],[21,44,21,45],[21,49,21,50],[21,54,21,55],[23,59,23,60],[24,34,24,35],[24,39,24,40],[24,44,24,45],[24,49,24,50],[24,54,24,55],[24,59,24,60],[23,34,23,35],[23,39,23,40],[23,44,23,45],[23,49,23,50],[23,54,23,55]]}
["retour à la page d'accueil"]
[]
[null,null,"Enregistrements de la synchro N°1",null,null,null,null,null,null,null,null,null,null,null,null,null,null,"Enregistrements de la synchro N°2",null,null,null,null,null,null,null,null,null,null,null,null,null,null,"Enregistrements de la synchro N°3",null,null,null,null,null,null,null,null,null,null,null,null,null,null,"Enregistrements de la synchro N°4"]
[]
[{"$f":"[1]synchros!$B$1","v":"54474307"},null,null,"Date de la synchro N°1",null,null,null,null,"type de synchro N°1",null,null,null,null,null,null,null,null,null,"Date de la synchro N°2",null,null,null,null,"type de synchro N°2",null,null,null,null,null,null,null,null,null,"Date de la synchro  N°3",null,null,null,null,"type de synchro N°3",null,null,null,null,null,null,null,null,null,"Date de la synchro N°4",null,null,null,null,"type de synchro N°4"]
[]
[null,null,"N° 4 chiffres ","Nom facultatif sauf si n° 4 chiffres identiques ","raison de la synchro N°1",null,null,"N° 4 chiffres ","Nom facultatif sauf si n° 4 chiffres identiques ","raison de la synchro N°1",null,null,"N° 4 chiffres ","Nom facultatif sauf si n° 4 chiffres identiques ","raison de la synchro N°1",null,null,"N° 4 chiffres ","Nom facultatif sauf si n° 4 chiffres identiques ","raison de la synchro N°2",null,null,"N° 4 chiffres ","Nom facultatif sauf si n° 4 chiffres identiques ","raison de la synchro N°2",null,null,"N° 4 chiffres ","Nom facultatif sauf si n° 4 chiffres identiques ","raison de la synchro N°2",null,null,"N° 4 chiffres ","Nom facultatif sauf si n° 4 chiffres identiques ","raison de la synchro N°3",null,null,"N° 4 chiffres ","Nom facultatif sauf si n° 4 chiffres identiques ","raison de la synchro N°3",null,null,"N° 4 chiffres ","Nom facultatif sauf si n° 4 chiffres identiques ","raison de la synchro N°3",null,null,"N° 4 chiffres ","Nom facultatif sauf si n° 4 chiffres identiques ","raison de la synchro N°4",null,null,"N° 4 chiffres ","Nom facultatif sauf si n° 4 chiffres identiques ","raison de la synchro N°4",null,null,"N° 4 chiffres ","Nom facultatif sauf si n° 4 chiffres identiques ","raison de la synchro N°4"]

{"sheet":"échos","index":4,"n_rows":298,"n_cols":17,"rows_kept":298,"cut":false,"hidden":false,"merged":[[1,0,2,1],[3,0,4,1],[3,3,5,3],[4,4,5,4],[4,5,5,5],[1,2,1,15],[3,4,3,6],[3,7,3,9],[3,10,3,12],[3,13,3,15],[3,2,4,2],[4,6,5,6],[4,7,5,7],[4,8,5,8],[4,14,5,14],[4,15,5,15],[4,9,5,9],[4,10,5,10],[4,11,5,11],[4,12,5,12],[4,13,5,13]]}
[]
["retour à la page d'accueil",null,"Echographies sur vaches et génisses (après IA/SN)"]
[]
[{"$f":"'[1]échos VL et génisses'!$B$2","v":"54474307"},null,"N° 4 chiffres ","Nom de l'animal","échographie N°1",null,null,"échographie N°2",null,null,"échographie N°3",null,null,"échographie N°4"]
[null,null,null,null,"Date de l'échographie N°1","résultat ","nombre de fœtus","Date de l'échographie N°2","résultat ","nombre de fœtus","Date de l'échographie N°3","résultat ","nombre de fœtus","Date de l'échographie N°4","résultat ","nombre de fœtus"]
[null,null,null,null,null,null,null,null,null,null,null,null,null,null,null,null,"Remarques particulières sur l'animal"]
[null,null,{"$f":"IF('[1]échos VL et génisses'!A9=\"\",\"\",IF('[1]échos VL et génisses'!A9=\"Total général\",\"\",'[1]échos VL et génisses'!A9))","v":"0052"},{"$f":"IF('[1]échos VL et génisses'!B9=\"\",\"\",'[1]échos VL et génisses'!B9)","v":"UDINE"},null,null,{"$f":"IF(F7=3,0,\"\")","v":""},null,null,{"$f":"IF(I7=3,0,\"\")","v":""},null,null,{"$f":"IF(L7=3,0,\"\")","v":""},null,null,{"$f":"IF(O7=3,0,\"\")","v":""}]
[null,null,{"$f":"IF('[1]échos VL et génisses'!A10=\"\",\"\",IF('[1]échos VL et génisses'!A10=\"Total général\",\"\",'[1]échos VL et génisses'!A10))","v":"2974"},{"$f":"IF('[1]échos VL et génisses'!B10=\"\",\"\",'[1]échos VL et génisses'!B10)","v":"ASTONIA"},null,null,{"$f":"IF(F8=3,0,\"\")","v":""},null,null,{"$f":"IF(I8=3,0,\"\")","v":""},null,null,{"$f":"IF(L8=3,0,\"\")","v":""},null,null,{"$f":"IF(O8=3,0,\"\")","v":""}]
[null,null,{"$f":"IF('[1]échos VL et génisses'!A11=\"\",\"\",IF('[1]échos VL et génisses'!A11=\"Total général\",\"\",'[1]échos VL et génisses'!A11))","v":"3266"},{"$f":"IF('[1]échos VL et génisses'!B11=\"\",\"\",'[1]échos VL et génisses'!B11)","v":"DECADE"},null,null,"",null,null,"",null,null,"",null,null,""]
[null,null,{"$f":"IF('[1]échos VL et génisses'!A12=\"\",\"\",IF('[1]échos VL et génisses'!A12=\"Total général\",\"\",'[1]échos VL et génisses'!A12))","v":"3271"},{"$f":"IF('[1]échos VL et génisses'!B12=\"\",\"\",'[1]échos VL et génisses'!B12)","v":"DOUCETTE"},null,null,"",null,null,"",null,null,"",null,null,""]
[null,null,{"$f":"IF('[1]échos VL et génisses'!A13=\"\",\"\",IF('[1]échos VL et génisses'!A13=\"Total général\",\"\",'[1]échos VL et génisses'!A13))","v":"3272"},{"$f":"IF('[1]échos VL et génisses'!B13=\"\",\"\",'[1]échos VL et génisses'!B13)","v":"DANETTE"},null,null,"",null,null,"",null,null,"",null,null,""]
[null,null,{"$f":"IF('[1]échos VL et génisses'!A14=\"\",\"\",IF('[1]échos VL et génisses'!A14=\"Total général\",\"\",'[1]échos VL et génisses'!A14))","v":"3276"},{"$f":"IF('[1]échos VL et génisses'!B14=\"\",\"\",'[1]échos VL et génisses'!B14)","v":"DYNAMITE"},null,null,"",null,null,"",null,null,"",null,null,""]
[null,null,{"$f":"IF('[1]échos VL et génisses'!A15=\"\",\"\",IF('[1]échos VL et génisses'!A15=\"Total général\",\"\",'[1]échos VL et génisses'!A15))","v":"3279"},{"$f":"IF('[1]échos VL et génisses'!B15=\"\",\"\",'[1]échos VL et génisses'!B15)","v":"DORA"},null,null,"",null,null,"",null,null,"",null,null,""]
[null,null,{"$f":"IF('[1]échos VL et génisses'!A16=\"\",\"\",IF('[1]échos VL et génisses'!A16=\"Total général\",\"\",'[1]échos VL et génisses'!A16))","v":"3280"},{"$f":"IF('[1]échos VL et génisses'!B16=\"\",\"\",'[1]échos VL et génisses'!B16)","v":"DOLLY"},null,null,"",null,null,"",null,null,"",null,null,""]
[null,null,{"$f":"IF('[1]échos VL et génisses'!A17=\"\",\"\",IF('[1]échos VL et génisses'!A17=\"Total général\",\"\",'[1]échos VL et génisses'!A17))","v":"3285"},{"$f":"IF('[1]échos VL et génisses'!B17=\"\",\"\",'[1]échos VL et génisses'!B17)","v":"DORINE"},null,null,"",null,null,"",null,null,"",null,null,""]
[null,null,{"$f":"IF('[1]échos VL et génisses'!A18=\"\",\"\",IF('[1]échos VL et génisses'!A18=\"Total général\",\"\",'[1]échos VL et génisses'!A18))","v":"3292"},{"$f":"IF('[1]échos VL et génisses'!B18=\"\",\"\",'[1]échos VL et génisses'!B18)","v":"DIGITALE"},null,null,"",null,null,"",null,null,"",null,null,""]
[null,null,{"$f":"IF('[1]échos VL et génisses'!A19=\"\",\"\",IF('[1]échos VL et génisses'!A19=\"Total général\",\"\",'[1]échos VL et génisses'!A19))","v":"3294"},{"$f":"IF('[1]échos VL et génisses'!B19=\"\",\"\",'[1]échos VL et génisses'!B19)","v":"EXTRA"},null,null,"",null,null,"",null,null,"",null,null,""]
[null,null,{"$f":"IF('[1]échos VL et génisses'!A20=\"\",\"\",IF('[1]échos VL et génisses'!A20=\"Total général\",\"\",'[1]échos VL et génisses'!A20))","v":"3568"},{"$f":"IF('[1]échos VL et génisses'!B20=\"\",\"\",'[1]échos VL et génisses'!B20)","v":"BUVEE"},null,null,"",null,null,"",null,null,"",null,null,""]
[null,null,{"$f":"IF('[1]échos VL et génisses'!A21=\"\",\"\",IF('[1]échos VL et génisses'!A21=\"Total général\",\"\",'[1]échos VL et génisses'!A21))","v":"4211"},{"$f":"IF('[1]échos VL et génisses'!B21=\"\",\"\",'[1]échos VL et génisses'!B21)","v":"FANTA"},null,null,"",null,null,"",null,null,"",null,null,""]
[null,null,{"$f":"IF('[1]échos VL et génisses'!A22=\"\",\"\",IF('[1]échos VL et génisses'!A22=\"Total général\",\"\",'[1]échos VL et génisses'!A22))","v":"4212"},{"$f":"IF('[1]échos VL et génisses'!B22=\"\",\"\",'[1]échos VL et génisses'!B22)","v":"FLORA"},null,null,"",null,null,"",null,null,"",null,null,""]
[null,null,{"$f":"IF('[1]échos VL et génisses'!A23=\"\",\"\",IF('[1]échos VL et génisses'!A23=\"Total général\",\"\",'[1]échos VL et génisses'!A23))","v":"4213"},{"$f":"IF('[1]échos VL et génisses'!B23=\"\",\"\",'[1]échos VL et génisses'!B23)","v":"FIDELIA"},null,null,"",null,null,"",null,null,"",null,null,""]
[null,null,{"$f":"IF('[1]échos VL et génisses'!A24=\"\",\"\",IF('[1]échos VL et génisses'!A24=\"Total général\",\"\",'[1]échos VL et génisses'!A24))","v":"4214"},{"$f":"IF('[1]échos VL et génisses'!B24=\"\",\"\",'[1]échos VL et génisses'!B24)","v":"FIESTA"},null,null,"",null,null,"",null,null,"",null,null,""]
[null,null,{"$f":"IF('[1]échos VL et génisses'!A25=\"\",\"\",IF('[1]échos VL et génisses'!A25=\"Total général\",\"\",'[1]échos VL et génisses'!A25))","v":"4215"},{"$f":"IF('[1]échos VL et génisses'!B25=\"\",\"\",'[1]échos VL et génisses'!B25)","v":"FIFI"},null,null,"",null,null,"",null,null,"",null,null,""]
[null,null,{"$f":"IF('[1]échos VL et génisses'!A26=\"\",\"\",IF('[1]échos VL et génisses'!A26=\"Total général\",\"\",'[1]échos VL et génisses'!A26))","v":"4216"},{"$f":"IF('[1]échos VL et génisses'!B26=\"\",\"\",'[1]échos VL et génisses'!B26)","v":"FARCE"},null,null,"",null,null,"",null,null,"",null,null,""]
[null,null,{"$f":"IF('[1]échos VL et génisses'!A27=\"\",\"\",IF('[1]échos VL et génisses'!A27=\"Total général\",\"\",'[1]échos VL et génisses'!A27))","v":"4217"},{"$f":"IF('[1]échos VL et génisses'!B27=\"\",\"\",'[1]échos VL et génisses'!B27)","v":"FAUVETTE"},null,null,"",null,null,"",null,null,"",null,null,""]
[null,null,{"$f":"IF('[1]échos VL et génisses'!A28=\"\",\"\",IF('[1]échos VL et génisses'!A28=\"Total général\",\"\",'[1]échos VL et génisses'!A28))","v":"4223"},{"$f":"IF('[1]échos VL et génisses'!B28=\"\",\"\",'[1]échos VL et génisses'!B28)","v":"FEA"},null,null,"",null,null,"",null,null,"",null,null,""]
[null,null,{"$f":"IF('[1]échos VL et génisses'!A29=\"\",\"\",IF('[1]échos VL et génisses'!A29=\"Total général\",\"\",'[1]échos VL et génisses'!A29))","v":"4226"},{"$f":"IF('[1]échos VL et génisses'!B29=\"\",\"\",'[1]échos VL et génisses'!B29)","v":"FIONA"},null,null,"",null,null,"",null,null,"",null,null,""]
[null,null,{"$f":"IF('[1]échos VL et génisses'!A30=\"\",\"\",IF('[1]échos VL et génisses'!A30=\"Total général\",\"\",'[1]échos VL et génisses'!A30))","v":"4232"},{"$f":"IF('[1]échos VL et génisses'!B30=\"\",\"\",'[1]échos VL et génisses'!B30)","v":"FARIBOLE"},null,null,"",null,null,"",null,null,"",null,null,""]
[null,null,{"$f":"IF('[1]échos VL et génisses'!A31=\"\",\"\",IF('[1]échos VL et génisses'!A31=\"Total général\",\"\",'[1]échos VL et génisses'!A31))","v":"4236"},{"$f":"IF('[1]échos VL et génisses'!B31=\"\",\"\",'[1]échos VL et génisses'!B31)","v":"FELLA"},null,null,"",null,null,"",null,null,"",null,null,""]
[null,null,{"$f":"IF('[1]échos VL et génisses'!A32=\"\",\"\",IF('[1]échos VL et génisses'!A32=\"Total général\",\"\",'[1]échos VL et génisses'!A32))","v":"4506"},{"$f":"IF('[1]échos VL et génisses'!B32=\"\",\"\",'[1]échos VL et génisses'!B32)","v":"ILONA"},null,null,"",null,null,"",null,null,"",null,null,""]
[null,null,{"$f":"IF('[1]échos VL et génisses'!A33=\"\",\"\",IF('[1]échos VL et génisses'!A33=\"Total général\",\"\",'[1]échos VL et génisses'!A33))","v":"4524"},{"$f":"IF('[1]échos VL et génisses'!B33=\"\",\"\",'[1]échos VL et génisses'!B33)","v":"IMPER"},null,null,"",null,null,"",null,null,"",null,null,""]
[null,null,{"$f":"IF('[1]échos VL et génisses'!A34=\"\",\"\",IF('[1]échos VL et génisses'!A34=\"Total général\",\"\",'[1]échos VL et génisses'!A34))","v":"4619"},{"$f":"IF('[1]échos VL et génisses'!B34=\"\",\"\",'[1]échos VL et génisses'!B34)","v":"HERITIERE"},null,null,"",null,null,"",null,null,"",null,null,""]
[null,null,{"$f":"IF('[1]échos VL et génisses'!A35=\"\",\"\",IF('[1]échos VL et génisses'!A35=\"Total général\",\"\",'[1]échos VL et génisses'!A35))","v":"5200"},{"$f":"IF('[1]échos VL et génisses'!B35=\"\",\"\",'[1]échos VL et génisses'!B35)","v":"CENDRILLON"},null,null,"",null,null,"",null,null,"",null,null,""]
[null,null,{"$f":"IF('[1]échos VL et génisses'!A36=\"\",\"\",IF('[1]échos VL et génisses'!A36=\"Total général\",\"\",'[1]échos VL et génisses'!A36))","v":"5321"},{"$f":"IF('[1]échos VL et génisses'!B36=\"\",\"\",'[1]échos VL et génisses'!B36)","v":"ACTION"},null,null,"",null,null,"",null,null,"",null,null,""]
[null,null,{"$f":"IF('[1]échos VL et génisses'!A37=\"\",\"\",IF('[1]échos VL et génisses'!A37=\"Total général\",\"\",'[1]échos VL et génisses'!A37))","v":"5327"},{"$f":"IF('[1]échos VL et génisses'!B37=\"\",\"\",'[1]échos VL et génisses'!B37)","v":"AUTRUCHE"},null,null,"",null,null,"",null,null,"",null,null,""]
[null,null,{"$f":"IF('[1]échos VL et génisses'!A38=\"\",\"\",IF('[1]échos VL et génisses'!A38=\"Total général\",\"\",'[1]échos VL et génisses'!A38))","v":"5567"},{"$f":"IF('[1]échos VL et génisses'!B38=\"\",\"\",'[1]échos VL et génisses'!B38)","v":"ETOILE"},null,null,"",null,null,"",null,null,"",null,null,""]
[null,null,{"$f":"IF('[1]échos VL et génisses'!A39=\"\",\"\",IF('[1]échos VL et génisses'!A39=\"Total général\",\"\",'[1]échos VL et génisses'!A39))","v":"5571"},{"$f":"IF('[1]échos VL et génisses'!B39=\"\",\"\",'[1]échos VL et génisses'!B39)","v":"EBENE"},null,null,"",null,null,"",null,null,"",null,null,""]
[null,null,{"$f":"IF('[1]échos VL et génisses'!A40=\"\",\"\",IF('[1]échos VL et génisses'!A40=\"Total général\",\"\",'[1]échos VL et génisses'!A40))","v":"5572"},{"$f":"IF('[1]échos VL et génisses'!B40=\"\",\"\",'[1]échos VL et génisses'!B40)","v":"EDINA"},null,null,"",null,null,"",null,null,"",null,null,""]
[null,null,{"$f":"IF('[1]échos VL et génisses'!A41=\"\",\"\",IF('[1]échos VL et génisses'!A41=\"Total général\",\"\",'[1]échos VL et génisses'!A41))","v":"5573"},{"$f":"IF('[1]échos VL et génisses'!B41=\"\",\"\",'[1]échos VL et génisses'!B41)","v":"ELAURA"},null,null,"",null,null,"",null,null,"",null,null,""]
[null,null,{"$f":"IF('[1]échos VL et génisses'!A42=\"\",\"\",IF('[1]échos VL et génisses'!A42=\"Total général\",\"\",'[1]échos VL et génisses'!A42))","v":"5574"},{"$f":"IF('[1]échos VL et génisses'!B42=\"\",\"\",'[1]échos VL et génisses'!B42)","v":"EUROPA"},null,null,"",null,null,"",null,null,"",null,null,""]
[null,null,{"$f":"IF('[1]échos VL et génisses'!A43=\"\",\"\",IF('[1]échos VL et génisses'!A43=\"Total général\",\"\",'[1]échos VL et génisses'!A43))","v":"5575"},{"$f":"IF('[1]échos VL et génisses'!B43=\"\",\"\",'[1]échos VL et génisses'!B43)","v":"ELSA"},null,null,"",null,null,"",null,null,"",null,null,""]
[null,null,{"$f":"IF('[1]échos VL et génisses'!A44=\"\",\"\",IF('[1]échos VL et génisses'!A44=\"Total général\",\"\",'[1]échos VL et génisses'!A44))","v":"5579"},{"$f":"IF('[1]échos VL et génisses'!B44=\"\",\"\",'[1]échos VL et génisses'!B44)","v":"ENJY"},null,null,"",null,null,"",null,null,"",null,null,""]
[null,null,{"$f":"IF('[1]échos VL et génisses'!A45=\"\",\"\",IF('[1]échos VL et génisses'!A45=\"Total général\",\"\",'[1]échos VL et génisses'!A45))","v":"5583"},{"$f":"IF('[1]échos VL et génisses'!B45=\"\",\"\",'[1]échos VL et génisses'!B45)","v":"ELODIE"},null,null,"",null,null,"",null,null,"",null,null,""]
[null,null,{"$f":"IF('[1]échos VL et génisses'!A46=\"\",\"\",IF('[1]échos VL et génisses'!A46=\"Total général\",\"\",'[1]échos VL et génisses'!A46))","v":"5588"},{"$f":"IF('[1]échos VL et génisses'!B46=\"\",\"\",'[1]échos VL et génisses'!B46)","v":"FABULEUSE"},null,null,"",null,null,"",null,null,"",null,null,""]
[null,null,{"$f":"IF('[1]échos VL et génisses'!A47=\"\",\"\",IF('[1]échos VL et génisses'!A47=\"Total général\",\"\",'[1]échos VL et génisses'!A47))","v":"5914"},{"$f":"IF('[1]échos VL et génisses'!B47=\"\",\"\",'[1]échos VL et génisses'!B47)","v":"IRIS"},null,null,"",null,null,"",null,null,"",null,null,""]
[null,null,{"$f":"IF('[1]échos VL et génisses'!A48=\"\",\"\",IF('[1]échos VL et génisses'!A48=\"Total général\",\"\",'[1]échos VL et génisses'!A48))","v":"5916"},{"$f":"IF('[1]échos VL et génisses'!B48=\"\",\"\",'[1]échos VL et génisses'!B48)","v":"IMAGE"},null,null,"",null,null,"",null,null,"",null,null,""]
[null,null,{"$f":"IF('[1]échos VL et génisses'!A49=\"\",\"\",IF('[1]échos VL et génisses'!A49=\"Total général\",\"\",'[1]échos VL et génisses'!A49))","v":"5917"},{"$f":"IF('[1]échos VL et génisses'!B49=\"\",\"\",'[1]échos VL et génisses'!B49)","v":"ITALIE"},null,null,"",null,null,"",null,null,"",null,null,""]
[null,null,{"$f":"IF('[1]échos VL et génisses'!A50=\"\",\"\",IF('[1]échos VL et génisses'!A50=\"Total général\",\"\",'[1]échos VL et génisses'!A50))","v":"5918"},{"$f":"IF('[1]échos VL et génisses'!B50=\"\",\"\",'[1]échos VL et génisses'!B50)","v":"ISIS"},null,null,"",null,null,"",null,null,"",null,null,""]
[null,null,{"$f":"IF('[1]échos VL et génisses'!A51=\"\",\"\",IF('[1]échos VL et génisses'!A51=\"Total général\",\"\",'[1]échos VL et génisses'!A51))","v":"5919"},{"$f":"IF('[1]échos VL et génisses'!B51=\"\",\"\",'[1]échos VL et génisses'!B51)","v":"ISAURE"},null,null,"",null,null,"",null,null,"",null,null,""]
[null,null,{"$f":"IF('[1]échos VL et génisses'!A52=\"\",\"\",IF('[1]échos VL et génisses'!A52=\"Total général\",\"\",'[1]échos VL et génisses'!A52))","v":"5920"},{"$f":"IF('[1]échos VL et génisses'!B52=\"\",\"\",'[1]échos VL et génisses'!B52)","v":"ILDA"},null,null,"",null,null,"",null,null,"",null,null,""]
[null,null,{"$f":"IF('[1]échos VL et génisses'!A53=\"\",\"\",IF('[1]échos VL et génisses'!A53=\"Total général\",\"\",'[1]échos VL et génisses'!A53))","v":"5921"},{"$f":"IF('[1]échos VL et génisses'!B53=\"\",\"\",'[1]échos VL et génisses'!B53)","v":"INDIA"},null,null,"",null,null,"",null,null,"",null,null,""]
[null,null,{"$f":"IF('[1]échos VL et génisses'!A54=\"\",\"\",IF('[1]échos VL et génisses'!A54=\"Total général\",\"\",'[1]échos VL et génisses'!A54))","v":"5922"},{"$f":"IF('[1]échos VL et génisses'!B54=\"\",\"\",'[1]échos VL et génisses'!B54)","v":"ICONE"},null,null,"",null,null,"",null,null,"",null,null,""]
[null,null,{"$f":"IF('[1]échos VL et génisses'!A55=\"\",\"\",IF('[1]échos VL et génisses'!A55=\"Total général\",\"\",'[1]échos VL et génisses'!A55))","v":"5924"},{"$f":"IF('[1]échos VL et génisses'!B55=\"\",\"\",'[1]échos VL et génisses'!B55)","v":"INES"},null,null,"",null,null,"",null,null,"",null,null,""]
[null,null,{"$f":"IF('[1]échos VL et génisses'!A56=\"\",\"\",IF('[1]échos VL et génisses'!A56=\"Total général\",\"\",'[1]échos VL et génisses'!A56))","v":"5925"},{"$f":"IF('[1]échos VL et génisses'!B56=\"\",\"\",'[1]échos VL et génisses'!B56)","v":"INDIANA"},null,null,"",null,null,"",null,null,"",null,null,""]
[null,null,{"$f":"IF('[1]échos VL et génisses'!A57=\"\",\"\",IF('[1]échos VL et génisses'!A57=\"Total général\",\"\",'[1]échos VL et génisses'!A57))","v":"5927"},{"$f":"IF('[1]échos VL et génisses'!B57=\"\",\"\",'[1]échos VL et génisses'!B57)","v":"IDOLE"},null,null,"",null,null,"",null,null,"",null,null,""]
[null,null,{"$f":"IF('[1]échos VL et génisses'!A58=\"\",\"\",IF('[1]échos VL et génisses'!A58=\"Total général\",\"\",'[1]échos VL et génisses'!A58))","v":"5928"},{"$f":"IF('[1]échos VL et génisses'!B58=\"\",\"\",'[1]échos VL et génisses'!B58)","v":"ILONA"},null,null,"",null,null,"",null,null,"",null,null,""]
[null,null,{"$f":"IF('[1]échos VL et génisses'!A59=\"\",\"\",IF('[1]échos VL et génisses'!A59=\"Total général\",\"\",'[1]échos VL et génisses'!A59))","v":"5929"},{"$f":"IF('[1]échos VL et génisses'!B59=\"\",\"\",'[1]échos VL et génisses'!B59)","v":"IOLA"},null,null,"",null,null,"",null,null,"",null,null,""]
[null,null,{"$f":"IF('[1]échos VL et génisses'!A60=\"\",\"\",IF('[1]échos VL et génisses'!A60=\"Total général\",\"\",'[1]échos VL et génisses'!A60))","v":"5930"},{"$f":"IF('[1]échos VL et génisses'!B60=\"\",\"\",'[1]échos VL et génisses'!B60)","v":"ILANA"},null,null,"",null,null,"",null,null,"",null,null,""]
[null,null,{"$f":"IF('[1]échos VL et génisses'!A61=\"\",\"\",IF('[1]échos VL et génisses'!A61=\"Total général\",\"\",'[1]échos VL et génisses'!A61))","v":"5931"},{"$f":"IF('[1]échos VL et génisses'!B61=\"\",\"\",'[1]échos VL et génisses'!B61)","v":"INOVA"},null,null,"",null,null,"",null,null,"",null,null,""]
[null,null,{"$f":"IF('[1]échos VL et génisses'!A62=\"\",\"\",IF('[1]échos VL et génisses'!A62=\"Total général\",\"\",'[1]échos VL et génisses'!A62))","v":"5932"},{"$f":"IF('[1]échos VL et génisses'!B62=\"\",\"\",'[1]échos VL et génisses'!B62)","v":"IDA"},null,null,"",null,null,"",null,null,"",null,null,""]
[null,null,{"$f":"IF('[1]échos VL et génisses'!A63=\"\",\"\",IF('[1]échos VL et génisses'!A63=\"Total général\",\"\",'[1]échos VL et génisses'!A63))","v":"5934"},{"$f":"IF('[1]échos VL et génisses'!B63=\"\",\"\",'[1]échos VL et génisses'!B63)","v":"ISERE"},null,null,"",null,null,"",null,null,"",null,null,""]
[null,null,{"$f":"IF('[1]échos VL et génisses'!A64=\"\",\"\",IF('[1]échos VL et génisses'!A64=\"Total général\",\"\",'[1]échos VL et génisses'!A64))","v":"5935"},{"$f":"IF('[1]échos VL et génisses'!B64=\"\",\"\",'[1]échos VL et génisses'!B64)","v":"INFUSION"},null,null,"",null,null,"",null,null,"",null,null,""]
[null,null,{"$f":"IF('[1]échos VL et génisses'!A65=\"\",\"\",IF('[1]échos VL et génisses'!A65=\"Total général\",\"\",'[1]échos VL et génisses'!A65))","v":"5936"},{"$f":"IF('[1]échos VL et génisses'!B65=\"\",\"\",'[1]échos VL et génisses'!B65)","v":"IRINA"},null,null,"",null,null,"",null,null,"",null,null,""]
[null,null,{"$f":"IF('[1]échos VL et génisses'!A66=\"\",\"\",IF('[1]échos VL et génisses'!A66=\"Total général\",\"\",'[1]échos VL et génisses'!A66))","v":"5937"},{"$f":"IF('[1]échos VL et génisses'!B66=\"\",\"\",'[1]échos VL et génisses'!B66)","v":"IMPERIALE"},null,null,"",null,null,"",null,null,"",null,null,""]
[null,null,{"$f":"IF('[1]échos VL et génisses'!A67=\"\",\"\",IF('[1]échos VL et génisses'!A67=\"Total général\",\"\",'[1]échos VL et génisses'!A67))","v":"5946"},{"$f":"IF('[1]échos VL et génisses'!B67=\"\",\"\",'[1]échos VL et génisses'!B67)","v":"JARDINE"},null,null,"",null,null,"",null,null,"",null,null,""]
[null,null,{"$f":"IF('[1]échos VL et génisses'!A68=\"\",\"\",IF('[1]échos VL et génisses'!A68=\"Total général\",\"\",'[1]échos VL et génisses'!A68))","v":"6456"},{"$f":"IF('[1]échos VL et génisses'!B68=\"\",\"\",'[1]échos VL et génisses'!B68)","v":"BATAVIA"},null,null,"",null,null,"",null,null,"",null,null,""]
[null,null,{"$f":"IF('[1]échos VL et génisses'!A69=\"\",\"\",IF('[1]échos VL et génisses'!A69=\"Total général\",\"\",'[1]échos VL et génisses'!A69))","v":"6461"},{"$f":"IF('[1]échos VL et génisses'!B69=\"\",\"\",'[1]échos VL et génisses'!B69)","v":"BABOUCHE"},null,null,"",null,null,"",null,null,"",null,null,""]
[null,null,{"$f":"IF('[1]échos VL et génisses'!A70=\"\",\"\",IF('[1]échos VL et génisses'!A70=\"Total général\",\"\",'[1]échos VL et génisses'!A70))","v":"6462"},{"$f":"IF('[1]échos VL et génisses'!B70=\"\",\"\",'[1]échos VL et génisses'!B70)","v":"BLANCHETTE"},null,null,"",null,null,"",null,null,"",null,null,""]
[null,null,{"$f":"IF('[1]échos VL et génisses'!A71=\"\",\"\",IF('[1]échos VL et génisses'!A71=\"Total général\",\"\",'[1]échos VL et génisses'!A71))","v":"6665"},{"$f":"IF('[1]échos VL et génisses'!B71=\"\",\"\",'[1]échos VL et génisses'!B71)","v":"GALINETTE"},null,null,"",null,null,"",null,null,"",null,null,""]
[null,null,{"$f":"IF('[1]échos VL et génisses'!A72=\"\",\"\",IF('[1]échos VL et génisses'!A72=\"Total général\",\"\",'[1]échos VL et génisses'!A72))","v":"6666"},{"$f":"IF('[1]échos VL et génisses'!B72=\"\",\"\",'[1]échos VL et génisses'!B72)","v":"GALIPETTE"},null,null,"",null,null,"",null,null,"",null,null,""]
[null,null,{"$f":"IF('[1]échos VL et génisses'!A73=\"\",\"\",IF('[1]échos VL et génisses'!A73=\"Total général\",\"\",'[1]échos VL et génisses'!A73))","v":"6667"},{"$f":"IF('[1]échos VL et génisses'!B73=\"\",\"\",'[1]échos VL et génisses'!B73)","v":"GIPSY"},null,null,"",null,null,"",null,null,"",null,null,""]
[null,null,{"$f":"IF('[1]échos VL et génisses'!A74=\"\",\"\",IF('[1]échos VL et génisses'!A74=\"Total général\",\"\",'[1]échos VL et génisses'!A74))","v":"6668"},{"$f":"IF('[1]échos VL et génisses'!B74=\"\",\"\",'[1]échos VL et génisses'!B74)","v":"GRACE"},null,null,{"$f":"IF(F72=3,0,\"\")","v":""},null,null,{"$f":"IF(I72=3,0,\"\")","v":""},null,null,{"$f":"IF(L72=3,0,\"\")","v":""},null,null,{"$f":"IF(O72=3,0,\"\")","v":""}]
[null,null,{"$f":"IF('[1]échos VL et génisses'!A75=\"\",\"\",IF('[1]échos VL et génisses'!A75=\"Total général\",\"\",'[1]échos VL et génisses'!A75))","v":"6669"},{"$f":"IF('[1]échos VL et génisses'!B75=\"\",\"\",'[1]échos VL et génisses'!B75)","v":"GAMINE"},null,null,"",null,null,"",null,null,"",null,null,""]
[null,null,{"$f":"IF('[1]échos VL et génisses'!A76=\"\",\"\",IF('[1]échos VL et génisses'!A76=\"Total général\",\"\",'[1]échos VL et génisses'!A76))","v":"6670"},{"$f":"IF('[1]échos VL et génisses'!B76=\"\",\"\",'[1]échos VL et génisses'!B76)","v":"GEORGIE"},null,null,"",null,null,"",null,null,"",null,null,""]
[null,null,{"$f":"IF('[1]échos VL et génisses'!A77=\"\",\"\",IF('[1]échos VL et génisses'!A77=\"Total général\",\"\",'[1]échos VL et génisses'!A77))","v":"6672"},{"$f":"IF('[1]échos VL et génisses'!B77=\"\",\"\",'[1]échos VL et génisses'!B77)","v":"GALAXIE"},null,null,"",null,null,"",null,null,"",null,null,""]
[null,null,{"$f":"IF('[1]échos VL et génisses'!A78=\"\",\"\",IF('[1]échos VL et génisses'!A78=\"Total général\",\"\",'[1]échos VL et génisses'!A78))","v":"6675"},{"$f":"IF('[1]échos VL et génisses'!B78=\"\",\"\",'[1]échos VL et génisses'!B78)","v":"GLORIA"},null,null,"",null,null,"",null,null,"",null,null,""]
[null,null,{"$f":"IF('[1]échos VL et génisses'!A79=\"\",\"\",IF('[1]échos VL et génisses'!A79=\"Total général\",\"\",'[1]échos VL et génisses'!A79))","v":"6676"},{"$f":"IF('[1]échos VL et génisses'!B79=\"\",\"\",'[1]échos VL et génisses'!B79)","v":"GINA"},null,null,"",null,null,"",null,null,"",null,null,""]
[null,null,{"$f":"IF('[1]échos VL et génisses'!A80=\"\",\"\",IF('[1]échos VL et génisses'!A80=\"Total général\",\"\",'[1]échos VL et génisses'!A80))","v":"6677"},{"$f":"IF('[1]échos VL et génisses'!B80=\"\",\"\",'[1]échos VL et génisses'!B80)","v":"GERANIUM"},null,null,"",null,null,"",null,null,"",null,null,""]
[null,null,{"$f":"IF('[1]échos VL et génisses'!A81=\"\",\"\",IF('[1]échos VL et génisses'!A81=\"Total général\",\"\",'[1]échos VL et génisses'!A81))","v":"6678"},{"$f":"IF('[1]échos VL et génisses'!B81=\"\",\"\",'[1]échos VL et génisses'!B81)","v":"GITANE"},null,null,"",null,null,"",null,null,"",null,null,""]
[null,null,{"$f":"IF('[1]échos VL et génisses'!A82=\"\",\"\",IF('[1]échos VL et génisses'!A82=\"Total général\",\"\",'[1]échos VL et génisses'!A82))","v":"6680"},{"$f":"IF('[1]échos VL et génisses'!B82=\"\",\"\",'[1]échos VL et génisses'!B82)","v":"GIGI"},null,null,"",null,null,"",null,null,"",null,null,""]
[null,null,{"$f":"IF('[1]échos VL et génisses'!A83=\"\",\"\",IF('[1]échos VL et génisses'!A83=\"Total général\",\"\",'[1]échos VL et génisses'!A83))","v":"6684"},{"$f":"IF('[1]échos VL et génisses'!B83=\"\",\"\",'[1]échos VL et génisses'!B83)","v":"GAZOLINE"},null,null,"",null,null,"",null,null,"",null,null,""]
[null,null,{"$f":"IF('[1]échos VL et génisses'!A84=\"\",\"\",IF('[1]échos VL et génisses'!A84=\"Total général\",\"\",'[1]échos VL et génisses'!A84))","v":"6685"},{"$f":"IF('[1]échos VL et génisses'!B84=\"\",\"\",'[1]échos VL et génisses'!B84)","v":"GINETTE"},null,null,"",null,null,"",null,null,"",null,null,""]
[null,null,{"$f":"IF('[1]échos VL et génisses'!A85=\"\",\"\",IF('[1]échos VL et génisses'!A85=\"Total général\",\"\",'[1]échos VL et génisses'!A85))","v":"6686"},{"$f":"IF('[1]échos VL et génisses'!B85=\"\",\"\",'[1]échos VL et génisses'!B85)","v":"GLACE"},null,null,"",null,null,"",null,null,"",null,null,""]
[null,null,{"$f":"IF('[1]échos VL et génisses'!A86=\"\",\"\",IF('[1]échos VL et génisses'!A86=\"Total général\",\"\",'[1]échos VL et génisses'!A86))","v":"6687"},{"$f":"IF('[1]échos VL et génisses'!B86=\"\",\"\",'[1]échos VL et génisses'!B86)","v":"GUESS"},null,null,"",null,null,"",null,null,"",null,null,""]
[null,null,{"$f":"IF('[1]échos VL et génisses'!A87=\"\",\"\",IF('[1]échos VL et génisses'!A87=\"Total général\",\"\",'[1]échos VL et génisses'!A87))","v":"6690"},{"$f":"IF('[1]échos VL et génisses'!B87=\"\",\"\",'[1]échos VL et génisses'!B87)","v":"(vide)"},null,null,"",null,null,"",null,null,"",null,null,""]
[null,null,{"$f":"IF('[1]échos VL et génisses'!A88=\"\",\"\",IF('[1]échos VL et génisses'!A88=\"Total général\",\"\",'[1]échos VL et génisses'!A88))","v":"6691"},{"$f":"IF('[1]échos VL et génisses'!B88=\"\",\"\",'[1]échos VL et génisses'!B88)","v":"GIORGIA"},null,null,"",null,null,"",null,null,"",null,null,""]
[null,null,{"$f":"IF('[1]échos VL et génisses'!A89=\"\",\"\",IF('[1]échos VL et génisses'!A89=\"Total général\",\"\",'[1]échos VL et génisses'!A89))","v":"6694"},{"$f":"IF('[1]échos VL et génisses'!B89=\"\",\"\",'[1]échos VL et génisses'!B89)","v":"GOMETTE"},null,null,"",null,null,"",null,null,"",null,null,""]
[null,null,{"$f":"IF('[1]échos VL et génisses'!A90=\"\",\"\",IF('[1]échos VL et génisses'!A90=\"Total général\",\"\",'[1]échos VL et génisses'!A90))","v":"9693"},{"$f":"IF('[1]échos VL et génisses'!B90=\"\",\"\",'[1]échos VL et génisses'!B90)","v":"HONDA"},null,null,"",null,null,"",null,null,"",null,null,""]
[null,null,{"$f":"IF('[1]échos VL et génisses'!A91=\"\",\"\",IF('[1]échos VL et génisses'!A91=\"Total général\",\"\",'[1]échos VL et génisses'!A91))","v":"9694"},{"$f":"IF('[1]échos VL et génisses'!B91=\"\",\"\",'[1]échos VL et génisses'!B91)","v":"HASTONIA"},null,null,"",null,null,"",null,null,"",null,null,""]
[null,null,{"$f":"IF('[1]échos VL et génisses'!A92=\"\",\"\",IF('[1]échos VL et génisses'!A92=\"Total général\",\"\",'[1]échos VL et génisses'!A92))","v":"9695"},{"$f":"IF('[1]échos VL et génisses'!B92=\"\",\"\",'[1]échos VL et génisses'!B92)","v":"HAMELIA"},null,null,"",null,null,"",null,null,"",null,null,""]
[null,null,{"$f":"IF('[1]échos VL et génisses'!A93=\"\",\"\",IF('[1]échos VL et génisses'!A93=\"Total général\",\"\",'[1]échos VL et génisses'!A93))","v":"9696"},{"$f":"IF('[1]échos VL et génisses'!B93=\"\",\"\",'[1]échos VL et génisses'!B93)","v":"HIRANA"},null,null,"",null,null,"",null,null,"",null,null,""]
[null,null,{"$f":"IF('[1]échos VL et génisses'!A94=\"\",\"\",IF('[1]échos VL et génisses'!A94=\"Total général\",\"\",'[1]échos VL et génisses'!A94))","v":"9697"},{"$f":"IF('[1]échos VL et génisses'!B94=\"\",\"\",'[1]échos VL et génisses'!B94)","v":"HALPHA"},null,null,"",null,null,"",null,null,"",null,null,""]
[null,null,{"$f":"IF('[1]échos VL et génisses'!A95=\"\",\"\",IF('[1]échos VL et génisses'!A95=\"Total général\",\"\",'[1]échos VL et génisses'!A95))","v":"9698"},{"$f":"IF('[1]échos VL et génisses'!B95=\"\",\"\",'[1]échos VL et génisses'!B95)","v":"HAJAX"},null,null,"",null,null,"",null,null,"",null,null,""]
[null,null,{"$f":"IF('[1]échos VL et génisses'!A96=\"\",\"\",IF('[1]échos VL et génisses'!A96=\"Total général\",\"\",'[1]échos VL et génisses'!A96))","v":"9699"},{"$f":"IF('[1]échos VL et génisses'!B96=\"\",\"\",'[1]échos VL et génisses'!B96)","v":"HORTENCE"},null,null,"",null,null,"",null,null,"",null,null,""]
[null,null,{"$f":"IF('[1]échos VL et génisses'!A97=\"\",\"\",IF('[1]échos VL et génisses'!A97=\"Total général\",\"\",'[1]échos VL et génisses'!A97))","v":"9700"},{"$f":"IF('[1]échos VL et génisses'!B97=\"\",\"\",'[1]échos VL et génisses'!B97)","v":"HAVANA"},null,null,"",null,null,"",null,null,"",null,null,""]
[null,null,{"$f":"IF('[1]échos VL et génisses'!A98=\"\",\"\",IF('[1]échos VL et génisses'!A98=\"Total général\",\"\",'[1]échos VL et génisses'!A98))","v":"9701"},{"$f":"IF('[1]échos VL et génisses'!B98=\"\",\"\",'[1]échos VL et génisses'!B98)","v":"HIMALAYA"},null,null,"",null,null,"",null,null,"",null,null,""]
[null,null,{"$f":"IF('[1]échos VL et génisses'!A99=\"\",\"\",IF('[1]échos VL et génisses'!A99=\"Total général\",\"\",'[1]échos VL et génisses'!A99))","v":"9704"},{"$f":"IF('[1]échos VL et génisses'!B99=\"\",\"\",'[1]échos VL et génisses'!B99)","v":"HIRIS"},null,null,"",null,null,"",null,null,"",null,null,""]
[null,null,{"$f":"IF('[1]échos VL et génisses'!A100=\"\",\"\",IF('[1]échos VL et génisses'!A100=\"Total général\",\"\",'[1]échos VL et génisses'!A100))","v":"9705"},{"$f":"IF('[1]échos VL et génisses'!B100=\"\",\"\",'[1]échos VL et génisses'!B100)","v":"HUGNY"},null,null,"",null,null,"",null,null,"",null,null,""]
[null,null,{"$f":"IF('[1]échos VL et génisses'!A101=\"\",\"\",IF('[1]échos VL et génisses'!A101=\"Total général\",\"\",'[1]échos VL et génisses'!A101))","v":"9706"},{"$f":"IF('[1]échos VL et génisses'!B101=\"\",\"\",'[1]échos VL et génisses'!B101)","v":"HADDITION"},null,null,"",null,null,"",null,null,"",null,null,""]
[null,null,{"$f":"IF('[1]échos VL et génisses'!A102=\"\",\"\",IF('[1]échos VL et génisses'!A102=\"Total général\",\"\",'[1]échos VL et génisses'!A102))","v":"9707"},{"$f":"IF('[1]échos VL et génisses'!B102=\"\",\"\",'[1]échos VL et génisses'!B102)","v":"HACHETTE"},null,null,"",null,null,"",null,null,"",null,null,""]
[null,null,{"$f":"IF('[1]échos VL et génisses'!A103=\"\",\"\",IF('[1]échos VL et génisses'!A103=\"Total général\",\"\",'[1]échos VL et génisses'!A103))","v":"9709"},{"$f":"IF('[1]échos VL et génisses'!B103=\"\",\"\",'[1]échos VL et génisses'!B103)","v":"HANASTASIA"},null,null,"",null,null,"",null,null,"",null,null,""]
[null,null,{"$f":"IF('[1]échos VL et génisses'!A104=\"\",\"\",IF('[1]échos VL et génisses'!A104=\"Total général\",\"\",'[1]échos VL et génisses'!A104))","v":"9710"},{"$f":"IF('[1]échos VL et génisses'!B104=\"\",\"\",'[1]échos VL et génisses'!B104)","v":"HINDRA"},null,null,"",null,null,"",null,null,"",null,null,""]
[null,null,{"$f":"IF('[1]échos VL et génisses'!A105=\"\",\"\",IF('[1]échos VL et génisses'!A105=\"Total général\",\"\",'[1]échos VL et génisses'!A105))","v":"9711"},{"$f":"IF('[1]échos VL et génisses'!B105=\"\",\"\",'[1]échos VL et génisses'!B105)","v":"HAUTAINE"},null,null,"",null,null,"",null,null,"",null,null,""]
[null,null,{"$f":"IF('[1]échos VL et génisses'!A106=\"\",\"\",IF('[1]échos VL et génisses'!A106=\"Total général\",\"\",'[1]échos VL et génisses'!A106))","v":"9713"},{"$f":"IF('[1]échos VL et génisses'!B106=\"\",\"\",'[1]échos VL et génisses'!B106)","v":"HANEMONE"},null,null,"",null,null,"",null,null,"",null,null,""]
[null,null,{"$f":"IF('[1]échos VL et génisses'!A107=\"\",\"\",IF('[1]échos VL et génisses'!A107=\"Total général\",\"\",'[1]échos VL et génisses'!A107))","v":"9714"},{"$f":"IF('[1]échos VL et génisses'!B107=\"\",\"\",'[1]échos VL et génisses'!B107)","v":"HALTESSE"},null,null,"",null,null,"",null,null,"",null,null,""]
[null,null,{"$f":"IF('[1]échos VL et génisses'!A108=\"\",\"\",IF('[1]échos VL et génisses'!A108=\"Total général\",\"\",'[1]échos VL et génisses'!A108))","v":"9715"},{"$f":"IF('[1]échos VL et génisses'!B108=\"\",\"\",'[1]échos VL et génisses'!B108)","v":"HACALINE"},null,null,"",null,null,"",null,null,"",null,null,""]
[null,null,{"$f":"IF('[1]échos VL et génisses'!A109=\"\",\"\",IF('[1]échos VL et génisses'!A109=\"Total général\",\"\",'[1]échos VL et génisses'!A109))","v":"9834"},{"$f":"IF('[1]échos VL et génisses'!B109=\"\",\"\",'[1]échos VL et génisses'!B109)","v":"CALINE"},null,null,"",null,null,"",null,null,"",null,null,""]
[null,null,{"$f":"IF('[1]échos VL et génisses'!A110=\"\",\"\",IF('[1]échos VL et génisses'!A110=\"Total général\",\"\",'[1]échos VL et génisses'!A110))","v":"9836"},{"$f":"IF('[1]échos VL et génisses'!B110=\"\",\"\",'[1]échos VL et génisses'!B110)","v":"CABINE"},null,null,"",null,null,"",null,null,"",null,null,""]
[null,null,{"$f":"IF('[1]échos VL et génisses'!A111=\"\",\"\",IF('[1]échos VL et génisses'!A111=\"Total général\",\"\",'[1]échos VL et génisses'!A111))","v":"9839"},{"$f":"IF('[1]échos VL et génisses'!B111=\"\",\"\",'[1]échos VL et génisses'!B111)","v":"CERISE"},null,null,"",null,null,"",null,null,"",null,null,""]
[null,null,{"$f":"IF('[1]échos VL et génisses'!A112=\"\",\"\",IF('[1]échos VL et génisses'!A112=\"Total général\",\"\",'[1]échos VL et génisses'!A112))","v":"9840"},{"$f":"IF('[1]échos VL et génisses'!B112=\"\",\"\",'[1]échos VL et génisses'!B112)","v":"CHATAIGNE"},null,null,"",null,null,"",null,null,"",null,null,""]
[null,null,{"$f":"IF('[1]échos VL et génisses'!A113=\"\",\"\",IF('[1]échos VL et génisses'!A113=\"Total général\",\"\",'[1]échos VL et génisses'!A113))","v":"9846"},{"$f":"IF('[1]échos VL et génisses'!B113=\"\",\"\",'[1]échos VL et génisses'!B113)","v":"CONCORDE"},null,null,"",null,null,"",null,null,"",null,null,""]
[null,null,{"$f":"IF('[1]échos VL et génisses'!A114=\"\",\"\",IF('[1]échos VL et génisses'!A114=\"Total général\",\"\",'[1]échos VL et génisses'!A114))","v":"9852"},{"$f":"IF('[1]échos VL et génisses'!B114=\"\",\"\",'[1]échos VL et génisses'!B114)","v":"CATALANE"},null,null,"",null,null,"",null,null,"",null,null,""]
[null,null,{"$f":"IF('[1]échos VL et génisses'!A115=\"\",\"\",IF('[1]échos VL et génisses'!A115=\"Total général\",\"\",'[1]échos VL et génisses'!A115))","v":"9853"},{"$f":"IF('[1]échos VL et génisses'!B115=\"\",\"\",'[1]échos VL et génisses'!B115)","v":"CLEMENTINE"},null,null,"",null,null,"",null,null,"",null,null,""]
[null,null,{"$f":"IF('[1]échos VL et génisses'!A116=\"\",\"\",IF('[1]échos VL et génisses'!A116=\"Total général\",\"\",'[1]échos VL et génisses'!A116))","v":"9857"},{"$f":"IF('[1]échos VL et génisses'!B116=\"\",\"\",'[1]échos VL et génisses'!B116)","v":"DIABLESSE"},null,null,"",null,null,"",null,null,"",null,null,""]
[null,null,{"$f":"IF('[1]échos VL et génisses'!A117=\"\",\"\",IF('[1]échos VL et génisses'!A117=\"Total général\",\"\",'[1]échos VL et génisses'!A117))","v":""},{"$f":"IF('[1]échos VL et génisses'!B117=\"\",\"\",'[1]échos VL et génisses'!B117)","v":""},null,null,"",null,null,"",null,null,"",null,null,""]
[null,null,{"$f":"IF('[1]échos VL et génisses'!A118=\"\",\"\",IF('[1]échos VL et génisses'!A118=\"Total général\",\"\",'[1]échos VL et génisses'!A118))","v":""},{"$f":"IF('[1]échos VL et génisses'!B118=\"\",\"\",'[1]échos VL et génisses'!B118)","v":""},null,null,"",null,null,"",null,null,"",null,null,""]
[null,null,{"$f":"IF('[1]échos VL et génisses'!A119=\"\",\"\",IF('[1]échos VL et génisses'!A119=\"Total général\",\"\",'[1]échos VL et génisses'!A119))","v":""},{"$f":"IF('[1]échos VL et génisses'!B119=\"\",\"\",'[1]échos VL et génisses'!B119)","v":""},null,null,"",null,null,"",null,null,"",null,null,""]
[null,null,{"$f":"IF('[1]échos VL et génisses'!A120=\"\",\"\",IF('[1]échos VL et génisses'!A120=\"Total général\",\"\",'[1]échos VL et génisses'!A120))","v":""},{"$f":"IF('[1]échos VL et génisses'!B120=\"\",\"\",'[1]échos VL et génisses'!B120)","v":""},null,null,"",null,null,"",null,null,"",null,null,""]
[null,null,{"$f":"IF('[1]échos VL et génisses'!A121=\"\",\"\",IF('[1]échos VL et génisses'!A121=\"Total général\",\"\",'[1]échos VL et génisses'!A121))","v":""},{"$f":"IF('[1]échos VL et génisses'!B121=\"\",\"\",'[1]échos VL et génisses'!B121)","v":""},null,null,"",null,null,"",null,null,"",null,null,""]
[null,null,{"$f":"IF('[1]échos VL et génisses'!A122=\"\",\"\",IF('[1]échos VL et génisses'!A122=\"Total général\",\"\",'[1]échos VL et génisses'!A122))","v":""},{"$f":"IF('[1]échos VL et génisses'!B122=\"\",\"\",'[1]échos VL et génisses'!B122)","v":""},null,null,"",null,null,"",null,null,"",null,null,""]
[null,null,{"$f":"IF('[1]échos VL et génisses'!A123=\"\",\"\",IF('[1]échos VL et génisses'!A123=\"Total général\",\"\",'[1]échos VL et génisses'!A123))","v":""},{"$f":"IF('[1]échos VL et génisses'!B123=\"\",\"\",'[1]échos VL et génisses'!B123)","v":""},null,null,"",null,null,"",null,null,"",null,null,""]
[null,null,{"$f":"IF('[1]échos VL et génisses'!A124=\"\",\"\",IF('[1]échos VL et génisses'!A124=\"Total général\",\"\",'[1]échos VL et génisses'!A124))","v":""},{"$f":"IF('[1]échos VL et génisses'!B124=\"\",\"\",'[1]échos VL et génisses'!B124)","v":""},null,null,"",null,null,"",null,null,"",null,null,""]
[null,null,{"$f":"IF('[1]échos VL et génisses'!A125=\"\",\"\",IF('[1]échos VL et génisses'!A125=\"Total général\",\"\",'[1]échos VL et génisses'!A125))","v":""},{"$f":"IF('[1]échos VL et génisses'!B125=\"\",\"\",'[1]échos VL et génisses'!B125)","v":""},null,null,"",null,null,"",null,null,"",null,null,""]
[null,null,{"$f":"IF('[1]échos VL et génisses'!A126=\"\",\"\",IF('[1]échos VL et génisses'!A126=\"Total général\",\"\",'[1]échos VL et génisses'!A126))","v":""},{"$f":"IF('[1]échos VL et génisses'!B126=\"\",\"\",'[1]échos VL et génisses'!B126)","v":""},null,null,"",null,null,"",null,null,"",null,null,""]
[null,null,{"$f":"IF('[1]échos VL et génisses'!A127=\"\",\"\",IF('[1]échos VL et génisses'!A127=\"Total général\",\"\",'[1]échos VL et génisses'!A127))","v":""},{"$f":"IF('[1]échos VL et génisses'!B127=\"\",\"\",'[1]échos VL et génisses'!B127)","v":""},null,null,"",null,null,"",null,null,"",null,null,""]
[null,null,{"$f":"IF('[1]échos VL et génisses'!A128=\"\",\"\",IF('[1]échos VL et génisses'!A128=\"Total général\",\"\",'[1]échos VL et génisses'!A128))","v":""},{"$f":"IF('[1]échos VL et génisses'!B128=\"\",\"\",'[1]échos VL et génisses'!B128)","v":""},null,null,"",null,null,"",null,null,"",null,null,""]
[null,null,{"$f":"IF('[1]échos VL et génisses'!A129=\"\",\"\",IF('[1]échos VL et génisses'!A129=\"Total général\",\"\",'[1]échos VL et génisses'!A129))","v":""},{"$f":"IF('[1]échos VL et génisses'!B129=\"\",\"\",'[1]échos VL et génisses'!B129)","v":""},null,null,"",null,null,"",null,null,"",null,null,""]
[null,null,{"$f":"IF('[1]échos VL et génisses'!A130=\"\",\"\",IF('[1]échos VL et génisses'!A130=\"Total général\",\"\",'[1]échos VL et génisses'!A130))","v":""},{"$f":"IF('[1]échos VL et génisses'!B130=\"\",\"\",'[1]échos VL et génisses'!B130)","v":""},null,null,"",null,null,"",null,null,"",null,null,""]
[null,null,{"$f":"IF('[1]échos VL et génisses'!A131=\"\",\"\",IF('[1]échos VL et génisses'!A131=\"Total général\",\"\",'[1]échos VL et génisses'!A131))","v":""},{"$f":"IF('[1]échos VL et génisses'!B131=\"\",\"\",'[1]échos VL et génisses'!B131)","v":""},null,null,"",null,null,"",null,null,"",null,null,""]
[null,null,{"$f":"IF('[1]échos VL et génisses'!A132=\"\",\"\",IF('[1]échos VL et génisses'!A132=\"Total général\",\"\",'[1]échos VL et génisses'!A132))","v":""},{"$f":"IF('[1]échos VL et génisses'!B132=\"\",\"\",'[1]échos VL et génisses'!B132)","v":""},null,null,"",null,null,"",null,null,"",null,null,""]
[null,null,{"$f":"IF('[1]échos VL et génisses'!A133=\"\",\"\",IF('[1]échos VL et génisses'!A133=\"Total général\",\"\",'[1]échos VL et génisses'!A133))","v":""},{"$f":"IF('[1]échos VL et génisses'!B133=\"\",\"\",'[1]échos VL et génisses'!B133)","v":""},null,null,{"$f":"IF(F131=3,0,\"\")","v":""},null,null,{"$f":"IF(I131=3,0,\"\")","v":""},null,null,{"$f":"IF(L131=3,0,\"\")","v":""},null,null,{"$f":"IF(O131=3,0,\"\")","v":""}]
[null,null,{"$f":"IF('[1]échos VL et génisses'!A134=\"\",\"\",IF('[1]échos VL et génisses'!A134=\"Total général\",\"\",'[1]échos VL et génisses'!A134))","v":""},{"$f":"IF('[1]échos VL et génisses'!B134=\"\",\"\",'[1]échos VL et génisses'!B134)","v":""},null,null,"",null,null,"",null,null,"",null,null,""]
[null,null,{"$f":"IF('[1]échos VL et génisses'!A135=\"\",\"\",IF('[1]échos VL et génisses'!A135=\"Total général\",\"\",'[1]échos VL et génisses'!A135))","v":""},{"$f":"IF('[1]échos VL et génisses'!B135=\"\",\"\",'[1]échos VL et génisses'!B135)","v":""},null,null,"",null,null,"",null,null,"",null,null,""]
[null,null,{"$f":"IF('[1]échos VL et génisses'!A136=\"\",\"\",IF('[1]échos VL et génisses'!A136=\"Total général\",\"\",'[1]échos VL et génisses'!A136))","v":""},{"$f":"IF('[1]échos VL et génisses'!B136=\"\",\"\",'[1]échos VL et génisses'!B136)","v":""},null,null,"",null,null,"",null,null,"",null,null,""]
[null,null,{"$f":"IF('[1]échos VL et génisses'!A137=\"\",\"\",IF('[1]échos VL et génisses'!A137=\"Total général\",\"\",'[1]échos VL et génisses'!A137))","v":""},{"$f":"IF('[1]échos VL et génisses'!B137=\"\",\"\",'[1]échos VL et génisses'!B137)","v":""},null,null,"",null,null,"",null,null,"",null,null,""]
[null,null,{"$f":"IF('[1]échos VL et génisses'!A138=\"\",\"\",IF('[1]échos VL et génisses'!A138=\"Total général\",\"\",'[1]échos VL et génisses'!A138))","v":""},{"$f":"IF('[1]échos VL et génisses'!B138=\"\",\"\",'[1]échos VL et génisses'!B138)","v":""},null,null,"",null,null,"",null,null,"",null,null,""]
[null,null,{"$f":"IF('[1]échos VL et génisses'!A139=\"\",\"\",IF('[1]échos VL et génisses'!A139=\"Total général\",\"\",'[1]échos VL et génisses'!A139))","v":""},{"$f":"IF('[1]échos VL et génisses'!B139=\"\",\"\",'[1]échos VL et génisses'!B139)","v":""},null,null,"",null,null,"",null,null,"",null,null,""]
[null,null,{"$f":"IF('[1]échos VL et génisses'!A140=\"\",\"\",IF('[1]échos VL et génisses'!A140=\"Total général\",\"\",'[1]échos VL et génisses'!A140))","v":""},{"$f":"IF('[1]échos VL et génisses'!B140=\"\",\"\",'[1]échos VL et génisses'!B140)","v":""},null,null,"",null,null,"",null,null,"",null,null,""]
[null,null,{"$f":"IF('[1]échos VL et génisses'!A141=\"\",\"\",IF('[1]échos VL et génisses'!A141=\"Total général\",\"\",'[1]échos VL et génisses'!A141))","v":""},{"$f":"IF('[1]échos VL et génisses'!B141=\"\",\"\",'[1]échos VL et génisses'!B141)","v":""},null,null,"",null,null,"",null,null,"",null,null,""]
[null,null,{"$f":"IF('[1]échos VL et génisses'!A142=\"\",\"\",IF('[1]échos VL et génisses'!A142=\"Total général\",\"\",'[1]échos VL et génisses'!A142))","v":""},{"$f":"IF('[1]échos VL et génisses'!B142=\"\",\"\",'[1]échos VL et génisses'!B142)","v":""},null,null,"",null,null,"",null,null,"",null,null,""]
[null,null,{"$f":"IF('[1]échos VL et génisses'!A143=\"\",\"\",IF('[1]échos VL et génisses'!A143=\"Total général\",\"\",'[1]échos VL et génisses'!A143))","v":""},{"$f":"IF('[1]échos VL et génisses'!B143=\"\",\"\",'[1]échos VL et génisses'!B143)","v":""},null,null,"",null,null,"",null,null,"",null,null,""]
[null,null,{"$f":"IF('[1]échos VL et génisses'!A144=\"\",\"\",IF('[1]échos VL et génisses'!A144=\"Total général\",\"\",'[1]échos VL et génisses'!A144))","v":""},{"$f":"IF('[1]échos VL et génisses'!B144=\"\",\"\",'[1]échos VL et génisses'!B144)","v":""},null,null,"",null,null,"",null,null,"",null,null,""]
[null,null,{"$f":"IF('[1]échos VL et génisses'!A145=\"\",\"\",IF('[1]échos VL et génisses'!A145=\"Total général\",\"\",'[1]échos VL et génisses'!A145))","v":""},{"$f":"IF('[1]échos VL et génisses'!B145=\"\",\"\",'[1]échos VL et génisses'!B145)","v":""},null,null,"",null,null,"",null,null,"",null,null,""]
[null,null,{"$f":"IF('[1]échos VL et génisses'!A146=\"\",\"\",IF('[1]échos VL et génisses'!A146=\"Total général\",\"\",'[1]échos VL et génisses'!A146))","v":""},{"$f":"IF('[1]échos VL et génisses'!B146=\"\",\"\",'[1]échos VL et génisses'!B146)","v":""},null,null,"",null,null,"",null,null,"",null,null,""]
[null,null,{"$f":"IF('[1]échos VL et génisses'!A147=\"\",\"\",IF('[1]échos VL et génisses'!A147=\"Total général\",\"\",'[1]échos VL et génisses'!A147))","v":""},{"$f":"IF('[1]échos VL et génisses'!B147=\"\",\"\",'[1]échos VL et génisses'!B147)","v":""},null,null,"",null,null,"",null,null,"",null,null,""]
[null,null,{"$f":"IF('[1]échos VL et génisses'!A148=\"\",\"\",IF('[1]échos VL et génisses'!A148=\"Total général\",\"\",'[1]échos VL et génisses'!A148))","v":""},{"$f":"IF('[1]échos VL et génisses'!B148=\"\",\"\",'[1]échos VL et génisses'!B148)","v":""},null,null,"",null,null,"",null,null,"",null,null,""]
[null,null,{"$f":"IF('[1]échos VL et génisses'!A149=\"\",\"\",IF('[1]échos VL et génisses'!A149=\"Total général\",\"\",'[1]échos VL et génisses'!A149))","v":""},{"$f":"IF('[1]échos VL et génisses'!B149=\"\",\"\",'[1]échos VL et génisses'!B149)","v":""},null,null,"",null,null,"",null,null,"",null,null,""]
[null,null,{"$f":"IF('[1]échos VL et génisses'!A150=\"\",\"\",IF('[1]échos VL et génisses'!A150=\"Total général\",\"\",'[1]échos VL et génisses'!A150))","v":""},{"$f":"IF('[1]échos VL et génisses'!B150=\"\",\"\",'[1]échos VL et génisses'!B150)","v":""},null,null,"",null,null,"",null,null,"",null,null,""]
[null,null,{"$f":"IF('[1]échos VL et génisses'!A151=\"\",\"\",IF('[1]échos VL et génisses'!A151=\"Total général\",\"\",'[1]échos VL et génisses'!A151))","v":""},{"$f":"IF('[1]échos VL et génisses'!B151=\"\",\"\",'[1]échos VL et génisses'!B151)","v":""},null,null,"",null,null,"",null,null,"",null,null,""]
[null,null,{"$f":"IF('[1]échos VL et génisses'!A152=\"\",\"\",IF('[1]échos VL et génisses'!A152=\"Total général\",\"\",'[1]échos VL et génisses'!A152))","v":""},{"$f":"IF('[1]échos VL et génisses'!B152=\"\",\"\",'[1]échos VL et génisses'!B152)","v":""},null,null,"",null,null,"",null,null,"",null,null,""]
[null,null,{"$f":"IF('[1]échos VL et génisses'!A153=\"\",\"\",IF('[1]échos VL et génisses'!A153=\"Total général\",\"\",'[1]échos VL et génisses'!A153))","v":""},{"$f":"IF('[1]échos VL et génisses'!B153=\"\",\"\",'[1]échos VL et génisses'!B153)","v":""},null,null,"",null,null,"",null,null,"",null,null,""]
[null,null,{"$f":"IF('[1]échos VL et génisses'!A154=\"\",\"\",IF('[1]échos VL et génisses'!A154=\"Total général\",\"\",'[1]échos VL et génisses'!A154))","v":""},{"$f":"IF('[1]échos VL et génisses'!B154=\"\",\"\",'[1]échos VL et génisses'!B154)","v":""},null,null,"",null,null,"",null,null,"",null,null,""]
[null,null,{"$f":"IF('[1]échos VL et génisses'!A155=\"\",\"\",IF('[1]échos VL et génisses'!A155=\"Total général\",\"\",'[1]échos VL et génisses'!A155))","v":""},{"$f":"IF('[1]échos VL et génisses'!B155=\"\",\"\",'[1]échos VL et génisses'!B155)","v":""},null,null,"",null,null,"",null,null,"",null,null,""]
[null,null,{"$f":"IF('[1]échos VL et génisses'!A156=\"\",\"\",IF('[1]échos VL et génisses'!A156=\"Total général\",\"\",'[1]échos VL et génisses'!A156))","v":""},{"$f":"IF('[1]échos VL et génisses'!B156=\"\",\"\",'[1]échos VL et génisses'!B156)","v":""},null,null,"",null,null,"",null,null,"",null,null,""]
[null,null,{"$f":"IF('[1]échos VL et génisses'!A157=\"\",\"\",IF('[1]échos VL et génisses'!A157=\"Total général\",\"\",'[1]échos VL et génisses'!A157))","v":""},{"$f":"IF('[1]échos VL et génisses'!B157=\"\",\"\",'[1]échos VL et génisses'!B157)","v":""},null,null,"",null,null,"",null,null,"",null,null,""]
[null,null,{"$f":"IF('[1]échos VL et génisses'!A158=\"\",\"\",IF('[1]échos VL et génisses'!A158=\"Total général\",\"\",'[1]échos VL et génisses'!A158))","v":""},{"$f":"IF('[1]échos VL et génisses'!B158=\"\",\"\",'[1]échos VL et génisses'!B158)","v":""},null,null,"",null,null,"",null,null,"",null,null,""]
[null,null,{"$f":"IF('[1]échos VL et génisses'!A159=\"\",\"\",IF('[1]échos VL et génisses'!A159=\"Total général\",\"\",'[1]échos VL et génisses'!A159))","v":""},{"$f":"IF('[1]échos VL et génisses'!B159=\"\",\"\",'[1]échos VL et génisses'!B159)","v":""},null,null,"",null,null,"",null,null,"",null,null,""]
[null,null,{"$f":"IF('[1]échos VL et génisses'!A160=\"\",\"\",IF('[1]échos VL et génisses'!A160=\"Total général\",\"\",'[1]échos VL et génisses'!A160))","v":""},{"$f":"IF('[1]échos VL et génisses'!B160=\"\",\"\",'[1]échos VL et génisses'!B160)","v":""},null,null,"",null,null,"",null,null,"",null,null,""]
[null,null,{"$f":"IF('[1]échos VL et génisses'!A161=\"\",\"\",IF('[1]échos VL et génisses'!A161=\"Total général\",\"\",'[1]échos VL et génisses'!A161))","v":""},{"$f":"IF('[1]échos VL et génisses'!B161=\"\",\"\",'[1]échos VL et génisses'!B161)","v":""},null,null,"",null,null,"",null,null,"",null,null,""]
[null,null,{"$f":"IF('[1]échos VL et génisses'!A162=\"\",\"\",IF('[1]échos VL et génisses'!A162=\"Total général\",\"\",'[1]échos VL et génisses'!A162))","v":""},{"$f":"IF('[1]échos VL et génisses'!B162=\"\",\"\",'[1]échos VL et génisses'!B162)","v":""},null,null,"",null,null,"",null,null,"",null,null,""]
[null,null,{"$f":"IF('[1]échos VL et génisses'!A163=\"\",\"\",IF('[1]échos VL et génisses'!A163=\"Total général\",\"\",'[1]échos VL et génisses'!A163))","v":""},{"$f":"IF('[1]échos VL et génisses'!B163=\"\",\"\",'[1]échos VL et génisses'!B163)","v":""},null,null,"",null,null,"",null,null,"",null,null,""]
[null,null,{"$f":"IF('[1]échos VL et génisses'!A164=\"\",\"\",IF('[1]échos VL et génisses'!A164=\"Total général\",\"\",'[1]échos VL et génisses'!A164))","v":""},{"$f":"IF('[1]échos VL et génisses'!B164=\"\",\"\",'[1]échos VL et génisses'!B164)","v":""},null,null,"",null,null,"",null,null,"",null,null,""]
[null,null,{"$f":"IF('[1]échos VL et génisses'!A165=\"\",\"\",IF('[1]échos VL et génisses'!A165=\"Total général\",\"\",'[1]échos VL et génisses'!A165))","v":""},{"$f":"IF('[1]échos VL et génisses'!B165=\"\",\"\",'[1]échos VL et génisses'!B165)","v":""},null,null,"",null,null,"",null,null,"",null,null,""]
[null,null,{"$f":"IF('[1]échos VL et génisses'!A166=\"\",\"\",IF('[1]échos VL et génisses'!A166=\"Total général\",\"\",'[1]échos VL et génisses'!A166))","v":""},{"$f":"IF('[1]échos VL et génisses'!B166=\"\",\"\",'[1]échos VL et génisses'!B166)","v":""},null,null,"",null,null,"",null,null,"",null,null,""]
[null,null,{"$f":"IF('[1]échos VL et génisses'!A167=\"\",\"\",IF('[1]échos VL et génisses'!A167=\"Total général\",\"\",'[1]échos VL et génisses'!A167))","v":""},{"$f":"IF('[1]échos VL et génisses'!B167=\"\",\"\",'[1]échos VL et génisses'!B167)","v":""},null,null,"",null,null,"",null,null,"",null,null,""]
[null,null,{"$f":"IF('[1]échos VL et génisses'!A168=\"\",\"\",IF('[1]échos VL et génisses'!A168=\"Total général\",\"\",'[1]échos VL et génisses'!A168))","v":""},{"$f":"IF('[1]échos VL et génisses'!B168=\"\",\"\",'[1]échos VL et génisses'!B168)","v":""},null,null,"",null,null,"",null,null,"",null,null,""]
[null,null,{"$f":"IF('[1]échos VL et génisses'!A169=\"\",\"\",IF('[1]échos VL et génisses'!A169=\"Total général\",\"\",'[1]échos VL et génisses'!A169))","v":""},{"$f":"IF('[1]échos VL et génisses'!B169=\"\",\"\",'[1]échos VL et génisses'!B169)","v":""},null,null,"",null,null,"",null,null,"",null,null,""]
[null,null,{"$f":"IF('[1]échos VL et génisses'!A170=\"\",\"\",IF('[1]échos VL et génisses'!A170=\"Total général\",\"\",'[1]échos VL et génisses'!A170))","v":""},{"$f":"IF('[1]échos VL et génisses'!B170=\"\",\"\",'[1]échos VL et génisses'!B170)","v":""},null,null,{"$f":"IF(F168=3,0,\"\")","v":""},null,null,{"$f":"IF(I168=3,0,\"\")","v":""},null,null,{"$f":"IF(L168=3,0,\"\")","v":""},null,null,{"$f":"IF(O168=3,0,\"\")","v":""}]
[null,null,{"$f":"IF('[1]échos VL et génisses'!A171=\"\",\"\",IF('[1]échos VL et génisses'!A171=\"Total général\",\"\",'[1]échos VL et génisses'!A171))","v":""},{"$f":"IF('[1]échos VL et génisses'!B171=\"\",\"\",'[1]échos VL et génisses'!B171)","v":""},null,null,"",null,null,"",null,null,"",null,null,""]
[null,null,{"$f":"IF('[1]échos VL et génisses'!A172=\"\",\"\",IF('[1]échos VL et génisses'!A172=\"Total général\",\"\",'[1]échos VL et génisses'!A172))","v":""},{"$f":"IF('[1]échos VL et génisses'!B172=\"\",\"\",'[1]échos VL et génisses'!B172)","v":""},null,null,"",null,null,"",null,null,"",null,null,""]
[null,null,{"$f":"IF('[1]échos VL et génisses'!A173=\"\",\"\",IF('[1]échos VL et génisses'!A173=\"Total général\",\"\",'[1]échos VL et génisses'!A173))","v":""},{"$f":"IF('[1]échos VL et génisses'!B173=\"\",\"\",'[1]échos VL et génisses'!B173)","v":""},null,null,"",null,null,"",null,null,"",null,null,""]
[null,null,{"$f":"IF('[1]échos VL et génisses'!A174=\"\",\"\",IF('[1]échos VL et génisses'!A174=\"Total général\",\"\",'[1]échos VL et génisses'!A174))","v":""},{"$f":"IF('[1]échos VL et génisses'!B174=\"\",\"\",'[1]échos VL et génisses'!B174)","v":""},null,null,"",null,null,"",null,null,"",null,null,""]
[null,null,{"$f":"IF('[1]échos VL et génisses'!A175=\"\",\"\",IF('[1]échos VL et génisses'!A175=\"Total général\",\"\",'[1]échos VL et génisses'!A175))","v":""},{"$f":"IF('[1]échos VL et génisses'!B175=\"\",\"\",'[1]échos VL et génisses'!B175)","v":""},null,null,"",null,null,"",null,null,"",null,null,""]
[null,null,{"$f":"IF('[1]échos VL et génisses'!A176=\"\",\"\",IF('[1]échos VL et génisses'!A176=\"Total général\",\"\",'[1]échos VL et génisses'!A176))","v":""},{"$f":"IF('[1]échos VL et génisses'!B176=\"\",\"\",'[1]échos VL et génisses'!B176)","v":""},null,null,"",null,null,"",null,null,"",null,null,""]
[null,null,{"$f":"IF('[1]échos VL et génisses'!A177=\"\",\"\",IF('[1]échos VL et génisses'!A177=\"Total général\",\"\",'[1]échos VL et génisses'!A177))","v":""},{"$f":"IF('[1]échos VL et génisses'!B177=\"\",\"\",'[1]échos VL et génisses'!B177)","v":""},null,null,"",null,null,"",null,null,"",null,null,""]
[null,null,{"$f":"IF('[1]échos VL et génisses'!A178=\"\",\"\",IF('[1]échos VL et génisses'!A178=\"Total général\",\"\",'[1]échos VL et génisses'!A178))","v":""},{"$f":"IF('[1]échos VL et génisses'!B178=\"\",\"\",'[1]échos VL et génisses'!B178)","v":""},null,null,"",null,null,"",null,null,"",null,null,""]
[null,null,{"$f":"IF('[1]échos VL et génisses'!A179=\"\",\"\",IF('[1]échos VL et génisses'!A179=\"Total général\",\"\",'[1]échos VL et génisses'!A179))","v":""},{"$f":"IF('[1]échos VL et génisses'!B179=\"\",\"\",'[1]échos VL et génisses'!B179)","v":""},null,null,"",null,null,"",null,null,"",null,null,""]
[null,null,{"$f":"IF('[1]échos VL et génisses'!A180=\"\",\"\",IF('[1]échos VL et génisses'!A180=\"Total général\",\"\",'[1]échos VL et génisses'!A180))","v":""},{"$f":"IF('[1]échos VL et génisses'!B180=\"\",\"\",'[1]échos VL et génisses'!B180)","v":""},null,null,"",null,null,"",null,null,"",null,null,""]
[null,null,{"$f":"IF('[1]échos VL et génisses'!A181=\"\",\"\",IF('[1]échos VL et génisses'!A181=\"Total général\",\"\",'[1]échos VL et génisses'!A181))","v":""},{"$f":"IF('[1]échos VL et génisses'!B181=\"\",\"\",'[1]échos VL et génisses'!B181)","v":""},null,null,"",null,null,"",null,null,"",null,null,""]
[null,null,{"$f":"IF('[1]échos VL et génisses'!A182=\"\",\"\",IF('[1]échos VL et génisses'!A182=\"Total général\",\"\",'[1]échos VL et génisses'!A182))","v":""},{"$f":"IF('[1]échos VL et génisses'!B182=\"\",\"\",'[1]échos VL et génisses'!B182)","v":""},null,null,"",null,null,"",null,null,"",null,null,""]
[null,null,{"$f":"IF('[1]échos VL et génisses'!A183=\"\",\"\",IF('[1]échos VL et génisses'!A183=\"Total général\",\"\",'[1]échos VL et génisses'!A183))","v":""},{"$f":"IF('[1]échos VL et génisses'!B183=\"\",\"\",'[1]échos VL et génisses'!B183)","v":""},null,null,"",null,null,"",null,null,"",null,null,""]
[null,null,{"$f":"IF('[1]échos VL et génisses'!A184=\"\",\"\",IF('[1]échos VL et génisses'!A184=\"Total général\",\"\",'[1]échos VL et génisses'!A184))","v":""},{"$f":"IF('[1]échos VL et génisses'!B184=\"\",\"\",'[1]échos VL et génisses'!B184)","v":""},null,null,"",null,null,"",null,null,"",null,null,""]
[null,null,{"$f":"IF('[1]échos VL et génisses'!A185=\"\",\"\",IF('[1]échos VL et génisses'!A185=\"Total général\",\"\",'[1]échos VL et génisses'!A185))","v":""},{"$f":"IF('[1]échos VL et génisses'!B185=\"\",\"\",'[1]échos VL et génisses'!B185)","v":""},null,null,"",null,null,"",null,null,"",null,null,""]
[null,null,{"$f":"IF('[1]échos VL et génisses'!A186=\"\",\"\",IF('[1]échos VL et génisses'!A186=\"Total général\",\"\",'[1]échos VL et génisses'!A186))","v":""},{"$f":"IF('[1]échos VL et génisses'!B186=\"\",\"\",'[1]échos VL et génisses'!B186)","v":""},null,null,"",null,null,"",null,null,"",null,null,""]
[null,null,{"$f":"IF('[1]échos VL et génisses'!A187=\"\",\"\",IF('[1]échos VL et génisses'!A187=\"Total général\",\"\",'[1]échos VL et génisses'!A187))","v":""},{"$f":"IF('[1]échos VL et génisses'!B187=\"\",\"\",'[1]échos VL et génisses'!B187)","v":""},null,null,"",null,null,"",null,null,"",null,null,""]
[null,null,{"$f":"IF('[1]échos VL et génisses'!A188=\"\",\"\",IF('[1]échos VL et génisses'!A188=\"Total général\",\"\",'[1]échos VL et génisses'!A188))","v":""},{"$f":"IF('[1]échos VL et génisses'!B188=\"\",\"\",'[1]échos VL et génisses'!B188)","v":""},null,null,"",null,null,"",null,null,"",null,null,""]
[null,null,{"$f":"IF('[1]échos VL et génisses'!A189=\"\",\"\",IF('[1]échos VL et génisses'!A189=\"Total général\",\"\",'[1]échos VL et génisses'!A189))","v":""},{"$f":"IF('[1]échos VL et génisses'!B189=\"\",\"\",'[1]échos VL et génisses'!B189)","v":""},null,null,"",null,null,"",null,null,"",null,null,""]
[null,null,{"$f":"IF('[1]échos VL et génisses'!A190=\"\",\"\",IF('[1]échos VL et génisses'!A190=\"Total général\",\"\",'[1]échos VL et génisses'!A190))","v":""},{"$f":"IF('[1]échos VL et génisses'!B190=\"\",\"\",'[1]échos VL et génisses'!B190)","v":""},null,null,"",null,null,"",null,null,"",null,null,""]
[null,null,{"$f":"IF('[1]échos VL et génisses'!A191=\"\",\"\",IF('[1]échos VL et génisses'!A191=\"Total général\",\"\",'[1]échos VL et génisses'!A191))","v":""},{"$f":"IF('[1]échos VL et génisses'!B191=\"\",\"\",'[1]échos VL et génisses'!B191)","v":""},null,null,"",null,null,"",null,null,"",null,null,""]
[null,null,{"$f":"IF('[1]échos VL et génisses'!A192=\"\",\"\",IF('[1]échos VL et génisses'!A192=\"Total général\",\"\",'[1]échos VL et génisses'!A192))","v":""},{"$f":"IF('[1]échos VL et génisses'!B192=\"\",\"\",'[1]échos VL et génisses'!B192)","v":""},null,null,"",null,null,"",null,null,"",null,null,""]
[null,null,{"$f":"IF('[1]échos VL et génisses'!A193=\"\",\"\",IF('[1]échos VL et génisses'!A193=\"Total général\",\"\",'[1]échos VL et génisses'!A193))","v":""},{"$f":"IF('[1]échos VL et génisses'!B193=\"\",\"\",'[1]échos VL et génisses'!B193)","v":""},null,null,"",null,null,"",null,null,"",null,null,""]
[null,null,{"$f":"IF('[1]échos VL et génisses'!A194=\"\",\"\",IF('[1]échos VL et génisses'!A194=\"Total général\",\"\",'[1]échos VL et génisses'!A194))","v":""},{"$f":"IF('[1]échos VL et génisses'!B194=\"\",\"\",'[1]échos VL et génisses'!B194)","v":""},null,null,"",null,null,"",null,null,"",null,null,""]
[null,null,{"$f":"IF('[1]échos VL et génisses'!A195=\"\",\"\",IF('[1]échos VL et génisses'!A195=\"Total général\",\"\",'[1]échos VL et génisses'!A195))","v":""},{"$f":"IF('[1]échos VL et génisses'!B195=\"\",\"\",'[1]échos VL et génisses'!B195)","v":""},null,null,"",null,null,"",null,null,"",null,null,""]
[null,null,{"$f":"IF('[1]échos VL et génisses'!A196=\"\",\"\",IF('[1]échos VL et génisses'!A196=\"Total général\",\"\",'[1]échos VL et génisses'!A196))","v":""},{"$f":"IF('[1]échos VL et génisses'!B196=\"\",\"\",'[1]échos VL et génisses'!B196)","v":""},null,null,"",null,null,"",null,null,"",null,null,""]
[null,null,{"$f":"IF('[1]échos VL et génisses'!A197=\"\",\"\",IF('[1]échos VL et génisses'!A197=\"Total général\",\"\",'[1]échos VL et génisses'!A197))","v":""},{"$f":"IF('[1]échos VL et génisses'!B197=\"\",\"\",'[1]échos VL et génisses'!B197)","v":""},null,null,"",null,null,"",null,null,"",null,null,""]
[null,null,{"$f":"IF('[1]échos VL et génisses'!A198=\"\",\"\",IF('[1]échos VL et génisses'!A198=\"Total général\",\"\",'[1]échos VL et génisses'!A198))","v":""},{"$f":"IF('[1]échos VL et génisses'!B198=\"\",\"\",'[1]échos VL et génisses'!B198)","v":""},null,null,"",null,null,"",null,null,"",null,null,""]
[null,null,{"$f":"IF('[1]échos VL et génisses'!A199=\"\",\"\",IF('[1]échos VL et génisses'!A199=\"Total général\",\"\",'[1]échos VL et génisses'!A199))","v":""},{"$f":"IF('[1]échos VL et génisses'!B199=\"\",\"\",'[1]échos VL et génisses'!B199)","v":""},null,null,"",null,null,"",null,null,"",null,null,""]
[null,null,{"$f":"IF('[1]échos VL et génisses'!A200=\"\",\"\",IF('[1]échos VL et génisses'!A200=\"Total général\",\"\",'[1]échos VL et génisses'!A200))","v":""},{"$f":"IF('[1]échos VL et génisses'!B200=\"\",\"\",'[1]échos VL et génisses'!B200)","v":""},null,null,"",null,null,"",null,null,"",null,null,""]
[null,null,{"$f":"IF('[1]échos VL et génisses'!A201=\"\",\"\",IF('[1]échos VL et génisses'!A201=\"Total général\",\"\",'[1]échos VL et génisses'!A201))","v":""},{"$f":"IF('[1]échos VL et génisses'!B201=\"\",\"\",'[1]échos VL et génisses'!B201)","v":""},null,null,"",null,null,"",null,null,"",null,null,""]
[null,null,{"$f":"IF('[1]échos VL et génisses'!A202=\"\",\"\",IF('[1]échos VL et génisses'!A202=\"Total général\",\"\",'[1]échos VL et génisses'!A202))","v":""},{"$f":"IF('[1]échos VL et génisses'!B202=\"\",\"\",'[1]échos VL et génisses'!B202)","v":""},null,null,"",null,null,"",null,null,"",null,null,""]
[null,null,{"$f":"IF('[1]échos VL et génisses'!A203=\"\",\"\",IF('[1]échos VL et génisses'!A203=\"Total général\",\"\",'[1]échos VL et génisses'!A203))","v":""},{"$f":"IF('[1]échos VL et génisses'!B203=\"\",\"\",'[1]échos VL et génisses'!B203)","v":""},null,null,"",null,null,"",null,null,"",null,null,""]
[null,null,{"$f":"IF('[1]échos VL et génisses'!A204=\"\",\"\",IF('[1]échos VL et génisses'!A204=\"Total général\",\"\",'[1]échos VL et génisses'!A204))","v":""},{"$f":"IF('[1]échos VL et génisses'!B204=\"\",\"\",'[1]échos VL et génisses'!B204)","v":""},null,null,"",null,null,"",null,null,"",null,null,""]
[null,null,{"$f":"IF('[1]échos VL et génisses'!A205=\"\",\"\",IF('[1]échos VL et génisses'!A205=\"Total général\",\"\",'[1]échos VL et génisses'!A205))","v":""},{"$f":"IF('[1]échos VL et génisses'!B205=\"\",\"\",'[1]échos VL et génisses'!B205)","v":""},null,null,"",null,null,"",null,null,"",null,null,""]
[null,null,{"$f":"IF('[1]échos VL et génisses'!A206=\"\",\"\",IF('[1]échos VL et génisses'!A206=\"Total général\",\"\",'[1]échos VL et génisses'!A206))","v":""},{"$f":"IF('[1]échos VL et génisses'!B206=\"\",\"\",'[1]échos VL et génisses'!B206)","v":""},null,null,"",null,null,"",null,null,"",null,null,""]
[null,null,{"$f":"IF('[1]échos VL et génisses'!A207=\"\",\"\",IF('[1]échos VL et génisses'!A207=\"Total général\",\"\",'[1]échos VL et génisses'!A207))","v":""},{"$f":"IF('[1]échos VL et génisses'!B207=\"\",\"\",'[1]échos VL et génisses'!B207)","v":""},null,null,"",null,null,"",null,null,"",null,null,""]
[null,null,{"$f":"IF('[1]échos VL et génisses'!A208=\"\",\"\",IF('[1]échos VL et génisses'!A208=\"Total général\",\"\",'[1]échos VL et génisses'!A208))","v":""},{"$f":"IF('[1]échos VL et génisses'!B208=\"\",\"\",'[1]échos VL et génisses'!B208)","v":""},null,null,"",null,null,"",null,null,"",null,null,""]
[null,null,{"$f":"IF('[1]échos VL et génisses'!A209=\"\",\"\",IF('[1]échos VL et génisses'!A209=\"Total général\",\"\",'[1]échos VL et génisses'!A209))","v":""},{"$f":"IF('[1]échos VL et génisses'!B209=\"\",\"\",'[1]échos VL et génisses'!B209)","v":""},null,null,"",null,null,"",null,null,"",null,null,""]
[null,null,{"$f":"IF('[1]échos VL et génisses'!A210=\"\",\"\",IF('[1]échos VL et génisses'!A210=\"Total général\",\"\",'[1]échos VL et génisses'!A210))","v":""},{"$f":"IF('[1]échos VL et génisses'!B210=\"\",\"\",'[1]échos VL et génisses'!B210)","v":""},null,null,"",null,null,"",null,null,"",null,null,""]
[null,null,{"$f":"IF('[1]échos VL et génisses'!A211=\"\",\"\",IF('[1]échos VL et génisses'!A211=\"Total général\",\"\",'[1]échos VL et génisses'!A211))","v":""},{"$f":"IF('[1]échos VL et génisses'!B211=\"\",\"\",'[1]échos VL et génisses'!B211)","v":""},null,null,"",null,null,"",null,null,"",null,null,""]
[null,null,{"$f":"IF('[1]échos VL et génisses'!A212=\"\",\"\",IF('[1]échos VL et génisses'!A212=\"Total général\",\"\",'[1]échos VL et génisses'!A212))","v":""},{"$f":"IF('[1]échos VL et génisses'!B212=\"\",\"\",'[1]échos VL et génisses'!B212)","v":""},null,null,"",null,null,"",null,null,"",null,null,""]
[null,null,{"$f":"IF('[1]échos VL et génisses'!A213=\"\",\"\",IF('[1]échos VL et génisses'!A213=\"Total général\",\"\",'[1]échos VL et génisses'!A213))","v":""},{"$f":"IF('[1]échos VL et génisses'!B213=\"\",\"\",'[1]échos VL et génisses'!B213)","v":""},null,null,"",null,null,"",null,null,"",null,null,""]
[null,null,{"$f":"IF('[1]échos VL et génisses'!A214=\"\",\"\",IF('[1]échos VL et génisses'!A214=\"Total général\",\"\",'[1]échos VL et génisses'!A214))","v":""},{"$f":"IF('[1]échos VL et génisses'!B214=\"\",\"\",'[1]échos VL et génisses'!B214)","v":""},null,null,"",null,null,"",null,null,"",null,null,""]
[null,null,{"$f":"IF('[1]échos VL et génisses'!A215=\"\",\"\",IF('[1]échos VL et génisses'!A215=\"Total général\",\"\",'[1]échos VL et génisses'!A215))","v":""},{"$f":"IF('[1]échos VL et génisses'!B215=\"\",\"\",'[1]échos VL et génisses'!B215)","v":""},null,null,{"$f":"IF(F213=3,0,\"\")","v":""},null,null,{"$f":"IF(I213=3,0,\"\")","v":""},null,null,{"$f":"IF(L213=3,0,\"\")","v":""},null,null,{"$f":"IF(O213=3,0,\"\")","v":""}]
[null,null,{"$f":"IF('[1]échos VL et génisses'!A216=\"\",\"\",IF('[1]échos VL et génisses'!A216=\"Total général\",\"\",'[1]échos VL et génisses'!A216))","v":""},{"$f":"IF('[1]échos VL et génisses'!B216=\"\",\"\",'[1]échos VL et génisses'!B216)","v":""},null,null,"",null,null,"",null,null,"",null,null,""]
[null,null,{"$f":"IF('[1]échos VL et génisses'!A217=\"\",\"\",IF('[1]échos VL et génisses'!A217=\"Total général\",\"\",'[1]échos VL et génisses'!A217))","v":""},{"$f":"IF('[1]échos VL et génisses'!B217=\"\",\"\",'[1]échos VL et génisses'!B217)","v":""},null,null,"",null,null,"",null,null,"",null,null,""]
[null,null,{"$f":"IF('[1]échos VL et génisses'!A218=\"\",\"\",IF('[1]échos VL et génisses'!A218=\"Total général\",\"\",'[1]échos VL et génisses'!A218))","v":""},{"$f":"IF('[1]échos VL et génisses'!B218=\"\",\"\",'[1]échos VL et génisses'!B218)","v":""},null,null,"",null,null,"",null,null,"",null,null,""]
[null,null,{"$f":"IF('[1]échos VL et génisses'!A219=\"\",\"\",IF('[1]échos VL et génisses'!A219=\"Total général\",\"\",'[1]échos VL et génisses'!A219))","v":""},{"$f":"IF('[1]échos VL et génisses'!B219=\"\",\"\",'[1]échos VL et génisses'!B219)","v":""},null,null,"",null,null,"",null,null,"",null,null,""]
[null,null,{"$f":"IF('[1]échos VL et génisses'!A220=\"\",\"\",IF('[1]échos VL et génisses'!A220=\"Total général\",\"\",'[1]échos VL et génisses'!A220))","v":""},{"$f":"IF('[1]échos VL et génisses'!B220=\"\",\"\",'[1]échos VL et génisses'!B220)","v":""},null,null,"",null,null,"",null,null,"",null,null,""]
[null,null,{"$f":"IF('[1]échos VL et génisses'!A221=\"\",\"\",IF('[1]échos VL et génisses'!A221=\"Total général\",\"\",'[1]échos VL et génisses'!A221))","v":""},{"$f":"IF('[1]échos VL et génisses'!B221=\"\",\"\",'[1]échos VL et génisses'!B221)","v":""},null,null,"",null,null,"",null,null,"",null,null,""]
[null,null,{"$f":"IF('[1]échos VL et génisses'!A222=\"\",\"\",IF('[1]échos VL et génisses'!A222=\"Total général\",\"\",'[1]échos VL et génisses'!A222))","v":""},{"$f":"IF('[1]échos VL et génisses'!B222=\"\",\"\",'[1]échos VL et génisses'!B222)","v":""},null,null,"",null,null,"",null,null,"",null,null,""]
[null,null,{"$f":"IF('[1]échos VL et génisses'!A223=\"\",\"\",IF('[1]échos VL et génisses'!A223=\"Total général\",\"\",'[1]échos VL et génisses'!A223))","v":""},{"$f":"IF('[1]échos VL et génisses'!B223=\"\",\"\",'[1]échos VL et génisses'!B223)","v":""},null,null,"",null,null,"",null,null,"",null,null,""]
[null,null,{"$f":"IF('[1]échos VL et génisses'!A224=\"\",\"\",IF('[1]échos VL et génisses'!A224=\"Total général\",\"\",'[1]échos VL et génisses'!A224))","v":""},{"$f":"IF('[1]échos VL et génisses'!B224=\"\",\"\",'[1]échos VL et génisses'!B224)","v":""},null,null,"",null,null,"",null,null,"",null,null,""]
[null,null,{"$f":"IF('[1]échos VL et génisses'!A225=\"\",\"\",IF('[1]échos VL et génisses'!A225=\"Total général\",\"\",'[1]échos VL et génisses'!A225))","v":""},{"$f":"IF('[1]échos VL et génisses'!B225=\"\",\"\",'[1]échos VL et génisses'!B225)","v":""},null,null,{"$f":"IF(F223=3,0,\"\")","v":""},null,null,{"$f":"IF(I223=3,0,\"\")","v":""},null,null,{"$f":"IF(L223=3,0,\"\")","v":""},null,null,{"$f":"IF(O223=3,0,\"\")","v":""}]
[null,null,{"$f":"IF('[1]échos VL et génisses'!A226=\"\",\"\",IF('[1]échos VL et génisses'!A226=\"Total général\",\"\",'[1]échos VL et génisses'!A226))","v":""},{"$f":"IF('[1]échos VL et génisses'!B226=\"\",\"\",'[1]échos VL et génisses'!B226)","v":""},null,null,{"$f":"IF(F224=3,0,\"\")","v":""},null,null,{"$f":"IF(I224=3,0,\"\")","v":""},null,null,{"$f":"IF(L224=3,0,\"\")","v":""},null,null,{"$f":"IF(O224=3,0,\"\")","v":""}]
[null,null,{"$f":"IF('[1]échos VL et génisses'!A227=\"\",\"\",IF('[1]échos VL et génisses'!A227=\"Total général\",\"\",'[1]échos VL et génisses'!A227))","v":""},{"$f":"IF('[1]échos VL et génisses'!B227=\"\",\"\",'[1]échos VL et génisses'!B227)","v":""},null,null,{"$f":"IF(F225=3,0,\"\")","v":""},null,null,{"$f":"IF(I225=3,0,\"\")","v":""},null,null,{"$f":"IF(L225=3,0,\"\")","v":""},null,null,{"$f":"IF(O225=3,0,\"\")","v":""}]
[null,null,{"$f":"IF('[1]échos VL et génisses'!A228=\"\",\"\",IF('[1]échos VL et génisses'!A228=\"Total général\",\"\",'[1]échos VL et génisses'!A228))","v":""},{"$f":"IF('[1]échos VL et génisses'!B228=\"\",\"\",'[1]échos VL et génisses'!B228)","v":""},null,null,{"$f":"IF(F226=3,0,\"\")","v":""},null,null,{"$f":"IF(I226=3,0,\"\")","v":""},null,null,{"$f":"IF(L226=3,0,\"\")","v":""},null,null,{"$f":"IF(O226=3,0,\"\")","v":""}]
[null,null,{"$f":"IF('[1]échos VL et génisses'!A229=\"\",\"\",IF('[1]échos VL et génisses'!A229=\"Total général\",\"\",'[1]échos VL et génisses'!A229))","v":""},{"$f":"IF('[1]échos VL et génisses'!B229=\"\",\"\",'[1]échos VL et génisses'!B229)","v":""},null,null,{"$f":"IF(F227=3,0,\"\")","v":""},null,null,{"$f":"IF(I227=3,0,\"\")","v":""},null,null,{"$f":"IF(L227=3,0,\"\")","v":""},null,null,{"$f":"IF(O227=3,0,\"\")","v":""}]
[null,null,{"$f":"IF('[1]échos VL et génisses'!A230=\"\",\"\",IF('[1]échos VL et génisses'!A230=\"Total général\",\"\",'[1]échos VL et génisses'!A230))","v":""},{"$f":"IF('[1]échos VL et génisses'!B230=\"\",\"\",'[1]échos VL et génisses'!B230)","v":""},null,null,"",null,null,"",null,null,"",null,null,""]
[null,null,{"$f":"IF('[1]échos VL et génisses'!A231=\"\",\"\",IF('[1]échos VL et génisses'!A231=\"Total général\",\"\",'[1]échos VL et génisses'!A231))","v":""},{"$f":"IF('[1]échos VL et génisses'!B231=\"\",\"\",'[1]échos VL et génisses'!B231)","v":""},null,null,"",null,null,"",null,null,"",null,null,""]
[null,null,{"$f":"IF('[1]échos VL et génisses'!A232=\"\",\"\",IF('[1]échos VL et génisses'!A232=\"Total général\",\"\",'[1]échos VL et génisses'!A232))","v":""},{"$f":"IF('[1]échos VL et génisses'!B232=\"\",\"\",'[1]échos VL et génisses'!B232)","v":""},null,null,"",null,null,"",null,null,"",null,null,""]
[null,null,{"$f":"IF('[1]échos VL et génisses'!A233=\"\",\"\",IF('[1]échos VL et génisses'!A233=\"Total général\",\"\",'[1]échos VL et génisses'!A233))","v":""},{"$f":"IF('[1]échos VL et génisses'!B233=\"\",\"\",'[1]échos VL et génisses'!B233)","v":""},null,null,"",null,null,"",null,null,"",null,null,""]
[null,null,{"$f":"IF('[1]échos VL et génisses'!A234=\"\",\"\",IF('[1]échos VL et génisses'!A234=\"Total général\",\"\",'[1]échos VL et génisses'!A234))","v":""},{"$f":"IF('[1]échos VL et génisses'!B234=\"\",\"\",'[1]échos VL et génisses'!B234)","v":""},null,null,"",null,null,"",null,null,"",null,null,""]
[null,null,{"$f":"IF('[1]échos VL et génisses'!A235=\"\",\"\",IF('[1]échos VL et génisses'!A235=\"Total général\",\"\",'[1]échos VL et génisses'!A235))","v":""},{"$f":"IF('[1]échos VL et génisses'!B235=\"\",\"\",'[1]échos VL et génisses'!B235)","v":""},null,null,"",null,null,"",null,null,"",null,null,""]
[null,null,{"$f":"IF('[1]échos VL et génisses'!A236=\"\",\"\",IF('[1]échos VL et génisses'!A236=\"Total général\",\"\",'[1]échos VL et génisses'!A236))","v":""},{"$f":"IF('[1]échos VL et génisses'!B236=\"\",\"\",'[1]échos VL et génisses'!B236)","v":""},null,null,"",null,null,"",null,null,"",null,null,""]
[null,null,{"$f":"IF('[1]échos VL et génisses'!A237=\"\",\"\",IF('[1]échos VL et génisses'!A237=\"Total général\",\"\",'[1]échos VL et génisses'!A237))","v":""},{"$f":"IF('[1]échos VL et génisses'!B237=\"\",\"\",'[1]échos VL et génisses'!B237)","v":""},null,null,"",null,null,"",null,null,"",null,null,""]
[null,null,{"$f":"IF('[1]échos VL et génisses'!A238=\"\",\"\",IF('[1]échos VL et génisses'!A238=\"Total général\",\"\",'[1]échos VL et génisses'!A238))","v":""},{"$f":"IF('[1]échos VL et génisses'!B238=\"\",\"\",'[1]échos VL et génisses'!B238)","v":""},null,null,"",null,null,"",null,null,"",null,null,""]
[null,null,{"$f":"IF('[1]échos VL et génisses'!A239=\"\",\"\",IF('[1]échos VL et génisses'!A239=\"Total général\",\"\",'[1]échos VL et génisses'!A239))","v":""},{"$f":"IF('[1]échos VL et génisses'!B239=\"\",\"\",'[1]échos VL et génisses'!B239)","v":""},null,null,"",null,null,"",null,null,"",null,null,""]
[null,null,{"$f":"IF('[1]échos VL et génisses'!A240=\"\",\"\",IF('[1]échos VL et génisses'!A240=\"Total général\",\"\",'[1]échos VL et génisses'!A240))","v":""},{"$f":"IF('[1]échos VL et génisses'!B240=\"\",\"\",'[1]échos VL et génisses'!B240)","v":""},null,null,"",null,null,"",null,null,"",null,null,""]
[null,null,{"$f":"IF('[1]échos VL et génisses'!A241=\"\",\"\",IF('[1]échos VL et génisses'!A241=\"Total général\",\"\",'[1]échos VL et génisses'!A241))","v":""},{"$f":"IF('[1]échos VL et génisses'!B241=\"\",\"\",'[1]échos VL et génisses'!B241)","v":""},null,null,"",null,null,"",null,null,"",null,null,""]
[null,null,{"$f":"IF('[1]échos VL et génisses'!A242=\"\",\"\",IF('[1]échos VL et génisses'!A242=\"Total général\",\"\",'[1]échos VL et génisses'!A242))","v":""},{"$f":"IF('[1]échos VL et génisses'!B242=\"\",\"\",'[1]échos VL et génisses'!B242)","v":""},null,null,"",null,null,"",null,null,"",null,null,""]
[null,null,{"$f":"IF('[1]échos VL et génisses'!A243=\"\",\"\",IF('[1]échos VL et génisses'!A243=\"Total général\",\"\",'[1]échos VL et génisses'!A243))","v":""},{"$f":"IF('[1]échos VL et génisses'!B243=\"\",\"\",'[1]échos VL et génisses'!B243)","v":""},null,null,"",null,null,"",null,null,"",null,null,""]
[null,null,{"$f":"IF('[1]échos VL et génisses'!A244=\"\",\"\",IF('[1]échos VL et génisses'!A244=\"Total général\",\"\",'[1]échos VL et génisses'!A244))","v":""},{"$f":"IF('[1]échos VL et génisses'!B244=\"\",\"\",'[1]échos VL et génisses'!B244)","v":""},null,null,"",null,null,"",null,null,"",null,null,""]
[null,null,{"$f":"IF('[1]échos VL et génisses'!A245=\"\",\"\",IF('[1]échos VL et génisses'!A245=\"Total général\",\"\",'[1]échos VL et génisses'!A245))","v":""},{"$f":"IF('[1]échos VL et génisses'!B245=\"\",\"\",'[1]échos VL et génisses'!B245)","v":""},null,null,"",null,null,"",null,null,"",null,null,""]
[null,null,{"$f":"IF('[1]échos VL et génisses'!A246=\"\",\"\",IF('[1]échos VL et génisses'!A246=\"Total général\",\"\",'[1]échos VL et génisses'!A246))","v":""},{"$f":"IF('[1]échos VL et génisses'!B246=\"\",\"\",'[1]échos VL et génisses'!B246)","v":""},null,null,"",null,null,"",null,null,"",null,null,""]
[null,null,{"$f":"IF('[1]échos VL et génisses'!A247=\"\",\"\",IF('[1]échos VL et génisses'!A247=\"Total général\",\"\",'[1]échos VL et génisses'!A247))","v":""},{"$f":"IF('[1]échos VL et génisses'!B247=\"\",\"\",'[1]échos VL et génisses'!B247)","v":""},null,null,"",null,null,"",null,null,"",null,null,""]
[null,null,{"$f":"IF('[1]échos VL et génisses'!A248=\"\",\"\",IF('[1]échos VL et génisses'!A248=\"Total général\",\"\",'[1]échos VL et génisses'!A248))","v":""},{"$f":"IF('[1]échos VL et génisses'!B248=\"\",\"\",'[1]échos VL et génisses'!B248)","v":""},null,null,"",null,null,"",null,null,"",null,null,""]
[null,null,{"$f":"IF('[1]échos VL et génisses'!A249=\"\",\"\",IF('[1]échos VL et génisses'!A249=\"Total général\",\"\",'[1]échos VL et génisses'!A249))","v":""},{"$f":"IF('[1]échos VL et génisses'!B249=\"\",\"\",'[1]échos VL et génisses'!B249)","v":""},null,null,"",null,null,"",null,null,"",null,null,""]
[null,null,{"$f":"IF('[1]échos VL et génisses'!A250=\"\",\"\",IF('[1]échos VL et génisses'!A250=\"Total général\",\"\",'[1]échos VL et génisses'!A250))","v":""},{"$f":"IF('[1]échos VL et génisses'!B250=\"\",\"\",'[1]échos VL et génisses'!B250)","v":""},null,null,"",null,null,"",null,null,"",null,null,""]
[null,null,{"$f":"IF('[1]échos VL et génisses'!A251=\"\",\"\",IF('[1]échos VL et génisses'!A251=\"Total général\",\"\",'[1]échos VL et génisses'!A251))","v":""},{"$f":"IF('[1]échos VL et génisses'!B251=\"\",\"\",'[1]échos VL et génisses'!B251)","v":""},null,null,"",null,null,"",null,null,"",null,null,""]
[null,null,{"$f":"IF('[1]échos VL et génisses'!A252=\"\",\"\",IF('[1]échos VL et génisses'!A252=\"Total général\",\"\",'[1]échos VL et génisses'!A252))","v":""},{"$f":"IF('[1]échos VL et génisses'!B252=\"\",\"\",'[1]échos VL et génisses'!B252)","v":""},null,null,"",null,null,"",null,null,"",null,null,""]
[null,null,{"$f":"IF('[1]échos VL et génisses'!A253=\"\",\"\",IF('[1]échos VL et génisses'!A253=\"Total général\",\"\",'[1]échos VL et génisses'!A253))","v":""},{"$f":"IF('[1]échos VL et génisses'!B253=\"\",\"\",'[1]échos VL et génisses'!B253)","v":""},null,null,"",null,null,"",null,null,"",null,null,""]
[null,null,{"$f":"IF('[1]échos VL et génisses'!A254=\"\",\"\",IF('[1]échos VL et génisses'!A254=\"Total général\",\"\",'[1]échos VL et génisses'!A254))","v":""},{"$f":"IF('[1]échos VL et génisses'!B254=\"\",\"\",'[1]échos VL et génisses'!B254)","v":""},null,null,"",null,null,"",null,null,"",null,null,""]
[null,null,{"$f":"IF('[1]échos VL et génisses'!A255=\"\",\"\",IF('[1]échos VL et génisses'!A255=\"Total général\",\"\",'[1]échos VL et génisses'!A255))","v":""},{"$f":"IF('[1]échos VL et génisses'!B255=\"\",\"\",'[1]échos VL et génisses'!B255)","v":""},null,null,"",null,null,"",null,null,"",null,null,""]
[null,null,{"$f":"IF('[1]échos VL et génisses'!A256=\"\",\"\",IF('[1]échos VL et génisses'!A256=\"Total général\",\"\",'[1]échos VL et génisses'!A256))","v":""},{"$f":"IF('[1]échos VL et génisses'!B256=\"\",\"\",'[1]échos VL et génisses'!B256)","v":""},null,null,"",null,null,"",null,null,"",null,null,""]
[null,null,{"$f":"IF('[1]échos VL et génisses'!A257=\"\",\"\",IF('[1]échos VL et génisses'!A257=\"Total général\",\"\",'[1]échos VL et génisses'!A257))","v":""},{"$f":"IF('[1]échos VL et génisses'!B257=\"\",\"\",'[1]échos VL et génisses'!B257)","v":""},null,null,"",null,null,"",null,null,"",null,null,""]
[null,null,{"$f":"IF('[1]échos VL et génisses'!A258=\"\",\"\",IF('[1]échos VL et génisses'!A258=\"Total général\",\"\",'[1]échos VL et génisses'!A258))","v":""},{"$f":"IF('[1]échos VL et génisses'!B258=\"\",\"\",'[1]échos VL et génisses'!B258)","v":""},null,null,"",null,null,"",null,null,"",null,null,""]
[null,null,{"$f":"IF('[1]échos VL et génisses'!A259=\"\",\"\",IF('[1]échos VL et génisses'!A259=\"Total général\",\"\",'[1]échos VL et génisses'!A259))","v":""},{"$f":"IF('[1]échos VL et génisses'!B259=\"\",\"\",'[1]échos VL et génisses'!B259)","v":""},null,null,"",null,null,"",null,null,"",null,null,""]
[null,null,{"$f":"IF('[1]échos VL et génisses'!A260=\"\",\"\",IF('[1]échos VL et génisses'!A260=\"Total général\",\"\",'[1]échos VL et génisses'!A260))","v":""},{"$f":"IF('[1]échos VL et génisses'!B260=\"\",\"\",'[1]échos VL et génisses'!B260)","v":""},null,null,"",null,null,"",null,null,"",null,null,""]
[null,null,{"$f":"IF('[1]échos VL et génisses'!A261=\"\",\"\",IF('[1]échos VL et génisses'!A261=\"Total général\",\"\",'[1]échos VL et génisses'!A261))","v":""},{"$f":"IF('[1]échos VL et génisses'!B261=\"\",\"\",'[1]échos VL et génisses'!B261)","v":""},null,null,{"$f":"IF(F259=3,0,\"\")","v":""},null,null,{"$f":"IF(I259=3,0,\"\")","v":""},null,null,{"$f":"IF(L259=3,0,\"\")","v":""},null,null,{"$f":"IF(O259=3,0,\"\")","v":""}]
[null,null,{"$f":"IF('[1]échos VL et génisses'!A262=\"\",\"\",IF('[1]échos VL et génisses'!A262=\"Total général\",\"\",'[1]échos VL et génisses'!A262))","v":""},{"$f":"IF('[1]échos VL et génisses'!B262=\"\",\"\",'[1]échos VL et génisses'!B262)","v":""},null,null,{"$f":"IF(F260=3,0,\"\")","v":""},null,null,{"$f":"IF(I260=3,0,\"\")","v":""},null,null,{"$f":"IF(L260=3,0,\"\")","v":""},null,null,{"$f":"IF(O260=3,0,\"\")","v":""}]
[null,null,{"$f":"IF('[1]échos VL et génisses'!A263=\"\",\"\",IF('[1]échos VL et génisses'!A263=\"Total général\",\"\",'[1]échos VL et génisses'!A263))","v":""},{"$f":"IF('[1]échos VL et génisses'!B263=\"\",\"\",'[1]échos VL et génisses'!B263)","v":""},null,null,{"$f":"IF(F261=3,0,\"\")","v":""},null,null,{"$f":"IF(I261=3,0,\"\")","v":""},null,null,{"$f":"IF(L261=3,0,\"\")","v":""},null,null,{"$f":"IF(O261=3,0,\"\")","v":""}]
[null,null,{"$f":"IF('[1]échos VL et génisses'!A264=\"\",\"\",IF('[1]échos VL et génisses'!A264=\"Total général\",\"\",'[1]échos VL et génisses'!A264))","v":""},{"$f":"IF('[1]échos VL et génisses'!B264=\"\",\"\",'[1]échos VL et génisses'!B264)","v":""},null,null,{"$f":"IF(F262=3,0,\"\")","v":""},null,null,{"$f":"IF(I262=3,0,\"\")","v":""},null,null,{"$f":"IF(L262=3,0,\"\")","v":""},null,null,{"$f":"IF(O262=3,0,\"\")","v":""}]
[null,null,{"$f":"IF('[1]échos VL et génisses'!A265=\"\",\"\",IF('[1]échos VL et génisses'!A265=\"Total général\",\"\",'[1]échos VL et génisses'!A265))","v":""},{"$f":"IF('[1]échos VL et génisses'!B265=\"\",\"\",'[1]échos VL et génisses'!B265)","v":""},null,null,{"$f":"IF(F263=3,0,\"\")","v":""},null,null,{"$f":"IF(I263=3,0,\"\")","v":""},null,null,{"$f":"IF(L263=3,0,\"\")","v":""},null,null,{"$f":"IF(O263=3,0,\"\")","v":""}]
[null,null,{"$f":"IF('[1]échos VL et génisses'!A266=\"\",\"\",IF('[1]échos VL et génisses'!A266=\"Total général\",\"\",'[1]échos VL et génisses'!A266))","v":""},{"$f":"IF('[1]échos VL et génisses'!B266=\"\",\"\",'[1]échos VL et génisses'!B266)","v":""},null,null,"",null,null,"",null,null,"",null,null,""]
[null,null,{"$f":"IF('[1]échos VL et génisses'!A267=\"\",\"\",IF('[1]échos VL et génisses'!A267=\"Total général\",\"\",'[1]échos VL et génisses'!A267))","v":""},{"$f":"IF('[1]échos VL et génisses'!B267=\"\",\"\",'[1]échos VL et génisses'!B267)","v":""},null,null,"",null,null,"",null,null,"",null,null,""]
[null,null,{"$f":"IF('[1]échos VL et génisses'!A268=\"\",\"\",IF('[1]échos VL et génisses'!A268=\"Total général\",\"\",'[1]échos VL et génisses'!A268))","v":""},{"$f":"IF('[1]échos VL et génisses'!B268=\"\",\"\",'[1]échos VL et génisses'!B268)","v":""},null,null,"",null,null,"",null,null,"",null,null,""]
[null,null,{"$f":"IF('[1]échos VL et génisses'!A269=\"\",\"\",IF('[1]échos VL et génisses'!A269=\"Total général\",\"\",'[1]échos VL et génisses'!A269))","v":""},{"$f":"IF('[1]échos VL et génisses'!B269=\"\",\"\",'[1]échos VL et génisses'!B269)","v":""},null,null,"",null,null,"",null,null,"",null,null,""]
[null,null,{"$f":"IF('[1]échos VL et génisses'!A270=\"\",\"\",IF('[1]échos VL et génisses'!A270=\"Total général\",\"\",'[1]échos VL et génisses'!A270))","v":""},{"$f":"IF('[1]échos VL et génisses'!B270=\"\",\"\",'[1]échos VL et génisses'!B270)","v":""},null,null,"",null,null,"",null,null,"",null,null,""]
[null,null,{"$f":"IF('[1]échos VL et génisses'!A271=\"\",\"\",IF('[1]échos VL et génisses'!A271=\"Total général\",\"\",'[1]échos VL et génisses'!A271))","v":""},{"$f":"IF('[1]échos VL et génisses'!B271=\"\",\"\",'[1]échos VL et génisses'!B271)","v":""},null,null,"",null,null,"",null,null,"",null,null,""]
[null,null,{"$f":"IF('[1]échos VL et génisses'!A272=\"\",\"\",IF('[1]échos VL et génisses'!A272=\"Total général\",\"\",'[1]échos VL et génisses'!A272))","v":""},{"$f":"IF('[1]échos VL et génisses'!B272=\"\",\"\",'[1]échos VL et génisses'!B272)","v":""},null,null,"",null,null,"",null,null,"",null,null,""]
[null,null,{"$f":"IF('[1]échos VL et génisses'!A273=\"\",\"\",IF('[1]échos VL et génisses'!A273=\"Total général\",\"\",'[1]échos VL et génisses'!A273))","v":""},{"$f":"IF('[1]échos VL et génisses'!B273=\"\",\"\",'[1]échos VL et génisses'!B273)","v":""},null,null,"",null,null,"",null,null,"",null,null,""]
[null,null,{"$f":"IF('[1]échos VL et génisses'!A274=\"\",\"\",IF('[1]échos VL et génisses'!A274=\"Total général\",\"\",'[1]échos VL et génisses'!A274))","v":""},{"$f":"IF('[1]échos VL et génisses'!B274=\"\",\"\",'[1]échos VL et génisses'!B274)","v":""},null,null,"",null,null,"",null,null,"",null,null,""]
[null,null,{"$f":"IF('[1]échos VL et génisses'!A275=\"\",\"\",IF('[1]échos VL et génisses'!A275=\"Total général\",\"\",'[1]échos VL et génisses'!A275))","v":""},{"$f":"IF('[1]échos VL et génisses'!B275=\"\",\"\",'[1]échos VL et génisses'!B275)","v":""},null,null,"",null,null,"",null,null,"",null,null,""]
[null,null,{"$f":"IF('[1]échos VL et génisses'!A276=\"\",\"\",IF('[1]échos VL et génisses'!A276=\"Total général\",\"\",'[1]échos VL et génisses'!A276))","v":""},{"$f":"IF('[1]échos VL et génisses'!B276=\"\",\"\",'[1]échos VL et génisses'!B276)","v":""},null,null,"",null,null,"",null,null,"",null,null,""]
[null,null,{"$f":"IF('[1]échos VL et génisses'!A277=\"\",\"\",IF('[1]échos VL et génisses'!A277=\"Total général\",\"\",'[1]échos VL et génisses'!A277))","v":""},{"$f":"IF('[1]échos VL et génisses'!B277=\"\",\"\",'[1]échos VL et génisses'!B277)","v":""},null,null,"",null,null,"",null,null,"",null,null,""]
[null,null,{"$f":"IF('[1]échos VL et génisses'!A278=\"\",\"\",IF('[1]échos VL et génisses'!A278=\"Total général\",\"\",'[1]échos VL et génisses'!A278))","v":""},{"$f":"IF('[1]échos VL et génisses'!B278=\"\",\"\",'[1]échos VL et génisses'!B278)","v":""},null,null,"",null,null,"",null,null,"",null,null,""]
[null,null,{"$f":"IF('[1]échos VL et génisses'!A279=\"\",\"\",IF('[1]échos VL et génisses'!A279=\"Total général\",\"\",'[1]échos VL et génisses'!A279))","v":""},{"$f":"IF('[1]échos VL et génisses'!B279=\"\",\"\",'[1]échos VL et génisses'!B279)","v":""},null,null,"",null,null,"",null,null,"",null,null,""]
[null,null,{"$f":"IF('[1]échos VL et génisses'!A280=\"\",\"\",IF('[1]échos VL et génisses'!A280=\"Total général\",\"\",'[1]échos VL et génisses'!A280))","v":""},{"$f":"IF('[1]échos VL et génisses'!B280=\"\",\"\",'[1]échos VL et génisses'!B280)","v":""},null,null,"",null,null,"",null,null,"",null,null,""]
[null,null,{"$f":"IF('[1]échos VL et génisses'!A281=\"\",\"\",IF('[1]échos VL et génisses'!A281=\"Total général\",\"\",'[1]échos VL et génisses'!A281))","v":""},{"$f":"IF('[1]échos VL et génisses'!B281=\"\",\"\",'[1]échos VL et génisses'!B281)","v":""},null,null,"",null,null,"",null,null,"",null,null,""]
[null,null,{"$f":"IF('[1]échos VL et génisses'!A282=\"\",\"\",IF('[1]échos VL et génisses'!A282=\"Total général\",\"\",'[1]échos VL et génisses'!A282))","v":""},{"$f":"IF('[1]échos VL et génisses'!B282=\"\",\"\",'[1]échos VL et génisses'!B282)","v":""},null,null,"",null,null,"",null,null,"",null,null,""]
[null,null,{"$f":"IF('[1]échos VL et génisses'!A283=\"\",\"\",IF('[1]échos VL et génisses'!A283=\"Total général\",\"\",'[1]échos VL et génisses'!A283))","v":""},{"$f":"IF('[1]échos VL et génisses'!B283=\"\",\"\",'[1]échos VL et génisses'!B283)","v":""},null,null,"",null,null,"",null,null,"",null,null,""]
[null,null,{"$f":"IF('[1]échos VL et génisses'!A284=\"\",\"\",IF('[1]échos VL et génisses'!A284=\"Total général\",\"\",'[1]échos VL et génisses'!A284))","v":""},{"$f":"IF('[1]échos VL et génisses'!B284=\"\",\"\",'[1]échos VL et génisses'!B284)","v":""},null,null,"",null,null,"",null,null,"",null,null,""]
[null,null,{"$f":"IF('[1]échos VL et génisses'!A285=\"\",\"\",IF('[1]échos VL et génisses'!A285=\"Total général\",\"\",'[1]échos VL et génisses'!A285))","v":""},{"$f":"IF('[1]échos VL et génisses'!B285=\"\",\"\",'[1]échos VL et génisses'!B285)","v":""},null,null,"",null,null,"",null,null,"",null,null,""]
[null,null,{"$f":"IF('[1]échos VL et génisses'!A286=\"\",\"\",IF('[1]échos VL et génisses'!A286=\"Total général\",\"\",'[1]échos VL et génisses'!A286))","v":""},{"$f":"IF('[1]échos VL et génisses'!B286=\"\",\"\",'[1]échos VL et génisses'!B286)","v":""},null,null,"",null,null,"",null,null,"",null,null,""]
[null,null,{"$f":"IF('[1]échos VL et génisses'!A287=\"\",\"\",IF('[1]échos VL et génisses'!A287=\"Total général\",\"\",'[1]échos VL et génisses'!A287))","v":""},{"$f":"IF('[1]échos VL et génisses'!B287=\"\",\"\",'[1]échos VL et génisses'!B287)","v":""},null,null,"",null,null,"",null,null,"",null,null,""]
[null,null,{"$f":"IF('[1]échos VL et génisses'!A288=\"\",\"\",IF('[1]échos VL et génisses'!A288=\"Total général\",\"\",'[1]échos VL et génisses'!A288))","v":""},{"$f":"IF('[1]échos VL et génisses'!B288=\"\",\"\",'[1]échos VL et génisses'!B288)","v":""},null,null,"",null,null,"",null,null,"",null,null,""]
[null,null,{"$f":"IF('[1]échos VL et génisses'!A289=\"\",\"\",IF('[1]échos VL et génisses'!A289=\"Total général\",\"\",'[1]échos VL et génisses'!A289))","v":""},{"$f":"IF('[1]échos VL et génisses'!B289=\"\",\"\",'[1]échos VL et génisses'!B289)","v":""},null,null,"",null,null,"",null,null,"",null,null,""]
[null,null,{"$f":"IF('[1]échos VL et génisses'!A290=\"\",\"\",IF('[1]échos VL et génisses'!A290=\"Total général\",\"\",'[1]échos VL et génisses'!A290))","v":""},{"$f":"IF('[1]échos VL et génisses'!B290=\"\",\"\",'[1]échos VL et génisses'!B290)","v":""},null,null,"",null,null,"",null,null,"",null,null,""]
[null,null,{"$f":"IF('[1]échos VL et génisses'!A291=\"\",\"\",IF('[1]échos VL et génisses'!A291=\"Total général\",\"\",'[1]échos VL et génisses'!A291))","v":""},{"$f":"IF('[1]échos VL et génisses'!B291=\"\",\"\",'[1]échos VL et génisses'!B291)","v":""},null,null,"",null,null,"",null,null,"",null,null,""]
[null,null,{"$f":"IF('[1]échos VL et génisses'!A292=\"\",\"\",IF('[1]échos VL et génisses'!A292=\"Total général\",\"\",'[1]échos VL et génisses'!A292))","v":""},{"$f":"IF('[1]échos VL et génisses'!B292=\"\",\"\",'[1]échos VL et génisses'!B292)","v":""},null,null,"",null,null,"",null,null,"",null,null,""]
[null,null,{"$f":"IF('[1]échos VL et génisses'!A293=\"\",\"\",IF('[1]échos VL et génisses'!A293=\"Total général\",\"\",'[1]échos VL et génisses'!A293))","v":""},{"$f":"IF('[1]échos VL et génisses'!B293=\"\",\"\",'[1]échos VL et génisses'!B293)","v":""},null,null,"",null,null,"",null,null,"",null,null,""]
[null,null,{"$f":"IF('[1]échos VL et génisses'!A294=\"\",\"\",IF('[1]échos VL et génisses'!A294=\"Total général\",\"\",'[1]échos VL et génisses'!A294))","v":""},{"$f":"IF('[1]échos VL et génisses'!B294=\"\",\"\",'[1]échos VL et génisses'!B294)","v":""},null,null,"",null,null,"",null,null,"",null,null,""]
[null,null,{"$f":"IF('[1]échos VL et génisses'!A295=\"\",\"\",IF('[1]échos VL et génisses'!A295=\"Total général\",\"\",'[1]échos VL et génisses'!A295))","v":""},{"$f":"IF('[1]échos VL et génisses'!B295=\"\",\"\",'[1]échos VL et génisses'!B295)","v":""},null,null,"",null,null,"",null,null,"",null,null,""]
[null,null,{"$f":"IF('[1]échos VL et génisses'!A296=\"\",\"\",IF('[1]échos VL et génisses'!A296=\"Total général\",\"\",'[1]échos VL et génisses'!A296))","v":""},{"$f":"IF('[1]échos VL et génisses'!B296=\"\",\"\",'[1]échos VL et génisses'!B296)","v":""},null,null,"",null,null,"",null,null,"",null,null,""]
[null,null,{"$f":"IF('[1]échos VL et génisses'!A297=\"\",\"\",IF('[1]échos VL et génisses'!A297=\"Total général\",\"\",'[1]échos VL et génisses'!A297))","v":""},{"$f":"IF('[1]échos VL et génisses'!B297=\"\",\"\",'[1]échos VL et génisses'!B297)","v":""},null,null,{"$f":"IF(F295=3,0,\"\")","v":""},null,null,{"$f":"IF(I295=3,0,\"\")","v":""},null,null,{"$f":"IF(L295=3,0,\"\")","v":""},null,null,{"$f":"IF(O295=3,0,\"\")","v":""}]
[null,null,{"$f":"IF('[1]échos VL et génisses'!A298=\"\",\"\",IF('[1]échos VL et génisses'!A298=\"Total général\",\"\",'[1]échos VL et génisses'!A298))","v":""},{"$f":"IF('[1]échos VL et génisses'!B298=\"\",\"\",'[1]échos VL et génisses'!B298)","v":""},null,null,{"$f":"IF(F296=3,0,\"\")","v":""},null,null,{"$f":"IF(I296=3,0,\"\")","v":""},null,null,{"$f":"IF(L296=3,0,\"\")","v":""},null,null,{"$f":"IF(O296=3,0,\"\")","v":""}]
[null,null,{"$f":"IF('[1]échos VL et génisses'!A299=\"\",\"\",IF('[1]échos VL et génisses'!A299=\"Total général\",\"\",'[1]échos VL et génisses'!A299))","v":""},{"$f":"IF('[1]échos VL et génisses'!B299=\"\",\"\",'[1]échos VL et génisses'!B299)","v":""},null,null,{"$f":"IF(F297=3,0,\"\")","v":""},null,null,{"$f":"IF(I297=3,0,\"\")","v":""},null,null,{"$f":"IF(L297=3,0,\"\")","v":""},null,null,{"$f":"IF(O297=3,0,\"\")","v":""}]
[null,null,{"$f":"IF('[1]échos VL et génisses'!A300=\"\",\"\",IF('[1]échos VL et génisses'!A300=\"Total général\",\"\",'[1]échos VL et génisses'!A300))","v":""},{"$f":"IF('[1]échos VL et génisses'!B300=\"\",\"\",'[1]échos VL et génisses'!B300)","v":""},null,null,{"$f":"IF(F298=3,0,\"\")","v":""},null,null,{"$f":"IF(I298=3,0,\"\")","v":""},null,null,{"$f":"IF(L298=3,0,\"\")","v":""},null,null,{"$f":"IF(O298=3,0,\"\")","v":""}]