{"text_format":"1","workbook":"xlsx","n_sheets":15,"sheets":["How To Use","Overview","Character","Item Calc","Reforge Calc","Graph","Priority","Gear","Sheet2","Race Type","DPS Calc","WoL Compare","Export","Saved","Probability"],"not_rendered":{"charts":3,"images":23,"macros":1,"external_links":0,"defined_names":390,"comments":7,"pivot_tables":0},"unopened":[],"bounds":{"document_bytes":16777216,"sheet_cells":100000,"rows_first":2000,"rows_last":500,"rows_between":2000,"halvings":0,"cell_chars":16384,"cell_head_chars":4096},"cells_cut":0,"cells_raw":0,"read":"whole","date_system":"1900"}

{"sheet":"How To Use","index":0,"n_rows":52,"n_cols":6,"rows_kept":52,"cut":false,"hidden":false,"merged":[[49,1,49,17],[35,1,35,17],[38,1,38,17],[39,1,39,17],[43,1,43,17],[40,1,40,17],[41,1,41,17],[42,1,42,17],[44,1,44,17],[3,1,3,17],[47,1,47,17],[36,1,37,17],[45,1,46,17],[26,2,26,4],[15,1,15,17],[16,1,18,17],[13,1,14,17],[2,1,2,17],[32,1,32,17],[34,1,34,17],[30,1,30,17],[31,1,31,17],[7,1,7,3],[8,2,8,3],[9,2,9,3],[29,1,29,17],[10,2,10,3],[19,1,20,17],[22,1,22,17],[23,1,23,17],[28,1,28,17],[12,1,12,17],[4,1,4,17]]}
[]
[]
[null,"Basic Use"]
[null,"1 - Ensure Macros are enabled."]
[null,"2.1 - Proceed to the Overview tab and input your character information."]
[]
{"$rows_left_out":47}
{"sheet":"Overview","index":1,"n_rows":71,"n_cols":18,"rows_kept":71,"cut":false,"hidden":false,"merged":[[51,1,51,3],[52,1,52,3],[56,1,56,3],[42,6,43,8],[49,1,49,3],[53,1,53,3],[54,1,54,3],[55,1,55,3],[50,1,50,3],[42,9,43,9],[58,1,58,17],[62,7,62,10],[44,1,44,3],[44,6,44,8],[45,1,45,3],[45,6,45,8],[42,1,43,3],[42,4,43,4],[46,1,46,3],[46,6,46,8],[47,1,47,3],[47,6,47,8],[48,1,48,3],[49,6,49,8],[50,6,50,8],[1,1,1,3],[6,1,6,17],[18,8,18,9],[2,2,2,3],[3,2,3,3],[4,2,4,3],[18,2,18,3],[18,4,18,5],[18,10,18,11],[2,14,4,16],[1,9,1,16],[15,11,15,13],[16,11,16,13],[37,1,37,3],[39,1,39,17],[41,1,41,9],[20,1,20,17],[22,1,22,4],[23,1,24,1],[23,2,24,2],[23,3,24,3],[23,4,24,4],[68,7,68,10],[60,6,60,10],[67,7,67,10],[66,7,66,10],[65,7,65,10],[64,7,64,10],[63,7,63,10],[61,7,61,10]]}
[]
[null,"Download from Armory",null,null,null,null,null,null,null,"Import/Export"]
[null,"Character Name",null,null,null,null,null,null,null,null,null,null,null,null,"Hover over for Instructions"]
[null,"Realm"]
[null,"Locale","U.S."]
[]
{"$rows_left_out":66}
{"sheet":"Character","index":2,"n_rows":289,"n_cols":27,"rows_kept":289,"cut":false,"hidden":false,"merged":[[227,2,227,4],[232,2,232,4],[1,7,1,10],[11,2,11,3],[5,2,5,3],[7,2,7,3],[4,2,4,3],[12,2,12,3],[13,2,13,3],[3,2,3,3],[2,2,2,3],[10,2,10,3],[12,4,12,5],[3,8,3,10],[2,8,2,10],[225,25,225,26],[6,8,6,10],[8,8,8,10],[17,19,17,21],[16,19,16,21],[7,8,7,10],[207,19,207,21],[11,22,11,23],[9,8,9,10],[217,23,217,24],[2,15,3,15],[2,16,3,16],[2,17,3,17],[2,12,3,14],[4,12,4,14],[5,12,5,14],[6,12,6,14],[7,12,7,14],[8,12,8,14],[9,12,9,14],[0,1,0,10],[11,8,11,10],[12,8,12,10],[13,8,13,10],[225,1,225,8],[8,2,8,3],[4,4,4,5],[4,8,4,10],[5,8,5,10],[3,4,3,5],[9,2,9,3],[0,12,0,23],[12,12,14,23],[10,15,11,16],[10,12,11,14],[10,20,11,21],[10,17,11,19],[4,21,4,23],[5,21,5,23],[6,21,6,23],[2,21,3,23],[2,18,3,18],[2,19,3,19],[2,20,3,20],[7,21,7,23],[8,21,8,23],[9,21,9,23]]}
[null,"Spreadsheet Settings",null,null,null,null,null,null,null,null,null,null,"Damage Snapshot",null,null,null,null,null,null,null,null,null,null,null,null,null,{"$f":"CONCATENATE(Estimations, \" \", Delay, \" \", Length, \" \", TrinketReset, \" \", HoWPercent, \" \", FrontOfBoss, \" \", ExtraTargets, \" \", SealSelection, \" \", AWZeal, \" \", InqRefresh, \" \", Fillers, \" \", CurrentHaste, \" \", Mastery, \" \", RoLTalent, \" \", AoWTalent, \" \", DivPurpTalent, \" \", SancWrath, \" \", ZealotryTalent, \" \", A191, \" \", A193, \" \", Heroism)","v":"On 0.2 450 0 0.19 Never 0 SoT Together 4 2 16.4573994035938 8.26082106202588 3 3 2 3 1 On On On"}]
[null,null,null,null,null,null,null,"--- Priorities ---",null,null,null,null,null,null,null,null,null,null,null,null,null,null,null,null,null,null,"On 0.2 450 0 0.19 Never 0 SoT Together 4 2 16.4573994035938 8.26082106202588 3 3 2 3 1 On On On"]
[null,"Estimations","On",null,null,null,null,0,{"$f":"IF(InqRefresh=\"Unused\",\"\",\"Inquisition\")","v":"Inquisition"},null,null,null,"Damage Source",null,null,"Effective CD","DPS","%","%","DPS","Effective CD","Damage Source",null,null,null,null,"On 0.2 450 0 0.19 Never 0 SoT Together 4 2 11.1082193782285 11.1334225792057 3 3 2 3 1 On On On"]
[null,"Delay/Latency",0.2,null,"seconds.",null,null,1,"Crusader Strike"]
[null,"Length of Fight",450,null,"seconds.",null,null,2,"Hammer of Wrath",null,null,null,"White (Autoattack)",null,null,"N/A",{"$f":"AutoattackDPS","v":2649.9195076906617},{"$f":"Q5/TotalDPS","v":0.10087039204698983},{"$f":"T5/TotalDPS","v":0.24781269632676661},{"$f":"TVDPS","v":6510.1729548528856},{"$f":"TVCooldown","v":6.930103635020548},"Templar's Verdict"]
[null,"SoT/Trinket Reset",0,null,null,null,null,3,"Exorcism",null,null,null,{"$f":"IF(SealSelection=\"SoT\", \"Seal of Truth\", \"Seal of Righteousness\")","v":"Seal of Truth"},null,null,"N/A",{"$f":"IF(SealSelection=\"SoT\", SoTDPS, SoRDPS)","v":2253.0094955280792},8.5761831799019903E-2,7.2220275233524922E-3,{"$f":"ConsDPS","v":189.72655137788524},{"$f":"ConsCooldown","v":55.664967759511015},"Consecrate"]
{"$rows_left_out":284}
{"sheet":"Item Calc","index":3,"n_rows":31,"n_cols":13,"rows_kept":31,"cut":false,"hidden":false,"merged":[[30,11,30,12]]}
[null,{"$f":"\"Individual Item Upgrade Analysis - Based on \" & SealSelection & \" Rotation\"","v":"Individual Item Upgrade Analysis - Based on SoT Rotation"},null,null,null,null,null,null,null,null,null,"Options Panel"]
[]
[null,"All"]
[]
[]
[null,null,null,null,null,null,null,null,null,null,null,"Misc Options:"]
{"$rows_left_out":26}
{"sheet":"Reforge Calc","index":4,"n_rows":175,"n_cols":21,"rows_kept":175,"cut":false,"hidden":true,"merged":[[1,11,1,13],[0,7,0,9],[0,2,0,4],[20,11,20,13],[0,16,0,19],[99,2,99,4],[99,7,99,9],[99,16,99,19],[119,11,119,13],[100,11,100,13]]}
["Secondary Stat Priority",null,"Priority",null,null,null,null,"Priority",null,null,null,null,null,null,null,null,"Priority"]
["Mastery > Haste > Crit",null,{"$f":"IF(OR(A2=\"Crit > Haste > Mastery\",A2=\"Crit > Mastery > Haste\"),1,IF(OR(A2=\"Mastery > Crit > Haste\",A2=\"Haste > Crit > Mastery\"),2,3))","v":3},{"$f":"IF(OR(A2=\"Haste > Mastery > Crit\",A2=\"Haste > Crit > Mastery\"),1,IF(OR(A2=\"Crit > Haste > Mastery\",A2=\"Mastery > Haste > Crit\"),2,3))","v":2},{"$f":"IF(OR(A2=\"Mastery > Haste > Crit\",A2=\"Mastery > Crit > Haste\"),1,IF(OR(A2=\"Crit > Mastery > Haste\",A2=\"Haste > Mastery > Crit\"),2,3))","v":1},null,null,{"$f":"IF(OR(A2=\"Crit > Haste > Mastery\",A2=\"Crit > Mastery > Haste\"),1,IF(OR(A2=\"Mastery > Crit > Haste\",A2=\"Haste > Crit > Mastery\"),2,3))","v":3},{"$f":"IF(OR(A2=\"Haste > Mastery > Crit\",A2=\"Haste > Crit > Mastery\"),1,IF(OR(A2=\"Crit > Haste > Mastery\",A2=\"Mastery > Haste > Crit\"),2,3))","v":2},{"$f":"IF(OR(A2=\"Mastery > Haste > Crit\",A2=\"Mastery > Crit > Haste\"),1,IF(OR(A2=\"Crit > Mastery > Haste\",A2=\"Haste > Mastery > Crit\"),2,3))","v":1},null,"Hit",null,null,null,null,3,2,1]
["Gear","Hit","Crit","Haste","Mastery","WE","Hit","Crit","Haste","Mastery","WE","Unchanged","Min","Max",null,"Reforge for Hitcap",{"$f":"HLOOKUP(3,$H$2:$J$3,2,FALSE)","v":"Crit"},{"$f":"HLOOKUP(2,$H$2:$J$3,2,FALSE)","v":"Haste"},{"$f":"HLOOKUP(1,$H$2:$J$3,2,FALSE)","v":"Mastery"},"WE","Biggest Loser"]
[{"$f":"MyHead","v":"Reinforced Sapphirium Helmet"},{"$f":"IF(OR($A4=\"None\",ISBLANK($A4)),0,VLOOKUP($A4,ItemList,HLOOKUP(B$3,StatLoC,2,FALSE),FALSE))","v":0},0,228,0,168,{"$f":"ROUNDUP((B4*0.6),0)","v":0},{"$f":"ROUNDDOWN((C4*0.4),0)","v":0},{"$f":"ROUNDDOWN((D4*0.4),0)","v":91},0,67,{"$f":"IF(B4=0,0,N4)","v":0},{"$f":"IF(G4>0,G4,LARGE(H4:K4,2))","v":67},{"$f":"IF(G4>0,B4,MAX(H4:K4))","v":91},67,{"$f":"IF(O4=L4,\"None\",IF(O4=G4,\"Reforge: Hit to \",CONCATENATE(\"Reforge: \",U4,\" to Hit\")))","v":"Reforge: Expertise to Hit"},{"$f":"IF(HLOOKUP(3,$H$2:$J$19,3,FALSE)=$O4,$Q$3,FALSE)","v":false},{"$f":"IF(HLOOKUP(2,$H$2:$J$19,3,FALSE)=$O4,$R$3,FALSE)","v":false},{"$f":"IF(HLOOKUP(1,$H$2:$J$19,3,FALSE)=$O4,$S$3,FALSE)","v":false},{"$f":"IF(K4=$O4,\"Expertise\",FALSE)","v":"Expertise"},{"$f":"IF(AND(Q4=FALSE,R4=FALSE,S4=FALSE),T4,IF(AND(Q4=FALSE,R4=FALSE),S4,IF(Q4=FALSE,R4,Q4)))","v":"Expertise"}]
[{"$f":"MyShoulder","v":"Reinforced Sapphirium Pauldrons"},149,0,169,0,0,{"$f":"ROUNDUP((B5*0.6),0)","v":90},{"$f":"ROUNDDOWN((C5*0.4),0)","v":0},{"$f":"ROUNDDOWN((D5*0.4),0)","v":67},{"$f":"ROUNDDOWN((E5*0.4),0)","v":0},{"$f":"ROUNDDOWN((F5*0.4),0)","v":0},{"$f":"IF(B5=0,0,N5)","v":149},90,149,90,{"$f":"IF(O5=L5,\"None\",IF(O5=G5,\"Reforge: Hit to \",CONCATENATE(\"Reforge: \",U5,\" to Hit\")))","v":"Reforge: Hit to "},{"$f":"IF(HLOOKUP(3,$H$2:$J$19,4,FALSE)=$O5,$Q$3,FALSE)","v":false},{"$f":"IF(HLOOKUP(2,$H$2:$J$19,4,FALSE)=$O5,$R$3,FALSE)","v":false},{"$f":"IF(HLOOKUP(1,$H$2:$J$19,4,FALSE)=$O5,$S$3,FALSE)","v":false},{"$f":"IF(K5=$O5,\"Expertise\",FALSE)","v":false},{"$f":"IF(AND(Q5=FALSE,R5=FALSE,S5=FALSE),T5,IF(AND(Q5=FALSE,R5=FALSE),S5,IF(Q5=FALSE,R5,Q5)))","v":false}]
[{"$f":"MyChest","v":"Immolation Battleplate"},0,0,235,0,269,0,0,94,0,107,0,94,107,94,"Reforge: Haste to Hit",{"$f":"IF(HLOOKUP(3,$H$2:$J$19,5,FALSE)=$O6,$Q$3,FALSE)","v":false},{"$f":"IF(HLOOKUP(2,$H$2:$J$19,5,FALSE)=$O6,$R$3,FALSE)","v":"Haste"},{"$f":"IF(HLOOKUP(1,$H$2:$J$19,5,FALSE)=$O6,$S$3,FALSE)","v":false},false,"Haste"]
{"$rows_left_out":170}
{"sheet":"Graph","index":5,"n_rows":303,"n_cols":24,"rows_kept":303,"cut":false,"hidden":false,"merged":[[2,22,3,22],[2,23,3,23],[3,20,3,21],[12,20,12,21],[1,10,2,11],[1,12,2,12],[1,14,2,19],[4,20,4,21],[9,20,9,21],[7,20,7,21],[8,20,8,21],[5,20,5,21],[6,20,6,21],[11,20,11,21]]}
[]
[null,null,null,null,null,null,null,null,null,null,"Graph Scale",null,1,null,{"$f":"IF(OR(Verify3=Verify1,StrDPSGain=0),\"\",\"Settings changed, you should re-run the graph.\")","v":""}]
[null,null,null,null,null,null,null,null,null,null,null,null,null,null,null,null,null,null,null,null,null,null,"DPS Increase per point","Stat Weight"]
[null,null,null,null,null,null,null,null,null,null,null,null,null,null,null,null,null,null,null,null,"Stat"]
[null,null,null,null,null,null,null,null,null,null,null,null,null,null,null,null,null,null,null,null,"Strength",null,{"$f":"C303/B303","v":0},1]
[null,null,null,null,null,null,null,null,null,null,null,null,null,null,null,null,null,null,null,null,"Hit",null,{"$f":"D303/B303","v":0},{"$f":"W6/W5","v":{"$error":"#DIV/0!"}}]
{"$rows_left_out":298}
{"sheet":"Priority","index":6,"n_rows":43,"n_cols":9,"rows_kept":43,"cut":false,"hidden":false,"merged":[[0,2,0,3]]}
[null,null,"--- Suggested Priority ---"]
[null,null,0,{"$f":"IF(ROUND(LastDPSValue,2)=ROUND(TotalDPS,2),\"Inquisition\",\"Recalculate\")","v":"Recalculate"}]
[null,null,1,{"$f":"SuggestedAbility1","v":""}]
[null,null,2,{"$f":"SuggestedAbility2","v":""}]
[null,null,3,{"$f":"SuggestedAbility3","v":""}]
[null,null,4,{"$f":"SuggestedAbility4","v":""}]
{"$rows_left_out":38}
{"sheet":"Gear","index":7,"n_rows":686,"n_cols":36,"rows_kept":686,"cut":false,"hidden":false,"merged":[[1,30,1,31],[1,32,1,33],[1,1,1,10],[1,11,1,18],[1,24,1,29],[1,19,1,21]]}
[]
[null,"General Info",null,null,null,null,null,null,null,null,null,"Melee Stats",null,null,null,null,null,null,null,"Caster Stats",null,null,null,null,"Gem Info",null,null,null,null,null,"Weapon",null,"Lookup Info"]
[null,"Name","Quality","Filter1","Filter2","DropA","DropB","Filter-Inc","Ilvl","Arm","Stam","Str","AP","Agi","Hit","Crit","Haste","Mastery","WE","Int","SpD","Mp5","SpH","SpC","G1","G2","G3","G4","Bonus","Amount","Speed","Dps","Loc","MyLoc"]
[null,1,{"$f":"B4+1","v":2},{"$f":"C4+1","v":3},4,5,6,7,8,9,10,11,12,13,14,15,16,17,18,19,20,21,22,23,24,25,26,27,28,29,30,31,32,33]
[null,"-----Plate-----"]
[null,"Crown of Chelonian Freedom","Rare","Plate","Quest","Quest","Children of Tortolla",{"$f":"IF(AND(VLOOKUP(C6,FilterRareLookup,2,FALSE)=\"Yes\",VLOOKUP(E6,FilterLootLookup,2,FALSE)=\"Yes\",I6>=iLevelFilter),\"Yes\",\"No\")","v":"No"},288,2116,264,176,0,0,0,119,115,0,0,0,0,0,null,null,null,null,null,null,null,null,null,null,"Head","MyHead"]
{"$rows_left_out":681}
{"sheet":"Sheet2","index":8,"n_rows":38,"n_cols":4,"rows_kept":38,"cut":false,"hidden":true,"merged":[]}
["Selected Gear"]
["All",null,"Mygear"]
[{"$f":"MyHead","v":"Reinforced Sapphirium Helmet"},null,"Myhead"]
[{"$f":"MyShoulder","v":"Reinforced Sapphirium Pauldrons"},null,"myshoulder"]
[{"$f":"MyChest","v":"Immolation Battleplate"},null,"mychest"]
[{"$f":"MyLegs","v":"Immolation Legplates"},null,"mylegs"]
{"$rows_left_out":33}
{"sheet":"Race Type","index":9,"n_rows":6,"n_cols":18,"rows_kept":6,"cut":false,"hidden":true,"merged":[]}
["Information","Stam","Int","Str","AP","Agi","Hit","Crit","Haste","Mastery","WE","SpD","Dam (S)","SpH","SpC","Mp5","Health","Mana"]
["Base Information (Dwarf)",157,105,169,{"$f":"235 + (D2 * 2)","v":573},93,null,0.65,null,null,{"$f":"IF(ISNONTEXT(MyWeapon),0,IF(VLOOKUP(MyWeapon,Gear!B411:AI453,34,FALSE)=\"Mace\",3,0))","v":0},{"$f":"ROUNDDOWN((C2-10),0)","v":95},null,null,3.33,1171,44675,23142]
["Base Information (Human)",156,106,164,{"$f":"235 + (D3 * 2)","v":563},97,null,0.65,null,null,{"$f":"IF(ISNONTEXT(MyWeapon),0,IF(VLOOKUP(MyWeapon,Gear!B411:AI453,34,FALSE)=\"Mace\",3,IF(VLOOKUP(MyWeapon,Gear!B411:AI453,34,FALSE)=\"Sword\",3,0)))","v":3},{"$f":"ROUNDDOWN((C3-10),0)","v":96},null,null,3.33,1171,44665,23142]
["Base Information (Blood Elf)",156,109,161,{"$f":"235 + (D4 * 2)","v":557},99,null,0.65,null,null,null,99,null,null,3.33,{"$f":"1171 + 483/24","v":1191.125},44665,23142]
["Base Information (Draenei)",156,106,165,{"$f":"235 + (D5 * 2)","v":565},94,1,0.65,null,null,null,96,null,1,3.33,1171,44665,23142]
["Base Information (Tauren)",null,102,177,{"$f":"235 + (D6 * 2)","v":589},93,null,0.65,null,null,null,92,null,null,3.33,1171,null,23142]
{"$rows_left_out":1}
{"sheet":"DPS Calc","index":10,"n_rows":81,"n_cols":21,"rows_kept":81,"cut":false,"hidden":false,"merged":[[69,14,69,15],[31,14,31,15],[55,14,55,15],[48,6,48,7],[41,10,41,11],[3,14,3,15],[17,14,17,15],[3,6,3,7],[19,6,19,7],[34,6,34,7],[17,1,17,2],[46,1,46,2],[10,10,10,11],[45,10,45,11],[73,1,73,3],[56,1,57,2],[56,3,57,3],[43,1,43,3]]}
["DPS CALCULATIONS"]
[]
[null,"Weapon",null,null,null,"White","Normal","AW",null,"SoR","Normal","AW",null,"Hammer of Wrath","Normal","AW",null,"Coefficients",80,"Attack Power","Spelldamage"]
[null,"Speed",{"$f":"Weaponspeed","v":3.6},null,null,"Cooldown",{"$f":"ROUND(HastedWeaponspeed,2)","v":2.58},null,null,{"$f":"CONCATENATE(\"Procs in \",Length,\" seconds\")","v":"Procs in 450 seconds"},{"$f":"IF(CSDPS>(DSDPS  * (ExtraTargets+1)),SUM(G23:G24),SUM(G38:G39)) + ((SUM(G7:G9) + SUM(G52:G53) + SUM(K14:K15)) * (ExtraTargets+1))","v":308.69544903187358},{"$f":"IF(CSDPS>(DSDPS  * (ExtraTargets+1)),SUM(H23:H24),SUM(H38:H39)) + ((SUM(H7:H9) + SUM(H52:H53) + SUM(L14:L15))  * (ExtraTargets+1))","v":78.062617148422433},null,"Effective Cooldown",{"$f":"IF((SUM(O5:P5)=0),0,(Length / SUM(O5:P5)))","v":23.52195885107103},null,null,"SoR",{"$f":"Weaponspeed","v":3.6},1.0999999999999999E-2,2.1999999999999999E-2]
[null,"Hasted",{"$f":"Weaponspeed/((1 + WindFuryHaste) * (1 + JotPHaste) * (1 + (CurrentHaste / 100)))","v":2.5781977791427799},null,null,{"$f":"CONCATENATE(\"Total Attacks in \",Length,\" seconds\")","v":"Total Attacks in 450 seconds"},{"$f":"Length/HastedWeaponspeed * 5/6","v":145.45043946344683},{"$f":"Length/HastedWeaponspeed * 1/6","v":29.090087892689368},null,"Av Hit",{"$f":"SoRBase * ((SoRAP * CharTotalAP) + (SoRSP * CharSpelldamage))","v":1032.7809823845093},{"$f":"K5 * 1.2","v":1239.3371788614111},null,{"$f":"CONCATENATE(\"Total Attacks in \",Length,\" seconds\")","v":"Total Attacks in 450 seconds"},{"$f":"NumHoW","v":9.3202598737131499},{"$f":"NumAWHoW","v":9.8107998670664767},null,"JoR",1,0.2,0.32]
[null,"Weapon Dps",{"$f":"WeaponDPS","v":744.1},null,null,{"$f":"CONCATENATE(\"Avoidance in \",Length,\" seconds\")","v":"Avoidance in 450 seconds"},{"$f":"Avoidance * G5","v":0},{"$f":"Avoidance * H5","v":0},null,"Av Hit Post Buffs/Miti",{"$f":"K5 * Communion * TotT * TwoHWeapSpec * Inquisition * SealDamage * CoE","v":2069.4356950598972},{"$f":"K6 * 1.2","v":2483.3228340718765},null,{"$f":"CONCATENATE(\"Miss in \",Length,\" seconds\")","v":"Miss in 450 seconds"},{"$f":"O5 * MeleeMiss","v":0},{"$f":"P5 * MeleeMiss","v":0},null,"SoT",{"$f":"0.15 * WeaponDamage","v":1001.5887432235816},0,0]
{"$rows_left_out":76}
{"sheet":"WoL Compare","index":11,"n_rows":21,"n_cols":19,"rows_kept":21,"cut":false,"hidden":false,"merged":[[3,0,4,18],[6,3,6,5],[6,1,7,2],[6,0,7,0],[6,15,6,17],[6,12,6,14],[6,9,6,11],[6,6,6,8]]}
[null,null,null,null,"Length",{"$f":"CONCATENATE(ROUNDDOWN(Length/60,0),\":\",MOD(Length,60))","v":"7:30"}]
[]
[]
["     Damage Done"]
[]
[]
{"$rows_left_out":16}
{"sheet":"Export","index":12,"n_rows":104,"n_cols":6,"rows_kept":104,"cut":false,"hidden":true,"merged":[]}
["Current","4.0.1",null,"25 Man (Alliance)",null,"Crusader Strike"]
["Sanctified Lightsworn Helmet (Heroic)",null,"On",null,"Off","Hammer of Wrath"]
["None",null,"Off","On","Off","Exorcism"]
["Arcanum of Torment",null,"Off","On","Off","Judgement"]
["21 agi & 3% Increased Crit Dmg",null,"On","On","Off","Holy Wrath"]
["Bold Cardinal Ruby (20 Str)",0,"On","On","Off","Consecration"]
{"$rows_left_out":99}
{"sheet":"Saved","index":13,"n_rows":113,"n_cols":29,"rows_kept":113,"cut":false,"hidden":true,"merged":[]}
["Current","T12","Heroic T12",null,null,null,null,null,null,null,null,null,null,null,null,null,null,null,null,null,null,null,null,null,null,null,"25 Man","Self-Buff (Might)","None"]
["Reinforced Sapphirium Helmet","Immolation Helmet","Immolation Helmet (Heroic)"]
["Reforge: Expertise to Mastery","Reforge: Hit to Mastery","Reforge: Hit to Mastery",null,null,null,null,null,null,null,null,null,null,null,null,null,null,null,null,null,null,null,null,null,null,null,"On","On","Off"]
["Arcanum of the Wildhammer","Arcanum of the Wildhammer","Arcanum of the Wildhammer",null,null,null,null,null,null,null,null,null,null,null,null,null,null,null,null,null,null,null,null,null,null,null,"On","Off","Off"]
["54 Str & 3% Increased Crit Dmg","54 Str & 3% Increased Crit Dmg","54 Str & 3% Increased Crit Dmg",null,null,null,null,null,null,null,null,null,null,null,null,null,null,null,null,null,null,null,null,null,null,null,"On","On","Off"]
["Skillful Ember Topaz (20 Str/20 Mastery)","Bold Chimera's Eye (67 Str)","Bold Chimera's Eye (67 Str)",null,null,null,null,null,null,null,null,null,null,null,null,null,null,null,null,null,null,null,null,null,null,null,"On","Off","Off"]
{"$rows_left_out":108}
{"sheet":"Probability","index":14,"n_rows":93,"n_cols":16,"rows_kept":93,"cut":false,"hidden":true,"merged":[[90,0,90,1],[91,0,91,1],[92,0,92,1],[85,0,85,1],[86,0,86,1],[87,0,87,1],[88,0,88,1],[89,0,89,1],[8,10,8,11],[9,10,9,11],[0,10,0,15],[83,0,83,5],[84,0,84,1],[3,10,3,11],[4,10,4,11],[5,10,5,11],[6,10,6,11],[7,10,7,11],[0,5,0,8],[0,0,0,2],[1,10,1,11],[2,10,2,11]]}
["Base Information",null,null,null,null,"Templar's Verdict Calculations",null,null,null,null,"Ability Usage"]
["Ability","Minimum Cooldowns","GCD",null,null,"Ability","#","Divine Purpose","Totals",null,"Ability",null,"Total Usage","In AW","Outside AW","Effective CD"]
["Consecration",{"$f":"IF(Fillers=2,(30 * IF(GlyphOfConsecration=\"On\",1.2,1)),CEILING((30 * IF(GlyphOfConsecration=\"On\",1.2,1)),CSCD))","v":30},{"$f":"SpellGCD","v":1.1254037924829599},null,null,"Crusader Strike",{"$f":"VLOOKUP(F3,$A$17:$L$66,12,FALSE)","v":114.14687451202778},"N/A",{"$f":"(G3 * IF(T12Bonus>3,(35/120),(20/120))) + ((G3 * (1 - IF(T12Bonus>3,(35/120),(20/120)))) / 3)","v":50.731944227567901},null,"Consecration",null,{"$f":"VLOOKUP(K3,$A$17:$L$66,12,FALSE)","v":8.0840790556842137},{"$f":"M3 / 6","v":1.3473465092807022},{"$f":"M3 * 5 / 6","v":6.7367325464035117},{"$f":"Length / SUM(N3:O3)","v":55.664967759511015}]
["Crusader Strike",{"$f":"CSCD","v":3.3762113774488793},1.5,null,null,"Exorcism",{"$f":"VLOOKUP(F4,$A$17:$L$66,12,FALSE)","v":32.713652426737269},{"$f":"IF(DivPurpTalent=1,7%,IF(DivPurpTalent=2,15%,0))","v":0.15},{"$f":"G4*H4","v":4.9070478640105906},null,"Crusader Strike",null,114.14687451202778,{"$f":"M4 / 6","v":19.024479085337962},{"$f":"M4 * 5 / 6","v":95.12239542668982},3.9422892823279452]
["Exorcism",{"$f":"IF(Fillers=2,(HastedWeaponspeed / 0.2),CEILING((HastedWeaponspeed / 0.2),CSCD))","v":12.8909888957139},{"$f":"SpellGCD","v":1.1254037924829599},null,null,"Hammer of Wrath",{"$f":"VLOOKUP(F5,$A$17:$L$66,12,FALSE)","v":19.131059740779627},0.15,{"$f":"G5*H5","v":2.8696589611169441},null,"Exorcism",null,32.713652426737269,{"$f":"M5 / 6","v":5.4522754044562118},{"$f":"M5 * 5 / 6","v":27.261377022281057},13.755724800456994]
["Hammer of Wrath",{"$f":"IF(Fillers=2,(Length / (((HoWPercent * Length) / 6) + (((1 - HoWPercent) * Length) * (IF(VLOOKUP(\"Templar's Verdict\",A17:D66,4,FALSE)<VLOOKUP(\"Exorcism\",A17:D66,4,FALSE),2,3) / 20) * (1 / 6)))),CEILING((Length / (((HoWPercent * Length) / 6) + (((1 - HoWPercent) * Length) * (IF(VLOOKUP(\"Templar's Verdict\",A17:D66,4,FALSE)<VLOOKUP(\"Exorcism\",A17:D66,4,FALSE),2,3) / 20) * (1 / 6)))),CSCD))","v":19.261637239165331},1.5,null,null,"Holy Wrath",16.667391203244065,0.15,2.5001086804866097,null,"Hammer of Wrath",null,19.131059740779627,{"$f":"((HoWPercent / 6) + ((1 - HoWPercent) / 6)) / (HoWPercent + ((1 - HoWPercent) / 6)) * M6","v":9.8107998670664767},{"$f":"(1 - ((HoWPercent / 6) + ((1 - HoWPercent) / 6)) / (HoWPercent + ((1 - HoWPercent) / 6))) * M6","v":9.3202598737131499},23.52195885107103]
{"$rows_left_out":87}