{"text_format":"1","workbook":"xlsx","n_sheets":15,"sheets":["How To Use","Overview","Character","Item Calc","Reforge Calc","Graph","Priority","Gear","Sheet2","Race Type","DPS Calc","WoL Compare","Export","Saved","Probability"],"not_rendered":{"charts":3,"images":23,"macros":1,"external_links":0,"defined_names":390,"comments":7,"pivot_tables":0},"unopened":[],"bounds":{"document_bytes":16777216,"sheet_cells":100000,"rows_first":2000,"rows_last":500,"rows_between":2000,"halvings":0,"cell_chars":16384,"cell_head_chars":4096},"cells_cut":0,"cells_raw":0,"read":"whole","date_system":"1900"}

{"sheet":"How To Use","index":0,"n_rows":52,"n_cols":6,"rows_kept":52,"cut":false,"hidden":false,"merged":[[49,1,49,17],[35,1,35,17],[38,1,38,17],[39,1,39,17],[43,1,43,17],[40,1,40,17],[41,1,41,17],[42,1,42,17],[44,1,44,17],[3,1,3,17],[47,1,47,17],[36,1,37,17],[45,1,46,17],[26,2,26,4],[15,1,15,17],[16,1,18,17],[13,1,14,17],[2,1,2,17],[32,1,32,17],[34,1,34,17],[30,1,30,17],[31,1,31,17],[7,1,7,3],[8,2,8,3],[9,2,9,3],[29,1,29,17],[10,2,10,3],[19,1,20,17],[22,1,22,17],[23,1,23,17],[28,1,28,17],[12,1,12,17],[4,1,4,17]]}
[]
[]
[null,"Basic Use"]
[null,"1 - Ensure Macros are enabled."]
[null,"2.1 - Proceed to the Overview tab and input your character information."]
[]
[null,"Example:"]
[null,"Download from Armory"]
[null,"Character Name",null,null,null,"Enter your Character Name here"]
[null,"Realm",null,null,null,"Enter your Realm Name here"]
[null,"Locale","U.S.",null,null,"Select the proper zone for your Armory data"]
[]
[null,"2.2 - Click the \"Download from Armory\" button."]
[null,"2 - Ensure Circular References are Enabled.  Click on the Office Button at the top left of Excel.  Click \"Excel Options\" at the bottom.  Select the \"Formulas\" tab.  Checkmark \"Enable iterative calculation\", set \"Maximum Iterations\" to 100 and \"Maximum Change\" to 0.001."]
[]
[null,"3 - Proceed to the Character tab."]
[null,"4.1 - Manually select the gear you are wearing.  The \"Automatic Enchant, Gem, and Reforge\" button will apply the best possible enchants and gems to your gear, then apply reforging to get close to the best possible after meeting Hit and Expertise caps.  If these differ from your setup, manually configure spreadsheet to match (or go get new enchants/gems/reforging, if desired)."]
[]
[]
[null,"3.1 -   Update any Reforging information.  The Armory does not contain Reforge data - all items listed are the basic item with gems and enchants.  Until you manually update this information, your character data will not be 100% accurate.  The same goes for Engineering and Tailor Perks (Hand/Back enchants which stack with ordinary enchants)."]
[]
[null,"4.2 - Configure overall fight settings - Length, Seal used, and so on.  Many items have tooltips - mouse over them for futher information, as necessary."]
[null,"4.3 - Configure the raid buffs you have available."]
[null,"4.4 - Configure the consumables you have available."]
[]
[null,"Note:  Anything in a ","Cyan Box","is a setting which can be changed.  Gear, gems, and enchants are not Cyan, but can also be changed."]
[null,"Note:  Many items have","Mouseover Tooltips",null,null,"available to explain settings or details.  Hover your mouse over the box for additional information."]
[]
[null,"Finding Gear Upgrades"]
[null,"1 - First load all your present character information.  This may be done by hand, or by following the \"Basic Use\" steps."]
[null,"2 - Proceed to the \"Item Calc\" tab."]
[null,"3.1 - Configure the settings on the right to narrow your search.  The narrower the search, the faster it proceeds."]
[null,"3.2 - The default selection is for \"All\" items.  This can be narrowed by selecting a specific item."]
[null,"3.3 - Click \"Analyse Items.\""]
[]
[null,"Important Note:"]
[null,"1) Each piece of gear is an independent comparison to your present overall gear - a single run does not generate an overall Best in Slot list.  For example, an item with hit or expertise that is initially rated very high could become far less valuable if you hit/expertise cap from other items."]
[]
[]
[]
[null,"Using the Graph"]
[null,"1 - The Graph can be used to compare the various stats found on gear.  The higher the value, the better the stat at increasing your DPS."]
[null,"2 - The Graph can be run from its own tab via the \"Run Graph Calculation\" button.  It can also be run from the Overview tab via the \"Calculate\" button."]
[]
[null,"Important Note:"]
[null,"1) Values from the graph are based on your current gear.  Dropping below the hit or expertise cap will influence the importance of those stats.  Some stats may increase or decrease their value based on the current amount of other stats present on your gear."]
[]
[]
[]
[null,"Credits"]
[null,"Much credit goes to Bellator, who first built a Retribution spreadsheet for Burning Crusade content."]
[null,"Thanks to all on the Elitist Jerks forums (www.elitistjerks.com) for the theorycrafting and game testing."]

{"sheet":"Overview","index":1,"n_rows":71,"n_cols":18,"rows_kept":71,"cut":false,"hidden":false,"merged":[[51,1,51,3],[52,1,52,3],[56,1,56,3],[42,6,43,8],[49,1,49,3],[53,1,53,3],[54,1,54,3],[55,1,55,3],[50,1,50,3],[42,9,43,9],[58,1,58,17],[62,7,62,10],[44,1,44,3],[44,6,44,8],[45,1,45,3],[45,6,45,8],[42,1,43,3],[42,4,43,4],[46,1,46,3],[46,6,46,8],[47,1,47,3],[47,6,47,8],[48,1,48,3],[49,6,49,8],[50,6,50,8],[1,1,1,3],[6,1,6,17],[18,8,18,9],[2,2,2,3],[3,2,3,3],[4,2,4,3],[18,2,18,3],[18,4,18,5],[18,10,18,11],[2,14,4,16],[1,9,1,16],[15,11,15,13],[16,11,16,13],[37,1,37,3],[39,1,39,17],[41,1,41,9],[20,1,20,17],[22,1,22,4],[23,1,24,1],[23,2,24,2],[23,3,24,3],[23,4,24,4],[68,7,68,10],[60,6,60,10],[67,7,67,10],[66,7,66,10],[65,7,65,10],[64,7,64,10],[63,7,63,10],[61,7,61,10]]}
[]
[null,"Download from Armory",null,null,null,null,null,null,null,"Import/Export"]
[null,"Character Name",null,null,null,null,null,null,null,null,null,null,null,null,"Hover over for Instructions"]
[null,"Realm"]
[null,"Locale","U.S."]
[]
[null,"Character Stats"]
[]
[null,{"$f":"Character!B16","v":"Information"},{"$f":"Character!C16","v":"Stam"},{"$f":"Character!D16","v":"Int"},{"$f":"Character!E16","v":"Str"},{"$f":"Character!F16","v":"AP"},{"$f":"Character!G16","v":"Agi"},{"$f":"Character!H16","v":"Hit"},{"$f":"Character!I16","v":"Crit"},{"$f":"Character!J16","v":"Haste"},{"$f":"Character!K16","v":"Mastery"},{"$f":"Character!L16","v":"WE"},{"$f":"Character!M16","v":"SpD"},{"$f":"Character!N16","v":"SpH"},{"$f":"Character!O16","v":"SpC"},{"$f":"Character!P16","v":"Mp5"},{"$f":"Character!Q16","v":"Health"},{"$f":"Character!R16","v":"Mana"}]
[null,{"$f":"Character!B17","v":"Base Information (Human)"},{"$f":"Character!C17","v":156},{"$f":"Character!D17","v":106},{"$f":"Character!E17","v":164},{"$f":"Character!F17","v":563},{"$f":"Character!G17","v":97},{"$f":"Character!H17","v":0},{"$f":"Character!I17","v":1.12724},{"$f":"Character!J17","v":0},{"$f":"Character!K17","v":0},{"$f":"Character!L17","v":3},{"$f":"Character!M17","v":96},{"$f":"Character!N17","v":0},{"$f":"Character!O17","v":3.5420000000000003},{"$f":"Character!P17","v":1171},{"$f":"Character!Q17","v":44665},{"$f":"Character!R17","v":23142}]
[null,{"$f":"Character!B18","v":"Gear"},{"$f":"Character!C18","v":5949},{"$f":"Character!D18","v":20},{"$f":"Character!E18","v":5291.25},{"$f":"Character!F18","v":11244.233809141655},{"$f":"Character!G18","v":20},{"$f":"Character!H18","v":8.0010656986570527},{"$f":"Character!I18","v":5.7543571619812584},{"$f":"Character!J18","v":13.790732736927094},{"$f":"Character!K18","v":8.2608210620258813},{"$f":"Character!L18","v":14.053924441839399},{"$f":"Character!M18","v":20},{"$f":"Character!N18","v":9.3805517052886405},{"$f":"Character!O18","v":5.6959571619812586},{"$f":"Character!P18","v":0},{"$f":"Character!Q18","v":59490},{"$f":"Character!R18","v":490}]
[null,{"$f":"Character!B19","v":"Talent / Buffs / Debuffs / Pots"},{"$f":"Character!C19","v":918.45},{"$f":"Character!D19","v":6.3000000000000007},{"$f":"Character!E19","v":1164.4356250000001},{"$f":"Character!F19","v":3742.4817559141657},{"$f":"Character!G19","v":582.29999999999995},{"$f":"Character!H19","v":0},{"$f":"Character!I19","v":7.864916},{"$f":"Character!J19","v":2.666666666666667},{"$f":"Character!K19","v":0},{"$f":"Character!L19","v":10},{"$f":"Character!M19","v":5149.3061364684199},{"$f":"Character!N19","v":8},{"$f":"Character!O19","v":5.0125999999999999},{"$f":"Character!P19","v":828},{"$f":"Character!Q19","v":9184.5},{"$f":"Character!R19","v":5495.5}]
[null,{"$f":"Character!B20","v":"Grand Total"},{"$f":"Character!C20","v":7023.45},{"$f":"Character!D20","v":132.30000000000001},{"$f":"Character!E20","v":6619.6856250000001},{"$f":"Character!F20","v":15549.71556505582},{"$f":"Character!G20","v":699.3},{"$f":"Character!H20","v":8.0010656986570527},{"$f":"Character!I20","v":14.746513161981259},{"$f":"Character!J20","v":16.457399403593762},{"$f":"Character!K20","v":8.2608210620258813},{"$f":"Character!L20","v":27.053924441839399},{"$f":"Character!M20","v":5265.3061364684199},{"$f":"Character!N20","v":17.380551705288639},{"$f":"Character!O20","v":14.250557161981259},{"$f":"Character!P20","v":1999},{"$f":"Character!Q20","v":113339.5},{"$f":"Character!R20","v":29127.5}]
[]
[null,null,"Str","Hit","Crit","Haste","Mastery","WE",null,null,null,null,null,"Level",85,{"$f":"O15+1","v":86},{"$f":"P15+1","v":87},88]
[null,"Additional increases DPS by",{"$f":"Graph!C303/Graph!B303","v":0},{"$f":"Graph!D303/Graph!B303","v":0},{"$f":"Graph!E303/Graph!B303","v":0},{"$f":"Graph!F303/Graph!B303","v":0},{"$f":"Graph!G303/Graph!B303","v":0},{"$f":"Graph!H303/Graph!B303","v":0},null,null,null,"Chance to Miss",null,null,{"$f":"MAX(0,(5% - HitTotal%))","v":0},{"$f":"MAX(0,(5.5% - HitTotal%))","v":0},{"$f":"MAX(0,(6% - HitTotal%))","v":0},{"$f":"MAX(0,(8% - HitTotal%))","v":0}]
[null,"Stat Weights",1,{"$f":"IF(D16=0,0,(D16/$C$16))","v":0},{"$f":"IF(E16=0,0,(E16/$C$16))","v":0},0,0,0,null,null,null,"Chance to be Dodged",null,null,{"$f":"MAX(0,(5% - (0.25% * CurrentExpertise)))","v":0},{"$f":"MAX(0,(5.5% - (0.25% * CurrentExpertise)))","v":0},{"$f":"MAX(0,(6% - (0.25% * CurrentExpertise)))","v":0},{"$f":"MAX(0,(6.5% - (0.25% * CurrentExpertise)))","v":0}]
[]
[null,"Professions",{"$f":"Profession1","v":"Blacksmithing"},null,{"$f":"Profession2","v":"Jewelcrafting"},null,null,null,"Talent Spec",null,{"$f":"CONCATENATE(Character!S137,\" / \",Character!T137,\" / \",Character!U137)","v":"7 / 2 / 32"}]
[]
[null,"Fight Data"]
[]
[null,"--- Damage Calculations ---"]
[null,"Damage Source","Effective Cooldown","DPS","%"]
[]
[null,"White (Autoattack)","N/A",{"$f":"AutoattackDPS","v":2649.9195076906617},{"$f":"D26/TotalDPS","v":0.10087039204698983}]
[null,{"$f":"IF(SealSelection=\"SoT\", \"Seal of Truth\", \"Seal of Righteousness\")","v":"Seal of Truth"},"N/A",{"$f":"IF(SealSelection=\"SoT\", SoTDPS, SoRDPS)","v":2253.0094955280792},8.5761831799019903E-2]
[null,{"$f":"IF(SealSelection=\"SoT\", \"Censure (SoT DoT)\", \"\")","v":"Censure (SoT DoT)"},"N/A",{"$f":"IF(SealSelection=\"SoT\", SoTDoTDPS, 0)","v":2621.9340276825692},9.9805112014201378E-2]
[null,"Seals of Command","N/A",{"$f":"SoCDPS","v":925.74454997060275},3.5238887603902119E-2]
[null,"Crusader Strike",{"$f":"CSCooldown","v":3.9422892823279452},{"$f":"CSDPS","v":5688.7737706012176},0.21654576255686153]
[null,{"$f":"IF(SealSelection=\"SoT\", \"Judgement of Truth\", \"Judgement of Righteousness\")","v":"Judgement of Truth"},{"$f":"JudgementCD","v":13.580162161136959},{"$f":"IF(SealSelection=\"SoT\",JoTDPS, JoRDPS)","v":851.8219648961026},3.2424990760639122E-2]
[null,"Templar's Verdict",{"$f":"TVCooldown","v":6.930103635020548},{"$f":"TVDPS","v":6510.1729548528856},0.24781269632676661]
[null,"Consecrate",{"$f":"ConsCooldown","v":55.664967759511015},{"$f":"ConsDPS","v":189.72655137788524},7.2220275233524922E-3]
[null,"Exorcism",{"$f":"ExoCooldown","v":13.755724800456994},{"$f":"ExoDPS + IF(GlyphOfExorcism=\"On\",ExoGlyphDPS,0)","v":2519.9910498951031},9.5924606170150029E-2]
[null,"Holy Wrath",{"$f":"HWCooldown","v":26.998826301767853},{"$f":"HWDPS","v":339.94246059551148},1.2940064471456578E-2]
[null,"Hammer of Wrath",{"$f":"HoWCooldown","v":23.52195885107103},{"$f":"HoWDPS","v":1315.3318779825886},5.0068706547102895E-2]
[null,"Other Sources","N/A",{"$f":"IF(Trinket1Bonus=\"DPS\",Trinket1BonusAmount) + IF(Trinket2Bonus=\"DPS\",Trinket2BonusAmount) + IF(GloveEnchantBonus=\"DPS\",GloveEnchantBonusDamage) + IF(OR(Profession1=\"Engineering\",Profession2=\"Engineering\"),Character!S211 + Character!S212,0)","v":404.1701888986434},{"$f":"D37/TotalDPS","v":1.5384922179557481E-2}]
[null,"Total Damage Per Second",null,null,{"$f":"IF(SealSelection=\"SoT\", SoTTotal, SoRTotal) + IF(Trinket1Bonus=\"DPS\",Trinket1BonusAmount) + IF(Trinket2Bonus=\"DPS\",Trinket2BonusAmount) + IF(GloveEnchantBonus=\"DPS\",GloveEnchantBonusDamage) + IF(OR(Profession1=\"Engineering\",Profession2=\"Engineering\"),Character!S211 + Character!S212,0) + IF(WeaponEnchantBonus=\"DPS\",Character!X128,0)","v":26270.538399971851}]
[]
[null,"Mana Usage"]
[]
[null,"--- Mana Calculations ---"]
[null,"Mana Usage",null,null,"MPS",null,"Mana Modifiers",null,null,"Bonus"]
[]
[null,"Crusader Strike",null,null,{"$f":"0 - (BaseMana * (0.1 * IF(GlyphOfAsceticCrusader=\"On\",0.7,1)))/CSCooldown","v":-410.91352866003166},null,"Dark Rune",null,null,{"$f":"Character!R219","v":0}]
[null,"Judgement",null,null,{"$f":"IF(JudgementCD=0,0,(0 - (BaseMana * 0.05) / JudgementCD))","v":-85.205168117309526},null,"Mana Pot",null,null,{"$f":"Character!R223","v":0}]
[null,"Consecration",null,null,{"$f":"IF(ConsCooldown=0,0,(0 - (BaseMana * 0.55) / ConsCooldown))","v":-228.65548139700942},null,"Lay on Hands",null,null,{"$f":"Character!R235","v":0}]
[null,"Hammer of Wrath",null,null,{"$f":"IF(GlyphOfHoW=\"On\",0,IF(HoWCooldown=0,0,(0 - (BaseMana * 0.12) / HoWCooldown)))","v":0},null,"Time to 0 Mana",null,null,{"$f":"IF(E57>0,\"Infinite\",(TotalMana+SUM(J45:J47))/-E57)","v":"Infinite"}]
[null,"Exorcism",null,null,{"$f":"IF(ExoCooldown=0,0,(0 - (BaseMana * 0.3) / ExoCooldown))","v":-504.7062296397026}]
[null,"Holy Wrath",null,null,{"$f":"IF(HWCooldown=0,0,(0 - (BaseMana * 0.2) / HWCooldown))","v":-171.42967432243299},null,"Total Divine Plea",null,null,1.4997617391897222]
[null,"Avenging Wrath",null,null,{"$f":"0 - (BaseMana * 0.08) / (Length / (Length / (180 - (SancWrath * 20))))","v":-15.428000000000001},null,"Free GCD",null,null,2]
[null,"Zealotry",null,null,{"$f":"0 - (BaseMana * 0.08) / (Length / (Length / (180 - (SancWrath * 20))))","v":-15.428000000000001}]
[null,"Judgements of the Bold",null,null,{"$f":"IF(JudgementCD=0,0,(((0.025  * (1 + CurrentHaste/100)) * BaseMana) * (92%+MIN(HitTotal,8)%) * IF(JudgementCD>10,(10/JudgementCD),1)))","v":496.13861473439346}]
[null,"Replenish",null,null,{"$f":"TotalMana * 0.001","v":29.127500000000001}]
[null,"MP5 (per second)",null,null,{"$f":"($P$13 / 5)","v":399.8}]
[null,"Divine Plea",null,null,{"$f":"(10% + IF(GlyphOfDivinePlea=\"On\",5%,0%)) * TotalMana * NumDP","v":4368.431005824863}]
[null,"Total Mana Per Sec",null,null,{"$f":"SUM(E45:E56)","v":3861.7310384227703}]
[]
[null,"Spreadsheet Settings"]
[]
[null,"Estimations",{"$f":"Estimations","v":"On"},null,null,null,"--- Priorities ---"]
[null,"Delay (Latency/Reaction Time)",{"$f":"Delay","v":0.2},"seconds.",null,null,0,{"$f":"IF(InqRefresh=\"Unused\",\"\",\"Inquisition\")","v":"Inquisition"}]
[null,"Length of Fight",{"$f":"Length","v":450},"seconds.",null,null,1,{"$f":"Ability1","v":"Crusader Strike"}]
[null,"SoT/Trinket Reset",{"$f":"TrinketReset","v":0},null,null,null,2,{"$f":"Ability2","v":"Hammer of Wrath"}]
[null,"Under 20% Health",{"$f":"HoWPercent","v":0.19},null,null,null,3,{"$f":"Ability3","v":"Exorcism"}]
[null,"In Front of Boss",{"$f":"FrontOfBoss","v":"Never"},null,null,null,4,{"$f":"Ability4","v":"Templar's Verdict"}]
[null,"Extra Targets",{"$f":"ExtraTargets","v":0},null,null,null,5,{"$f":"Ability5","v":"Judgement of Truth"}]
[null,"Seal Selected",{"$f":"SealSelection","v":"SoT"},null,null,null,6,{"$f":"Ability6","v":"Holy Wrath"}]
[null,"Avenging Wrath + Zealotry",{"$f":"AWZeal","v":"Together"},null,null,null,7,{"$f":"Ability7","v":"Consecration"}]
[null,"Early Inquisition Refresh",{"$f":"InqRefresh","v":4},"seconds."]
[null,"Fillers Between Crusader Strike",{"$f":"Fillers","v":2}]

{"sheet":"Character","index":2,"n_rows":289,"n_cols":27,"rows_kept":289,"cut":false,"hidden":false,"merged":[[227,2,227,4],[232,2,232,4],[1,7,1,10],[11,2,11,3],[5,2,5,3],[7,2,7,3],[4,2,4,3],[12,2,12,3],[13,2,13,3],[3,2,3,3],[2,2,2,3],[10,2,10,3],[12,4,12,5],[3,8,3,10],[2,8,2,10],[225,25,225,26],[6,8,6,10],[8,8,8,10],[17,19,17,21],[16,19,16,21],[7,8,7,10],[207,19,207,21],[11,22,11,23],[9,8,9,10],[217,23,217,24],[2,15,3,15],[2,16,3,16],[2,17,3,17],[2,12,3,14],[4,12,4,14],[5,12,5,14],[6,12,6,14],[7,12,7,14],[8,12,8,14],[9,12,9,14],[0,1,0,10],[11,8,11,10],[12,8,12,10],[13,8,13,10],[225,1,225,8],[8,2,8,3],[4,4,4,5],[4,8,4,10],[5,8,5,10],[3,4,3,5],[9,2,9,3],[0,12,0,23],[12,12,14,23],[10,15,11,16],[10,12,11,14],[10,20,11,21],[10,17,11,19],[4,21,4,23],[5,21,5,23],[6,21,6,23],[2,21,3,23],[2,18,3,18],[2,19,3,19],[2,20,3,20],[7,21,7,23],[8,21,8,23],[9,21,9,23]]}
[null,"Spreadsheet Settings",null,null,null,null,null,null,null,null,null,null,"Damage Snapshot",null,null,null,null,null,null,null,null,null,null,null,null,null,{"$f":"CONCATENATE(Estimations, \" \", Delay, \" \", Length, \" \", TrinketReset, \" \", HoWPercent, \" \", FrontOfBoss, \" \", ExtraTargets, \" \", SealSelection, \" \", AWZeal, \" \", InqRefresh, \" \", Fillers, \" \", CurrentHaste, \" \", Mastery, \" \", RoLTalent, \" \", AoWTalent, \" \", DivPurpTalent, \" \", SancWrath, \" \", ZealotryTalent, \" \", A191, \" \", A193, \" \", Heroism)","v":"On 0.2 450 0 0.19 Never 0 SoT Together 4 2 16.4573994035938 8.26082106202588 3 3 2 3 1 On On On"}]
[null,null,null,null,null,null,null,"--- Priorities ---",null,null,null,null,null,null,null,null,null,null,null,null,null,null,null,null,null,null,"On 0.2 450 0 0.19 Never 0 SoT Together 4 2 16.4573994035938 8.26082106202588 3 3 2 3 1 On On On"]
[null,"Estimations","On",null,null,null,null,0,{"$f":"IF(InqRefresh=\"Unused\",\"\",\"Inquisition\")","v":"Inquisition"},null,null,null,"Damage Source",null,null,"Effective CD","DPS","%","%","DPS","Effective CD","Damage Source",null,null,null,null,"On 0.2 450 0 0.19 Never 0 SoT Together 4 2 11.1082193782285 11.1334225792057 3 3 2 3 1 On On On"]
[null,"Delay/Latency",0.2,null,"seconds.",null,null,1,"Crusader Strike"]
[null,"Length of Fight",450,null,"seconds.",null,null,2,"Hammer of Wrath",null,null,null,"White (Autoattack)",null,null,"N/A",{"$f":"AutoattackDPS","v":2649.9195076906617},{"$f":"Q5/TotalDPS","v":0.10087039204698983},{"$f":"T5/TotalDPS","v":0.24781269632676661},{"$f":"TVDPS","v":6510.1729548528856},{"$f":"TVCooldown","v":6.930103635020548},"Templar's Verdict"]
[null,"SoT/Trinket Reset",0,null,null,null,null,3,"Exorcism",null,null,null,{"$f":"IF(SealSelection=\"SoT\", \"Seal of Truth\", \"Seal of Righteousness\")","v":"Seal of Truth"},null,null,"N/A",{"$f":"IF(SealSelection=\"SoT\", SoTDPS, SoRDPS)","v":2253.0094955280792},8.5761831799019903E-2,7.2220275233524922E-3,{"$f":"ConsDPS","v":189.72655137788524},{"$f":"ConsCooldown","v":55.664967759511015},"Consecrate"]
[null,null,null,null,null,null,null,4,"Templar's Verdict",null,null,null,{"$f":"IF(SealSelection=\"SoT\", \"Censure (SoT DoT)\", \"\")","v":"Censure (SoT DoT)"},null,null,"N/A",{"$f":"IF(SealSelection=\"SoT\", SoTDoTDPS, 0)","v":2621.9340276825692},9.9805112014201378E-2,9.5924606170150029E-2,{"$f":"ExoDPS + IF(GlyphOfExorcism=\"On\",ExoGlyphDPS,0)","v":2519.9910498951031},{"$f":"ExoCooldown","v":13.755724800456994},"Exorcism"]
[null,"Under 20% Health",0.19,null,null,null,null,5,"Judgement of Truth",null,null,null,"Seals of Command",null,null,"N/A",{"$f":"SoCDPS","v":925.74454997060275},3.5238887603902119E-2,1.2940064471456578E-2,{"$f":"HWDPS","v":339.94246059551148},{"$f":"HWCooldown","v":26.998826301767853},"Holy Wrath"]
[null,"In Front of Boss","Never",null,null,null,null,6,"Holy Wrath",null,null,null,{"$f":"IF(ExtraTargets>2,\"Divine Storm\",\"Crusader Strike\")","v":"Crusader Strike"},null,null,{"$f":"CSCooldown","v":3.9422892823279452},{"$f":"CSDPS","v":5688.7737706012176},0.21654576255686153,5.0068706547102895E-2,{"$f":"HoWDPS","v":1315.3318779825886},{"$f":"HoWCooldown","v":23.52195885107103},"Hammer of Wrath"]
[null,"Extra Targets",0,null,null,null,null,7,"Consecration",null,null,null,{"$f":"IF(SealSelection=\"SoT\", \"Judgement of Truth\", \"Judgement of Righteousness\")","v":"Judgement of Truth"},null,null,{"$f":"JudgementCD","v":13.580162161136959},{"$f":"IF(SealSelection=\"SoT\",JoTDPS, JoRDPS)","v":851.8219648961026},3.2424990760639122E-2,1.5384922179557481E-2,{"$f":"IF(Trinket1Bonus=\"DPS\",Trinket1BonusAmount) + IF(Trinket2Bonus=\"DPS\",Trinket2BonusAmount) + IF(GloveEnchantBonus=\"DPS\",GloveEnchantBonusDamage) + IF(OR(Profession1=\"Engineering\",Profession2=\"Engineering\"),Character!S211 + Character!S212,0)","v":404.1701888986434},"N/A","Other Sources"]
[null,"Seal Selection","SoT",null,null,null,null,null,null,null,null,null,"Total DPS",null,null,{"$f":"TotalDPS","v":26270.538399971851},null,"Time to OOM",null,null,{"$f":"Overview!J48","v":"Infinite"}]
[null,"AW + Zealotry","Together",null,null,null,null,null,"Professions",null,null,null,null,null,null,null,null,null,null,null,null,null,"seconds."]
[null,"Early Inquisition Refresh",4,null,{"$f":"IF(InqRefresh=1,\"second.\",\"seconds.\")","v":"seconds."},null,null,null,"Blacksmithing",null,null,null,{"$f":"IF(OR(Y16<Y26,Z16<Z26,AA16<AA26),\"Does Not Meet Meta Requirements!\",IF(SUM(S171:S175)>3,\"Too many Prime Glyphs!\",IF(SUM(S176:S182)>3,\"Too many Major Glyphs!\",IF(SUM($S$137:$U$137)>41,\"Too Many Talents!\",0))))","v":0}]
[null,"Fillers Between Crusader Strike",2,null,null,null,null,null,"Jewelcrafting"]
[]
[null,"Information","Stam","Int","Str","AP","Agi","Hit","Crit","Haste","Mastery","WE","SpD","SpH","SpC","Mp5","Health","Mana",null,null,null,null,null,null,{"$f":"SUM(Y27:Y119,Y129:Y131)","v":14},{"$f":"SUM(Z27:Z119,Z129:Z131)","v":2},{"$f":"SUM(AA27:AA119,AA129:AA131)","v":3}]
[null,"Base Information (Human)",{"$f":"VLOOKUP($B$17,RaceTypeInfo,2,FALSE)","v":156},{"$f":"VLOOKUP($B$17,RaceTypeInfo,3,FALSE)","v":106},{"$f":"VLOOKUP($B$17,RaceTypeInfo,4,FALSE)","v":164},{"$f":"VLOOKUP($B$17,RaceTypeInfo,5,FALSE)","v":563},{"$f":"VLOOKUP($B$17,RaceTypeInfo,6,FALSE)","v":97},{"$f":"VLOOKUP($B$17,RaceTypeInfo,7,FALSE)","v":0},{"$f":"VLOOKUP($B$17,RaceTypeInfo,8,FALSE) + (G17 * G223)","v":1.12724},{"$f":"VLOOKUP($B$17,RaceTypeInfo,9,FALSE)","v":0},{"$f":"VLOOKUP($B$17,RaceTypeInfo,10,FALSE)","v":0},{"$f":"VLOOKUP($B$17,RaceTypeInfo,11,FALSE)","v":3},{"$f":"VLOOKUP($B$17,RaceTypeInfo,12,FALSE)","v":96},{"$f":"VLOOKUP($B$17,RaceTypeInfo,14,FALSE)","v":0},{"$f":"VLOOKUP($B$17,RaceTypeInfo,15,FALSE) + (D17 * D223)","v":3.5420000000000003},{"$f":"VLOOKUP($B$17,RaceTypeInfo,16,FALSE)","v":1171},{"$f":"VLOOKUP($B$17,RaceTypeInfo,17,FALSE)","v":44665},{"$f":"VLOOKUP($B$17,RaceTypeInfo,18,FALSE)","v":23142},null,"Gem Cap"]
[null,"Gear",{"$f":"SUM(C23:C132)","v":5949},{"$f":"SUM(D23:D132)","v":20},{"$f":"SUM(E23:E132)","v":5291.25},{"$f":"SUM(F23:F132)+E18*2","v":11244.233809141655},{"$f":"SUM(G23:G132)","v":20},{"$f":"SUM(H23:H132)/H223","v":8.0010656986570527},{"$f":"SUM(I23:I132)/I223+(SUM(G23:G132)*G223)","v":5.7543571619812584},{"$f":"(SUM(J23:J132)/J223)","v":13.790732736927094},{"$f":"(SUM(K23:K132)/K223)","v":8.2608210620258813},{"$f":"(SUM(L23:L132)/L223)","v":14.053924441839399},{"$f":"SUM(M23:M132) + D18","v":20},{"$f":"SUM(H23:H132)/N223","v":9.3805517052886405},{"$f":"SUM(I23:I132)/O223 + (SUM(D23:D132)*D223)","v":5.6959571619812586},{"$f":"SUM(P23:P132)","v":0},{"$f":"SUM(Q23:Q132)","v":59490},{"$f":"SUM(R23:R132) + 190","v":490},null,"Rare"]
[null,"Talent / Buffs / Debuffs / Pots",{"$f":"SUM(C138:C215)+IF(OR(Profession1=\"Mining\",Profession2=\"Mining\"),60,0)","v":918.45},{"$f":"SUM(D138:D215)","v":6.3000000000000007},{"$f":"SUM(E138:E215)","v":1164.4356250000001},{"$f":"SUM(F138:F215)","v":3742.4817559141657},{"$f":"SUM(G138:G215)","v":582.29999999999995},{"$f":"SUM(H138:H215)","v":0},{"$f":"SUM(I138:I215) + IF(OR(Profession1=\"Skinning\",Profession2=\"Skinning\"),40/I223,0)","v":7.864916},{"$f":"SUM(J206:J215) + (J201 * 100)","v":2.666666666666667},{"$f":"SUM(K206:K215)","v":0},{"$f":"SUM(L138:L215)","v":10},{"$f":"SUM(M138:M215) + D19","v":5149.3061364684199},{"$f":"SUM(N138:N139,N141:N215) + (N140 * 100)","v":8},{"$f":"SUM(O138:O215)","v":5.0125999999999999},{"$f":"SUM(P138:P215)","v":828},{"$f":"(C19*10)","v":9184.5},{"$f":"SUM(R138:R195)","v":5495.5}]
[null,"Grand Total",{"$f":"C19+C17+C18","v":7023.45},{"$f":"D19+D17+D18","v":132.30000000000001},{"$f":"E19 + E17 + E18 + E220","v":6619.6856250000001},{"$f":"(F19 + F17 + F18 + F220)","v":15549.71556505582},{"$f":"G19+G17+G18+G220","v":699.3},{"$f":"H19+H17+H18+H220","v":8.0010656986570527},{"$f":"IF((I19+I17+I18+I220)>100,100,(I19+I17+I18+I220))","v":14.746513161981259},{"$f":"J19+J17+J18+J220","v":16.457399403593762},{"$f":"K19+K17+K18+K220","v":8.2608210620258813},{"$f":"(L19+L17+L18+L220)","v":27.053924441839399},{"$f":"M19+M17+M18+M220","v":5265.3061364684199},{"$f":"N19+N17+N18+N220","v":17.380551705288639},{"$f":"O19+O17+O18+O220","v":14.250557161981259},{"$f":"P19+P17+P18","v":1999},{"$f":"SUM(Q17:Q19) + ICCStam","v":113339.5},{"$f":"R19+R17+R18","v":29127.5}]
[]
[null,"Gear","Stam","Int","Str","AP","Agi","Hit","Crit","Haste","Mastery","WE","SpD","SpH","SpC","Mp5","Health","Mana","G1","G2","G3","G4","Bonus","Amount"]
[null,"Reinforced Sapphirium Helmet",{"$f":"IF(OR($B23=\"None\",ISBLANK($B23)),0,VLOOKUP($B23,ItemList,HLOOKUP(C$22,StatLoC,2,FALSE),FALSE))","v":512},0,281,0,0,0,{"$f":"IF(OR($B23=\"None\",ISBLANK($B23)),0,VLOOKUP($B23,ItemList,HLOOKUP(I$22,StatLoC,2,FALSE),FALSE))","v":0},228,{"$f":"IF(OR($B23=\"None\",ISBLANK($B23)),0,VLOOKUP($B23,ItemList,HLOOKUP(K$22,StatLoC,2,FALSE),FALSE))","v":0},168,0,{"$f":"IF(OR($B23=\"None\",ISBLANK($B23)),0,VLOOKUP($B23,ItemList,HLOOKUP(N$22,StatLoC,2,FALSE),FALSE))","v":0},0,0,{"$f":"10*C23","v":5120},{"$f":"(D23*15)","v":0},{"$f":"IF(OR($B23=\"None\",ISBLANK($B23)),0,VLOOKUP($B23,ItemList,HLOOKUP(S$22,StatLoC,2,FALSE),FALSE))","v":"m"},"y",0,0,"Str",30]
[null,"Reforge: Expertise to Mastery",null,null,null,null,null,{"$f":"IF(AND(RIGHT(B24,3)=\"Hit\",H23<=0),(-1 * SUM(I24:L24)),IF(RIGHT(LEFT(B24,12),3)=\"Hit\",ROUNDDOWN((-0.4 * H23),0),0))","v":0},{"$f":"IF(AND(RIGHT(B24,4)=\"Crit\",I23<=0),(-1 * SUM(H24,J24,K24,L24)),IF(RIGHT(LEFT(B24,13),4)=\"Crit\",ROUNDDOWN((-0.4 * I23),0),0))","v":0},{"$f":"IF(AND(RIGHT(B24,5)=\"Haste\",J23<=0),(-1 * SUM(H24:I24,K24:L24)),IF(RIGHT(LEFT(B24,14),5)=\"Haste\",ROUNDDOWN((-0.4 * J23),0),0))","v":0},{"$f":"IF(AND(RIGHT(B24,7)=\"Mastery\",K23<=0),(-1 * SUM(H24:J24,L24)),IF(RIGHT(LEFT(B24,16),7)=\"Mastery\",ROUNDDOWN((-0.4 * K23),0),0))","v":67},{"$f":"IF(AND(RIGHT(B24,9)=\"Expertise\",L23<=0),(-1 * SUM(H24:K24)),IF(RIGHT(LEFT(B24,18),9)=\"Expertise\",ROUNDDOWN((-0.4 * L23),0),0))","v":-67}]
[null,"Arcanum of the Wildhammer",0,0,60,0,0,0,0,0,35,0,0,0,0,0,{"$f":"10*C25","v":0},{"$f":"(D25*15)","v":0},null,null,null,null,{"$f":"IF(SUM(S25:V25)>0,1,0)","v":0}]
[{"$f":"S23","v":"m"},"54 Str & 3% Increased Crit Dmg",{"$f":"IF(ISNONTEXT($S23),0,VLOOKUP($B26,ItemList,HLOOKUP(C$22,StatLoC,2,FALSE),FALSE))","v":0},0,54,0,0,0,0,0,0,0,0,0,0,0,0,0,{"$f":"IF(ISNONTEXT($S23),0,VLOOKUP($B26,ItemList,HLOOKUP(S$22,StatLoC,2,FALSE),FALSE))","v":"m"},{"$f":"IF(ISNONTEXT($S23),0,VLOOKUP($B26,ItemList,HLOOKUP(T$22,StatLoC,2,FALSE),FALSE))","v":0},{"$f":"IF(ISNONTEXT($S23),0,VLOOKUP($B26,ItemList,HLOOKUP(U$22,StatLoC,2,FALSE),FALSE))","v":0},{"$f":"IF(ISNONTEXT($S23),0,VLOOKUP($B26,ItemList,HLOOKUP(V$22,StatLoC,2,FALSE),FALSE))","v":0},{"$f":"IF(ISNONTEXT(S23),\"\",IF(OR(S23=S26,S23=T26),\"\",\"Fail\"))","v":""},{"$f":"IF(OR($B26=\"None\",ISBLANK($B26),ISNONTEXT($S23)),0,VLOOKUP($B26,ItemList,HLOOKUP(X$22,StatLoC,2,FALSE),FALSE))","v":"Crit"},{"$f":"IF(S23=\"m\",IF(B26=\"Chance to Increase Melee Speed\",1,IF(B26=\"54 Crit & 1% Spell Reflect\",2,IF(OR(B26=\"54 Crit & 3% Increased Crit Dmg\",B26=\"54 Str & 3% Increased Crit Dmg\"),3,0))),0)","v":3},{"$f":"IF(S23=\"m\",IF(B26=\"Chance to Increase Melee Speed\",1,0),0)","v":0},{"$f":"IF(S23=\"m\",IF(B26=\"Chance to Increase Melee Speed\",1,0),0)","v":0}]
[{"$f":"T23","v":"y"},"Skillful Ember Topaz (20 Str/20 Mastery)",{"$f":"IF(ISNONTEXT($T23),0,VLOOKUP($B27,ItemList,HLOOKUP(C$22,StatLoC,2,FALSE),FALSE))","v":0},0,20,0,0,0,0,0,20,0,0,0,0,0,0,0,{"$f":"IF(ISNONTEXT($T23),0,VLOOKUP($B27,ItemList,HLOOKUP(S$22,StatLoC,2,FALSE),FALSE))","v":"r"},{"$f":"IF(ISNONTEXT($T23),0,VLOOKUP($B27,ItemList,HLOOKUP(T$22,StatLoC,2,FALSE),FALSE))","v":"y"},{"$f":"IF(ISNONTEXT($T23),0,VLOOKUP($B27,ItemList,HLOOKUP(U$22,StatLoC,2,FALSE),FALSE))","v":0},{"$f":"IF(ISNONTEXT($T23),0,VLOOKUP($B27,ItemList,HLOOKUP(V$22,StatLoC,2,FALSE),FALSE))","v":0},{"$f":"IF(ISNONTEXT(T23),\"\",IF(OR(T23=S27,T23=T27,T23=U27),\"\",\"Fail\"))","v":""},null,{"$f":"IF(OR(S27=\"r\",T27=\"r\",U27=\"r\"),1,0)","v":1},{"$f":"IF(OR(S27=\"y\",T27=\"y\",U27=\"y\"),1,0)","v":1},{"$f":"IF(OR(S27=\"b\",T27=\"b\",U27=\"b\"),1,0)","v":0}]
[{"$f":"U23","v":0},"Bold Chimera's Eye (67 Str)",{"$f":"IF(ISNONTEXT($U23),0,VLOOKUP($B28,ItemList,HLOOKUP(C$22,StatLoC,2,FALSE),FALSE))","v":0},0,0,0,0,0,0,0,0,0,0,0,0,0,0,0,{"$f":"IF(ISNONTEXT($U23),0,VLOOKUP($B28,ItemList,HLOOKUP(S$22,StatLoC,2,FALSE),FALSE))","v":0},{"$f":"IF(ISNONTEXT($U23),0,VLOOKUP($B28,ItemList,HLOOKUP(T$22,StatLoC,2,FALSE),FALSE))","v":0},{"$f":"IF(ISNONTEXT($U23),0,VLOOKUP($B28,ItemList,HLOOKUP(U$22,StatLoC,2,FALSE),FALSE))","v":0},{"$f":"IF(ISNONTEXT($U23),0,VLOOKUP($B28,ItemList,HLOOKUP(V$22,StatLoC,2,FALSE),FALSE))","v":0},{"$f":"IF(ISNONTEXT(U23),\"\",IF(OR(U23=S28,U23=T28,U23=U28),\"\",\"Fail\"))","v":""},null,{"$f":"IF(OR(S28=\"r\",T28=\"r\",U28=\"r\"),1,0)","v":0},{"$f":"IF(OR(S28=\"y\",T28=\"y\",U28=\"y\"),1,0)","v":0},{"$f":"IF(OR(S28=\"b\",T28=\"b\",U28=\"b\"),1,0)","v":0}]
[{"$f":"IF(AND(ISNONTEXT(A28),ISNONTEXT(A27),ISNONTEXT(A26)),\"\",\"bo\")","v":"bo"},"Bonus:",{"$f":"IF($W29=TRUE,IF(C$22=$W23,$X23,0),0)","v":0},0,30,0,0,0,0,0,0,0,0,0,0,0,0,0,null,null,null,null,{"$f":"IF(OR(W26=\"Fail\",W27=\"Fail\",W28=\"Fail\"),FALSE,TRUE)","v":true}]
[null,"Reinforced Sapphirium Pauldrons",{"$f":"IF(OR($B30=\"None\",ISBLANK($B30)),0,VLOOKUP($B30,ItemList,HLOOKUP(C$22,StatLoC,2,FALSE),FALSE))","v":380},0,233,0,0,149,0,169,0,0,0,{"$f":"IF(OR($B30=\"None\",ISBLANK($B30)),0,VLOOKUP($B30,ItemList,HLOOKUP(N$22,StatLoC,2,FALSE),FALSE))","v":0},0,0,3800,0,{"$f":"IF(OR($B30=\"None\",ISBLANK($B30)),0,VLOOKUP($B30,ItemList,HLOOKUP(S$22,StatLoC,2,FALSE),FALSE))","v":"r"},0,0,0,"Haste",10]
[null,"Reforge: Haste to Mastery",null,null,null,null,null,{"$f":"IF(RIGHT(B31,3)=\"Hit\",(-1 * SUM(I31:L31)),IF(RIGHT(LEFT(B31,12),3)=\"Hit\",ROUNDDOWN((-0.4 * H30),0),0))","v":0},{"$f":"IF(RIGHT(B31,4)=\"Crit\",(-1 * SUM(H31,J31,K31,L31)),IF(RIGHT(LEFT(B31,13),4)=\"Crit\",ROUNDDOWN((-0.4 * I30),0),0))","v":0},{"$f":"IF(RIGHT(B31,5)=\"Haste\",(-1 * SUM(H31:I31,K31:L31)),IF(RIGHT(LEFT(B31,14),5)=\"Haste\",ROUNDDOWN((-0.4 * J30),0),0))","v":-67},{"$f":"IF(RIGHT(B31,7)=\"Mastery\",(-1 * SUM(H31:J31,L31)),IF(RIGHT(LEFT(B31,16),7)=\"Mastery\",ROUNDDOWN((-0.4 * K30),0),0))","v":67},{"$f":"IF(RIGHT(B31,9)=\"Expertise\",(-1 * SUM(H31:K31)),IF(RIGHT(LEFT(B31,18),9)=\"Expertise\",ROUNDDOWN((-0.4 * L30),0),0))","v":0}]
[null,"Greater Inscription of Jagged Stone",0,0,50,0,0,0,25,0,0,0,0,0,0,0,0,0,null,null,null,null,{"$f":"IF(SUM(S32:V32)>0,1,0)","v":0}]
[{"$f":"S30","v":"r"},"Bold Chimera's Eye (67 Str)",{"$f":"IF(ISNONTEXT($S30),0,VLOOKUP($B33,ItemList,HLOOKUP(C$22,StatLoC,2,FALSE),FALSE))","v":0},0,67,0,0,0,0,0,0,0,0,0,0,0,0,0,{"$f":"IF(ISNONTEXT($S30),0,VLOOKUP($B33,ItemList,HLOOKUP(S$22,StatLoC,2,FALSE),FALSE))","v":"r"},{"$f":"IF(ISNONTEXT($S30),0,VLOOKUP($B33,ItemList,HLOOKUP(T$22,StatLoC,2,FALSE),FALSE))","v":0},{"$f":"IF(ISNONTEXT($S30),0,VLOOKUP($B33,ItemList,HLOOKUP(U$22,StatLoC,2,FALSE),FALSE))","v":0},{"$f":"IF(ISNONTEXT($S30),0,VLOOKUP($B33,ItemList,HLOOKUP(V$22,StatLoC,2,FALSE),FALSE))","v":0},{"$f":"IF(ISNONTEXT(S30),\"\",IF(OR(S30=S33,S30=T33, S30=U33),\"\",\"Fail\"))","v":""},null,{"$f":"IF(OR(S33=\"r\",T33=\"r\",U33=\"r\"),1,0)","v":1},{"$f":"IF(OR(S33=\"y\",T33=\"y\",U33=\"y\"),1,0)","v":0},{"$f":"IF(OR(S33=\"b\",T33=\"b\",U33=\"b\"),1,0)","v":0}]
[{"$f":"T30","v":0},"Bold Chimera's Eye (67 Str)",{"$f":"IF(ISNONTEXT($T30),0,VLOOKUP($B34,ItemList,HLOOKUP(C$22,StatLoC,2,FALSE),FALSE))","v":0},0,0,0,0,0,0,0,0,0,0,0,0,0,0,0,{"$f":"IF(ISNONTEXT($T30),0,VLOOKUP($B34,ItemList,HLOOKUP(S$22,StatLoC,2,FALSE),FALSE))","v":0},{"$f":"IF(ISNONTEXT($T30),0,VLOOKUP($B34,ItemList,HLOOKUP(T$22,StatLoC,2,FALSE),FALSE))","v":0},{"$f":"IF(ISNONTEXT($T30),0,VLOOKUP($B34,ItemList,HLOOKUP(U$22,StatLoC,2,FALSE),FALSE))","v":0},{"$f":"IF(ISNONTEXT($T30),0,VLOOKUP($B34,ItemList,HLOOKUP(V$22,StatLoC,2,FALSE),FALSE))","v":0},{"$f":"IF(ISNONTEXT(T30),\"\",IF(OR(T30=S34,T30=T34,T30=U34),\"\",\"Fail\"))","v":""},null,{"$f":"IF(OR(S34=\"r\",T34=\"r\",U34=\"r\"),1,0)","v":0},{"$f":"IF(OR(S34=\"y\",T34=\"y\",U34=\"y\"),1,0)","v":0},{"$f":"IF(OR(S34=\"b\",T34=\"b\",U34=\"b\"),1,0)","v":0}]
[{"$f":"U30","v":0},"Bold Inferno Ruby (40 Str)",{"$f":"IF(ISNONTEXT($U30),0,VLOOKUP($B35,ItemList,HLOOKUP(C$22,StatLoC,2,FALSE),FALSE))","v":0},0,0,0,0,0,0,0,0,0,0,0,0,0,0,0,{"$f":"IF(ISNONTEXT($U30),0,VLOOKUP($B35,ItemList,HLOOKUP(S$22,StatLoC,2,FALSE),FALSE))","v":0},{"$f":"IF(ISNONTEXT($U30),0,VLOOKUP($B35,ItemList,HLOOKUP(T$22,StatLoC,2,FALSE),FALSE))","v":0},{"$f":"IF(ISNONTEXT($U30),0,VLOOKUP($B35,ItemList,HLOOKUP(U$22,StatLoC,2,FALSE),FALSE))","v":0},{"$f":"IF(ISNONTEXT($U30),0,VLOOKUP($B35,ItemList,HLOOKUP(V$22,StatLoC,2,FALSE),FALSE))","v":0},{"$f":"IF(ISNONTEXT(U30),\"\",IF(OR(U30=S35,U30=T35,U30=U35),\"\",\"Fail\"))","v":""},null,{"$f":"IF(OR(S35=\"r\",T35=\"r\",U35=\"r\"),1,0)","v":0},{"$f":"IF(OR(S35=\"y\",T35=\"y\",U35=\"y\"),1,0)","v":0},{"$f":"IF(OR(S35=\"b\",T35=\"b\",U35=\"b\"),1,0)","v":0}]
[{"$f":"IF(AND(ISNONTEXT(A35),ISNONTEXT(A34),ISNONTEXT(A33)),\"\",\"bo\")","v":"bo"},"Bonus:",{"$f":"IF($W36=TRUE,IF(C$22=$W30,$X30,0),0)","v":0},0,0,0,0,0,0,10,0,0,0,0,0,0,0,0,null,null,null,null,{"$f":"IF(OR(W33=\"Fail\",W34=\"Fail\",W35=\"Fail\"),FALSE,TRUE)","v":true}]
[null,"Immolation Battleplate",{"$f":"IF(OR($B37=\"None\",ISBLANK($B37)),0,VLOOKUP($B37,ItemList,HLOOKUP(C$22,StatLoC,2,FALSE),FALSE))","v":611},0,368,0,0,0,0,235,0,269,0,{"$f":"IF(OR($B37=\"None\",ISBLANK($B37)),0,VLOOKUP($B37,ItemList,HLOOKUP(N$22,StatLoC,2,FALSE),FALSE))","v":0},0,0,6110,0,{"$f":"IF(OR($B37=\"None\",ISBLANK($B37)),0,VLOOKUP($B37,ItemList,HLOOKUP(S$22,StatLoC,2,FALSE),FALSE))","v":"r"},"b",0,0,"Str",20]
[null,"Reforge: Expertise to Mastery",null,null,null,null,null,{"$f":"IF(RIGHT(B38,3)=\"Hit\",(-1 * SUM(I38:L38)),IF(RIGHT(LEFT(B38,12),3)=\"Hit\",ROUNDDOWN((-0.4 * H37),0),0))","v":0},{"$f":"IF(RIGHT(B38,4)=\"Crit\",(-1 * SUM(H38,J38,K38,L38)),IF(RIGHT(LEFT(B38,13),4)=\"Crit\",ROUNDDOWN((-0.4 * I37),0),0))","v":0},{"$f":"IF(RIGHT(B38,5)=\"Haste\",(-1 * SUM(H38:I38,K38:L38)),IF(RIGHT(LEFT(B38,14),5)=\"Haste\",ROUNDDOWN((-0.4 * J37),0),0))","v":0},{"$f":"IF(RIGHT(B38,7)=\"Mastery\",(-1 * SUM(H38:J38,L38)),IF(RIGHT(LEFT(B38,16),7)=\"Mastery\",ROUNDDOWN((-0.4 * K37),0),0))","v":107},{"$f":"IF(RIGHT(B38,9)=\"Expertise\",(-1 * SUM(H38:K38)),IF(RIGHT(LEFT(B38,18),9)=\"Expertise\",ROUNDDOWN((-0.4 * L37),0),0))","v":-107}]
[null,"Peerless Stats",20,20,20,0,20,0,0,0,0,0,0,0,0,0,200,300,null,null,null,null,{"$f":"IF(SUM(S39:V39)>0,1,0)","v":0}]
[{"$f":"S37","v":"r"},"Bold Inferno Ruby (40 Str)",{"$f":"IF(ISNONTEXT($S37),0,VLOOKUP($B40,ItemList,HLOOKUP(C$22,StatLoC,2,FALSE),FALSE))","v":0},0,40,0,0,0,0,0,0,0,0,0,0,0,0,0,{"$f":"IF(ISNONTEXT($S37),0,VLOOKUP($B40,ItemList,HLOOKUP(S$22,StatLoC,2,FALSE),FALSE))","v":"r"},{"$f":"IF(ISNONTEXT($S37),0,VLOOKUP($B40,ItemList,HLOOKUP(T$22,StatLoC,2,FALSE),FALSE))","v":0},{"$f":"IF(ISNONTEXT($S37),0,VLOOKUP($B40,ItemList,HLOOKUP(U$22,StatLoC,2,FALSE),FALSE))","v":0},{"$f":"IF(ISNONTEXT($S37),0,VLOOKUP($B40,ItemList,HLOOKUP(V$22,StatLoC,2,FALSE),FALSE))","v":0},{"$f":"IF(ISNONTEXT(S37),\"\",IF(OR(S37=S40,S37=T40, S37=U40),\"\",\"Fail\"))","v":""},null,{"$f":"IF(OR(S40=\"r\",T40=\"r\",U40=\"r\"),1,0)","v":1},{"$f":"IF(OR(S40=\"y\",T40=\"y\",U40=\"y\"),1,0)","v":0},{"$f":"IF(OR(S40=\"b\",T40=\"b\",U40=\"b\"),1,0)","v":0}]
[{"$f":"T37","v":"b"},"Etched Demonseye (20 Str/20 Hit)",{"$f":"IF(ISNONTEXT($T37),0,VLOOKUP($B41,ItemList,HLOOKUP(C$22,StatLoC,2,FALSE),FALSE))","v":0},0,20,0,0,20,0,0,0,0,0,0,0,0,0,0,{"$f":"IF(ISNONTEXT($T37),0,VLOOKUP($B41,ItemList,HLOOKUP(S$22,StatLoC,2,FALSE),FALSE))","v":"r"},{"$f":"IF(ISNONTEXT($T37),0,VLOOKUP($B41,ItemList,HLOOKUP(T$22,StatLoC,2,FALSE),FALSE))","v":"b"},{"$f":"IF(ISNONTEXT($T37),0,VLOOKUP($B41,ItemList,HLOOKUP(U$22,StatLoC,2,FALSE),FALSE))","v":0},{"$f":"IF(ISNONTEXT($T37),0,VLOOKUP($B41,ItemList,HLOOKUP(V$22,StatLoC,2,FALSE),FALSE))","v":0},{"$f":"IF(ISNONTEXT(T37),\"\",IF(OR(T37=S41,T37=T41,T37=U41),\"\",\"Fail\"))","v":""},null,{"$f":"IF(OR(S41=\"r\",T41=\"r\",U41=\"r\"),1,0)","v":1},{"$f":"IF(OR(S41=\"y\",T41=\"y\",U41=\"y\"),1,0)","v":0},{"$f":"IF(OR(S41=\"b\",T41=\"b\",U41=\"b\"),1,0)","v":1}]
[{"$f":"U37","v":0},"Bold Inferno Ruby (40 Str)",{"$f":"IF(ISNONTEXT($U37),0,VLOOKUP($B42,ItemList,HLOOKUP(C$22,StatLoC,2,FALSE),FALSE))","v":0},0,0,0,0,0,0,0,0,0,0,0,0,0,0,0,{"$f":"IF(ISNONTEXT($U37),0,VLOOKUP($B42,ItemList,HLOOKUP(S$22,StatLoC,2,FALSE),FALSE))","v":0},{"$f":"IF(ISNONTEXT($U37),0,VLOOKUP($B42,ItemList,HLOOKUP(T$22,StatLoC,2,FALSE),FALSE))","v":0},{"$f":"IF(ISNONTEXT($U37),0,VLOOKUP($B42,ItemList,HLOOKUP(U$22,StatLoC,2,FALSE),FALSE))","v":0},{"$f":"IF(ISNONTEXT($U37),0,VLOOKUP($B42,ItemList,HLOOKUP(V$22,StatLoC,2,FALSE),FALSE))","v":0},{"$f":"IF(ISNONTEXT(U37),\"\",IF(OR(U37=S42,U37=T42,U37=U42),\"\",\"Fail\"))","v":""},null,{"$f":"IF(OR(S42=\"r\",T42=\"r\",U42=\"r\"),1,0)","v":0},{"$f":"IF(OR(S42=\"y\",T42=\"y\",U42=\"y\"),1,0)","v":0},{"$f":"IF(OR(S42=\"b\",T42=\"b\",U42=\"b\"),1,0)","v":0}]
[{"$f":"IF(AND(ISNONTEXT(A42),ISNONTEXT(A41),ISNONTEXT(A40)),\"\",\"bo\")","v":"bo"},"Bonus:",{"$f":"IF($W43=TRUE,IF(C$22=$W37,$X37,0),0)","v":0},0,20,0,0,0,0,0,0,0,0,0,0,0,0,0,null,null,null,null,{"$f":"IF(OR(W40=\"Fail\",W41=\"Fail\",W42=\"Fail\"),FALSE,TRUE)","v":true}]
[null,"Immolation Legplates",{"$f":"IF(OR($B44=\"None\",ISBLANK($B44)),0,VLOOKUP($B44,ItemList,HLOOKUP(C$22,StatLoC,2,FALSE),FALSE))","v":611},0,368,0,0,0,227,0,274,0,0,{"$f":"IF(OR($B44=\"None\",ISBLANK($B44)),0,VLOOKUP($B44,ItemList,HLOOKUP(N$22,StatLoC,2,FALSE),FALSE))","v":0},0,0,6110,0,{"$f":"IF(OR($B44=\"None\",ISBLANK($B44)),0,VLOOKUP($B44,ItemList,HLOOKUP(S$22,StatLoC,2,FALSE),FALSE))","v":"r"},"y",0,0,"Str",20]
[null,"Reforge: Crit to Hit",null,null,null,null,null,{"$f":"IF(RIGHT(B45,3)=\"Hit\",(-1 * SUM(I45:L45)),IF(RIGHT(LEFT(B45,12),3)=\"Hit\",ROUNDDOWN((-0.4 * H44),0),0))","v":90},{"$f":"IF(RIGHT(B45,4)=\"Crit\",(-1 * SUM(H45,J45,K45,L45)),IF(RIGHT(LEFT(B45,13),4)=\"Crit\",ROUNDDOWN((-0.4 * I44),0),0))","v":-90},{"$f":"IF(RIGHT(B45,5)=\"Haste\",(-1 * SUM(H45:I45,K45:L45)),IF(RIGHT(LEFT(B45,14),5)=\"Haste\",ROUNDDOWN((-0.4 * J44),0),0))","v":0},{"$f":"IF(RIGHT(B45,7)=\"Mastery\",(-1 * SUM(H45:J45,L45)),IF(RIGHT(LEFT(B45,16),7)=\"Mastery\",ROUNDDOWN((-0.4 * K44),0),0))","v":0},{"$f":"IF(RIGHT(B45,9)=\"Expertise\",(-1 * SUM(H45:K45)),IF(RIGHT(LEFT(B45,18),9)=\"Expertise\",ROUNDDOWN((-0.4 * L44),0),0))","v":0}]
[null,"Dragonscale Leg Armor",0,0,0,190,0,0,55,0,0,0,0,0,0,0,0,0,null,null,null,null,{"$f":"IF(SUM(S46:V46)>0,1,0)","v":0}]
[{"$f":"S44","v":"r"},"Bold Inferno Ruby (40 Str)",{"$f":"IF(ISNONTEXT($S44),0,VLOOKUP($B47,ItemList,HLOOKUP(C$22,StatLoC,2,FALSE),FALSE))","v":0},0,40,0,0,0,0,0,0,0,0,0,0,0,0,0,{"$f":"IF(ISNONTEXT($S44),0,VLOOKUP($B47,ItemList,HLOOKUP(S$22,StatLoC,2,FALSE),FALSE))","v":"r"},{"$f":"IF(ISNONTEXT($S44),0,VLOOKUP($B47,ItemList,HLOOKUP(T$22,StatLoC,2,FALSE),FALSE))","v":0},{"$f":"IF(ISNONTEXT($S44),0,VLOOKUP($B47,ItemList,HLOOKUP(U$22,StatLoC,2,FALSE),FALSE))","v":0},{"$f":"IF(ISNONTEXT($S44),0,VLOOKUP($B47,ItemList,HLOOKUP(V$22,StatLoC,2,FALSE),FALSE))","v":0},{"$f":"IF(ISNONTEXT(S44),\"\",IF(OR(S44=S47,S44=T47, S44=U47),\"\",\"Fail\"))","v":""},null,{"$f":"IF(OR(S47=\"r\",T47=\"r\",U47=\"r\"),1,0)","v":1},{"$f":"IF(OR(S47=\"y\",T47=\"y\",U47=\"y\"),1,0)","v":0},{"$f":"IF(OR(S47=\"b\",T47=\"b\",U47=\"b\"),1,0)","v":0}]
[{"$f":"T44","v":"y"},"Skillful Ember Topaz (20 Str/20 Mastery)",{"$f":"IF(ISNONTEXT($T44),0,VLOOKUP($B48,ItemList,HLOOKUP(C$22,StatLoC,2,FALSE),FALSE))","v":0},0,20,0,0,0,0,0,20,0,0,0,0,0,0,0,{"$f":"IF(ISNONTEXT($T44),0,VLOOKUP($B48,ItemList,HLOOKUP(S$22,StatLoC,2,FALSE),FALSE))","v":"r"},{"$f":"IF(ISNONTEXT($T44),0,VLOOKUP($B48,ItemList,HLOOKUP(T$22,StatLoC,2,FALSE),FALSE))","v":"y"},{"$f":"IF(ISNONTEXT($T44),0,VLOOKUP($B48,ItemList,HLOOKUP(U$22,StatLoC,2,FALSE),FALSE))","v":0},{"$f":"IF(ISNONTEXT($T44),0,VLOOKUP($B48,ItemList,HLOOKUP(V$22,StatLoC,2,FALSE),FALSE))","v":0},{"$f":"IF(ISNONTEXT(T44),\"\",IF(OR(T44=S48,T44=T48,T44=U48),\"\",\"Fail\"))","v":""},null,{"$f":"IF(OR(S48=\"r\",T48=\"r\",U48=\"r\"),1,0)","v":1},{"$f":"IF(OR(S48=\"y\",T48=\"y\",U48=\"y\"),1,0)","v":1},{"$f":"IF(OR(S48=\"b\",T48=\"b\",U48=\"b\"),1,0)","v":0}]
[{"$f":"U44","v":0},"Bold Inferno Ruby (40 Str)",{"$f":"IF(ISNONTEXT($U44),0,VLOOKUP($B49,ItemList,HLOOKUP(C$22,StatLoC,2,FALSE),FALSE))","v":0},0,0,0,0,0,0,0,0,0,0,0,0,0,0,0,{"$f":"IF(ISNONTEXT($U44),0,VLOOKUP($B49,ItemList,HLOOKUP(S$22,StatLoC,2,FALSE),FALSE))","v":0},{"$f":"IF(ISNONTEXT($U44),0,VLOOKUP($B49,ItemList,HLOOKUP(T$22,StatLoC,2,FALSE),FALSE))","v":0},{"$f":"IF(ISNONTEXT($U44),0,VLOOKUP($B49,ItemList,HLOOKUP(U$22,StatLoC,2,FALSE),FALSE))","v":0},{"$f":"IF(ISNONTEXT($U44),0,VLOOKUP($B49,ItemList,HLOOKUP(V$22,StatLoC,2,FALSE),FALSE))","v":0},{"$f":"IF(ISNONTEXT(U44),\"\",IF(OR(U44=S49,U44=T49,U44=U49),\"\",\"Fail\"))","v":""},null,{"$f":"IF(OR(S49=\"r\",T49=\"r\",U49=\"r\"),1,0)","v":0},{"$f":"IF(OR(S49=\"y\",T49=\"y\",U49=\"y\"),1,0)","v":0},{"$f":"IF(OR(S49=\"b\",T49=\"b\",U49=\"b\"),1,0)","v":0}]
[{"$f":"IF(AND(ISNONTEXT(A49),ISNONTEXT(A48),ISNONTEXT(A47)),\"\",\"bo\")","v":"bo"},"Bonus:",{"$f":"IF($W50=TRUE,IF(C$22=$W44,$X44,0),0)","v":0},0,20,0,0,0,0,0,0,0,0,0,0,0,0,0,null,null,null,null,{"$f":"IF(OR(W47=\"Fail\",W48=\"Fail\",W49=\"Fail\"),FALSE,TRUE)","v":true}]
[null,"Fireskin Gauntlets",{"$f":"IF(OR($B51=\"None\",ISBLANK($B51)),0,VLOOKUP($B51,ItemList,HLOOKUP(C$22,StatLoC,2,FALSE),FALSE))","v":454},0,282,0,0,211,0,0,167,0,0,{"$f":"IF(OR($B51=\"None\",ISBLANK($B51)),0,VLOOKUP($B51,ItemList,HLOOKUP(N$22,StatLoC,2,FALSE),FALSE))","v":0},0,0,4540,0,{"$f":"IF(OR($B51=\"None\",ISBLANK($B51)),0,VLOOKUP($B51,ItemList,HLOOKUP(S$22,StatLoC,2,FALSE),FALSE))","v":"r"},0,0,0,"Hit",10]
[null,"None",null,null,null,null,null,{"$f":"IF(RIGHT(B52,3)=\"Hit\",(-1 * SUM(I52:L52)),IF(RIGHT(LEFT(B52,12),3)=\"Hit\",ROUNDDOWN((-0.4 * H51),0),0))","v":0},{"$f":"IF(RIGHT(B52,4)=\"Crit\",(-1 * SUM(H52,J52,K52,L52)),IF(RIGHT(LEFT(B52,13),4)=\"Crit\",ROUNDDOWN((-0.4 * I51),0),0))","v":0},{"$f":"IF(RIGHT(B52,5)=\"Haste\",(-1 * SUM(H52:I52,K52:L52)),IF(RIGHT(LEFT(B52,14),5)=\"Haste\",ROUNDDOWN((-0.4 * J51),0),0))","v":0},{"$f":"IF(RIGHT(B52,7)=\"Mastery\",(-1 * SUM(H52:J52,L52)),IF(RIGHT(LEFT(B52,16),7)=\"Mastery\",ROUNDDOWN((-0.4 * K51),0),0))","v":0},{"$f":"IF(RIGHT(B52,9)=\"Expertise\",(-1 * SUM(H52:K52)),IF(RIGHT(LEFT(B52,18),9)=\"Expertise\",ROUNDDOWN((-0.4 * L51),0),0))","v":0}]
[null,"Mighty Strength",0,0,50,0,0,0,0,0,0,0,0,0,0,0,0,0,null,null,null,null,{"$f":"IF(OR($B53=\"None\",ISBLANK($B53)),0,VLOOKUP($B53,ItemList,HLOOKUP(W$22,StatLoC,2,FALSE),FALSE))","v":0},{"$f":"IF(OR($B53=\"None\",ISBLANK($B53)),0,VLOOKUP($B53,ItemList,HLOOKUP(X$22,StatLoC,2,FALSE),FALSE))","v":0}]
[{"$f":"S51","v":"r"},"Bold Inferno Ruby (40 Str)",{"$f":"IF(ISNONTEXT($S51),0,VLOOKUP($B54,ItemList,HLOOKUP(C$22,StatLoC,2,FALSE),FALSE))","v":0},0,40,0,0,0,0,0,0,0,0,0,0,0,0,0,{"$f":"IF(ISNONTEXT($S51),0,VLOOKUP($B54,ItemList,HLOOKUP(S$22,StatLoC,2,FALSE),FALSE))","v":"r"},{"$f":"IF(ISNONTEXT($S51),0,VLOOKUP($B54,ItemList,HLOOKUP(T$22,StatLoC,2,FALSE),FALSE))","v":0},{"$f":"IF(ISNONTEXT($S51),0,VLOOKUP($B54,ItemList,HLOOKUP(U$22,StatLoC,2,FALSE),FALSE))","v":0},{"$f":"IF(ISNONTEXT($S51),0,VLOOKUP($B54,ItemList,HLOOKUP(V$22,StatLoC,2,FALSE),FALSE))","v":0},{"$f":"IF(ISNONTEXT(S51),\"\",IF(OR(S51=S54,S51=T54, S51=U54),\"\",\"Fail\"))","v":""},null,{"$f":"IF(OR(S54=\"r\",T54=\"r\",U54=\"r\"),1,0)","v":1},{"$f":"IF(OR(S54=\"y\",T54=\"y\",U54=\"y\"),1,0)","v":0},{"$f":"IF(OR(S54=\"b\",T54=\"b\",U54=\"b\"),1,0)","v":0}]
[{"$f":"T51","v":0},"Bold Inferno Ruby (40 Str)",{"$f":"IF(ISNONTEXT($T51),0,VLOOKUP($B55,ItemList,HLOOKUP(C$22,StatLoC,2,FALSE),FALSE))","v":0},0,0,0,0,0,0,0,0,0,0,0,0,0,0,0,{"$f":"IF(ISNONTEXT($T51),0,VLOOKUP($B55,ItemList,HLOOKUP(S$22,StatLoC,2,FALSE),FALSE))","v":0},{"$f":"IF(ISNONTEXT($T51),0,VLOOKUP($B55,ItemList,HLOOKUP(T$22,StatLoC,2,FALSE),FALSE))","v":0},{"$f":"IF(ISNONTEXT($T51),0,VLOOKUP($B55,ItemList,HLOOKUP(U$22,StatLoC,2,FALSE),FALSE))","v":0},{"$f":"IF(ISNONTEXT($T51),0,VLOOKUP($B55,ItemList,HLOOKUP(V$22,StatLoC,2,FALSE),FALSE))","v":0},{"$f":"IF(ISNONTEXT(T51),\"\",IF(OR(T51=S55,T51=T55,T51=U55),\"\",\"Fail\"))","v":""},null,{"$f":"IF(OR(S55=\"r\",T55=\"r\",U55=\"r\"),1,0)","v":0},{"$f":"IF(OR(S55=\"y\",T55=\"y\",U55=\"y\"),1,0)","v":0},{"$f":"IF(OR(S55=\"b\",T55=\"b\",U55=\"b\"),1,0)","v":0}]
["Blacksmith","Bold Inferno Ruby (40 Str)",{"$f":"IF(OR(Profession1=\"Blacksmithing\",Profession2=\"Blacksmithing\"),IF(ISNONTEXT($B56),0,VLOOKUP($B56,ItemList,HLOOKUP(C$22,StatLoC,2,FALSE),FALSE)),0)","v":0},0,40,0,0,0,0,0,0,0,0,0,0,0,{"$f":"10*C56","v":0},{"$f":"(D56*15)","v":0},{"$f":"IF(OR(Profession1=\"Blacksmithing\",Profession2=\"Blacksmithing\"),IF(ISNONTEXT($B56),0,VLOOKUP($B56,ItemList,HLOOKUP(S$22,StatLoC,2,FALSE),FALSE)),0)","v":"r"},{"$f":"IF(OR(Profession1=\"Blacksmithing\",Profession2=\"Blacksmithing\"),IF(ISNONTEXT($B56),0,VLOOKUP($B56,ItemList,HLOOKUP(T$22,StatLoC,2,FALSE),FALSE)),0)","v":0},{"$f":"IF(OR(Profession1=\"Blacksmithing\",Profession2=\"Blacksmithing\"),IF(ISNONTEXT($B56),0,VLOOKUP($B56,ItemList,HLOOKUP(U$22,StatLoC,2,FALSE),FALSE)),0)","v":0},null,"Perk",null,{"$f":"IF(OR(S56=\"r\",T56=\"r\",U56=\"r\"),1,0)","v":1},{"$f":"IF(OR(S56=\"y\",T56=\"y\",U56=\"y\"),1,0)","v":0},{"$f":"IF(OR(S56=\"b\",T56=\"b\",U56=\"b\"),1,0)","v":0}]
[{"$f":"IF(AND(ISNONTEXT(#REF!),ISNONTEXT(A55),ISNONTEXT(A54)),\"\",\"bo\")","v":"bo"},"Bonus:",{"$f":"IF($W57=TRUE,IF(C$22=$W51,$X51,0),0)","v":0},0,0,0,0,10,0,0,0,0,0,0,0,0,0,0,null,null,null,null,{"$f":"IF(OR(W54=\"Fail\",W55=\"Fail\"),FALSE,TRUE)","v":true}]
["Engineer","None",{"$f":"IF(OR(Profession1=\"Engineering\",Profession2=\"Engineering\"),IF(OR($B58=\"None\",ISBLANK($B58)),0,VLOOKUP($B58,ItemList,HLOOKUP(C$22,StatLoC,2,FALSE),FALSE)),0)","v":0},0,0,0,0,0,0,0,0,0,0,0,0,0,{"$f":"10*C58","v":0},{"$f":"(D58*15)","v":0},null,null,null,null,{"$f":"IF(OR(Profession1=\"Engineering\",Profession2=\"Engineering\"),IF(OR($B58=\"None\",ISBLANK($B58)),0,VLOOKUP($B58,ItemList,HLOOKUP(W$22,StatLoC,2,FALSE),FALSE)),0)","v":0},{"$f":"IF(OR(Profession1=\"Engineering\",Profession2=\"Engineering\"),IF(OR($B58=\"None\",ISBLANK($B58)),0,VLOOKUP($B58,ItemList,HLOOKUP(X$22,StatLoC,2,FALSE),FALSE)),0)","v":0},{"$f":"IF(OR(S58=\"r\",T58=\"r\",U58=\"r\"),1,0)","v":0},{"$f":"IF(OR(S58=\"y\",T58=\"y\",U58=\"y\"),1,0)","v":0},{"$f":"IF(OR(S58=\"b\",T58=\"b\",U58=\"b\"),1,0)","v":0}]
[null,"Arachnaflame Treads",{"$f":"IF(OR($B59=\"None\",ISBLANK($B59)),0,VLOOKUP($B59,ItemList,HLOOKUP(C$22,StatLoC,2,FALSE),FALSE))","v":454},0,282,0,0,0,202,182,0,0,0,{"$f":"IF(OR($B59=\"None\",ISBLANK($B59)),0,VLOOKUP($B59,ItemList,HLOOKUP(N$22,StatLoC,2,FALSE),FALSE))","v":0},0,0,4540,0,{"$f":"IF(OR($B59=\"None\",ISBLANK($B59)),0,VLOOKUP($B59,ItemList,HLOOKUP(S$22,StatLoC,2,FALSE),FALSE))","v":"r"},0,0,0,"Str",10]
[null,"Reforge: Crit to Mastery",null,null,null,null,null,{"$f":"IF(RIGHT(B60,3)=\"Hit\",(-1 * SUM(I60:L60)),IF(RIGHT(LEFT(B60,12),3)=\"Hit\",ROUNDDOWN((-0.4 * H59),0),0))","v":0},{"$f":"IF(RIGHT(B60,4)=\"Crit\",(-1 * SUM(H60,J60,K60,L60)),IF(RIGHT(LEFT(B60,13),4)=\"Crit\",ROUNDDOWN((-0.4 * I59),0),0))","v":-80},{"$f":"IF(RIGHT(B60,5)=\"Haste\",(-1 * SUM(H60:I60,K60:L60)),IF(RIGHT(LEFT(B60,14),5)=\"Haste\",ROUNDDOWN((-0.4 * J59),0),0))","v":0},{"$f":"IF(RIGHT(B60,7)=\"Mastery\",(-1 * SUM(H60:J60,L60)),IF(RIGHT(LEFT(B60,16),7)=\"Mastery\",ROUNDDOWN((-0.4 * K59),0),0))","v":80},{"$f":"IF(RIGHT(B60,9)=\"Expertise\",(-1 * SUM(H60:K60)),IF(RIGHT(LEFT(B60,18),9)=\"Expertise\",ROUNDDOWN((-0.4 * L59),0),0))","v":0}]
[null,"Mastery",0,0,0,0,0,0,0,0,50,0,0,0,0,0,0,0,null,null,null,null,{"$f":"IF(SUM(S61:V61)>0,1,0)","v":0}]
[{"$f":"S59","v":"r"},"Bold Inferno Ruby (40 Str)",{"$f":"IF(ISNONTEXT($S59),0,VLOOKUP($B62,ItemList,HLOOKUP(C$22,StatLoC,2,FALSE),FALSE))","v":0},0,40,0,0,0,0,0,0,0,0,0,0,0,0,0,{"$f":"IF(ISNONTEXT($S59),0,VLOOKUP($B62,ItemList,HLOOKUP(S$22,StatLoC,2,FALSE),FALSE))","v":"r"},{"$f":"IF(ISNONTEXT($S59),0,VLOOKUP($B62,ItemList,HLOOKUP(T$22,StatLoC,2,FALSE),FALSE))","v":0},{"$f":"IF(ISNONTEXT($S59),0,VLOOKUP($B62,ItemList,HLOOKUP(U$22,StatLoC,2,FALSE),FALSE))","v":0},{"$f":"IF(ISNONTEXT($S59),0,VLOOKUP($B62,ItemList,HLOOKUP(V$22,StatLoC,2,FALSE),FALSE))","v":0},{"$f":"IF(ISNONTEXT(S59),\"\",IF(OR(S59=S62,S59=T62, S59=U62),\"\",\"Fail\"))","v":""},null,{"$f":"IF(OR(S62=\"r\",T62=\"r\",U62=\"r\"),1,0)","v":1},{"$f":"IF(OR(S62=\"y\",T62=\"y\",U62=\"y\"),1,0)","v":0},{"$f":"IF(OR(S62=\"b\",T62=\"b\",U62=\"b\"),1,0)","v":0}]
[{"$f":"T59","v":0},"Bold Inferno Ruby (40 Str)",{"$f":"IF(ISNONTEXT($T59),0,VLOOKUP($B63,ItemList,HLOOKUP(C$22,StatLoC,2,FALSE),FALSE))","v":0},0,0,0,0,0,0,0,0,0,0,0,0,0,0,0,{"$f":"IF(ISNONTEXT($T59),0,VLOOKUP($B63,ItemList,HLOOKUP(S$22,StatLoC,2,FALSE),FALSE))","v":0},{"$f":"IF(ISNONTEXT($T59),0,VLOOKUP($B63,ItemList,HLOOKUP(T$22,StatLoC,2,FALSE),FALSE))","v":0},{"$f":"IF(ISNONTEXT($T59),0,VLOOKUP($B63,ItemList,HLOOKUP(U$22,StatLoC,2,FALSE),FALSE))","v":0},{"$f":"IF(ISNONTEXT($T59),0,VLOOKUP($B63,ItemList,HLOOKUP(V$22,StatLoC,2,FALSE),FALSE))","v":0},{"$f":"IF(ISNONTEXT(T59),\"\",IF(OR(T59=S63,T59=T63,T59=U63),\"\",\"Fail\"))","v":""},null,{"$f":"IF(OR(S63=\"r\",T63=\"r\",U63=\"r\"),1,0)","v":0},{"$f":"IF(OR(S63=\"y\",T63=\"y\",U63=\"y\"),1,0)","v":0},{"$f":"IF(OR(S63=\"b\",T63=\"b\",U63=\"b\"),1,0)","v":0}]
[{"$f":"U59","v":0},"Bold Inferno Ruby (40 Str)",{"$f":"IF(ISNONTEXT($U59),0,VLOOKUP($B64,ItemList,HLOOKUP(C$22,StatLoC,2,FALSE),FALSE))","v":0},0,0,0,0,0,0,0,0,0,0,0,0,0,0,0,{"$f":"IF(ISNONTEXT($U59),0,VLOOKUP($B64,ItemList,HLOOKUP(S$22,StatLoC,2,FALSE),FALSE))","v":0},{"$f":"IF(ISNONTEXT($U59),0,VLOOKUP($B64,ItemList,HLOOKUP(T$22,StatLoC,2,FALSE),FALSE))","v":0},{"$f":"IF(ISNONTEXT($U59),0,VLOOKUP($B64,ItemList,HLOOKUP(U$22,StatLoC,2,FALSE),FALSE))","v":0},{"$f":"IF(ISNONTEXT($U59),0,VLOOKUP($B64,ItemList,HLOOKUP(V$22,StatLoC,2,FALSE),FALSE))","v":0},{"$f":"IF(ISNONTEXT(U59),\"\",IF(OR(U59=S64,U59=T64,U59=U64),\"\",\"Fail\"))","v":""},null,{"$f":"IF(OR(S64=\"r\",T64=\"r\",U64=\"r\"),1,0)","v":0},{"$f":"IF(OR(S64=\"y\",T64=\"y\",U64=\"y\"),1,0)","v":0},{"$f":"IF(OR(S64=\"b\",T64=\"b\",U64=\"b\"),1,0)","v":0}]
[{"$f":"IF(AND(ISNONTEXT(A64),ISNONTEXT(A63),ISNONTEXT(A62)),\"\",\"bo\")","v":"bo"},"Bonus:",{"$f":"IF($W65=TRUE,IF(C$22=$W59,$X59,0),0)","v":0},0,10,0,0,0,0,0,0,0,0,0,0,0,0,0,null,null,null,null,{"$f":"IF(OR(W62=\"Fail\",W63=\"Fail\",W64=\"Fail\"),FALSE,TRUE)","v":true}]
[null,"Cinch of the Flaming Ember",{"$f":"IF(OR($B66=\"None\",ISBLANK($B66)),0,VLOOKUP($B66,ItemList,HLOOKUP(C$22,StatLoC,2,FALSE),FALSE))","v":454},0,282,0,0,133,230,0,0,0,0,{"$f":"IF(OR($B66=\"None\",ISBLANK($B66)),0,VLOOKUP($B66,ItemList,HLOOKUP(N$22,StatLoC,2,FALSE),FALSE))","v":0},{"$f":"IF(OR($B66=\"None\",ISBLANK($B66)),0,VLOOKUP($B66,ItemList,HLOOKUP(O$22,StatLoC,2,FALSE),FALSE))","v":0},{"$f":"IF(OR($B66=\"None\",ISBLANK($B66)),0,VLOOKUP($B66,ItemList,HLOOKUP(P$22,StatLoC,2,FALSE),FALSE))","v":0},4540,0,{"$f":"IF(OR($B66=\"None\",ISBLANK($B66)),0,VLOOKUP($B66,ItemList,HLOOKUP(S$22,StatLoC,2,FALSE),FALSE))","v":"b"},0,0,0,"Str",10]
[]
[null,"Reforge: Crit to Mastery",null,null,null,null,null,{"$f":"IF(RIGHT(B68,3)=\"Hit\",(-1 * SUM(I68:L68)),IF(RIGHT(LEFT(B68,12),3)=\"Hit\",ROUNDDOWN((-0.4 * H66),0),0))","v":0},{"$f":"IF(RIGHT(B68,4)=\"Crit\",(-1 * SUM(H68,J68,K68,L68)),IF(RIGHT(LEFT(B68,13),4)=\"Crit\",ROUNDDOWN((-0.4 * I66),0),0))","v":-92},{"$f":"IF(RIGHT(B68,5)=\"Haste\",(-1 * SUM(H68:I68,K68:L68)),IF(RIGHT(LEFT(B68,14),5)=\"Haste\",ROUNDDOWN((-0.4 * J66),0),0))","v":0},{"$f":"IF(RIGHT(B68,7)=\"Mastery\",(-1 * SUM(H68:J68,L68)),IF(RIGHT(LEFT(B68,16),7)=\"Mastery\",ROUNDDOWN((-0.4 * K66),0),0))","v":92},{"$f":"IF(RIGHT(B68,9)=\"Expertise\",(-1 * SUM(H68:K68)),IF(RIGHT(LEFT(B68,18),9)=\"Expertise\",ROUNDDOWN((-0.4 * L66),0),0))","v":0}]
[{"$f":"S66","v":"b"},"Etched Demonseye (20 Str/20 Hit)",{"$f":"IF(ISNONTEXT($S66),0,VLOOKUP($B69,ItemList,HLOOKUP(C$22,StatLoC,2,FALSE),FALSE))","v":0},0,20,0,0,20,0,0,0,0,0,0,0,0,0,0,{"$f":"IF(ISNONTEXT($S66),0,VLOOKUP($B69,ItemList,HLOOKUP(S$22,StatLoC,2,FALSE),FALSE))","v":"r"},{"$f":"IF(ISNONTEXT($S66),0,VLOOKUP($B69,ItemList,HLOOKUP(T$22,StatLoC,2,FALSE),FALSE))","v":"b"},{"$f":"IF(ISNONTEXT($S66),0,VLOOKUP($B69,ItemList,HLOOKUP(U$22,StatLoC,2,FALSE),FALSE))","v":0},{"$f":"IF(ISNONTEXT($S66),0,VLOOKUP($B69,ItemList,HLOOKUP(V$22,StatLoC,2,FALSE),FALSE))","v":0},{"$f":"IF(ISNONTEXT(S66),\"\",IF(OR(S66=S69,S66=T69, S66=U69),\"\",\"Fail\"))","v":""},null,{"$f":"IF(OR(S69=\"r\",T69=\"r\",U69=\"r\"),1,0)","v":1},{"$f":"IF(OR(S69=\"y\",T69=\"y\",U69=\"y\"),1,0)","v":0},{"$f":"IF(OR(S69=\"b\",T69=\"b\",U69=\"b\"),1,0)","v":1}]
[{"$f":"T66","v":0},"Bold Inferno Ruby (40 Str)",{"$f":"IF(ISNONTEXT($T66),0,VLOOKUP($B70,ItemList,HLOOKUP(C$22,StatLoC,2,FALSE),FALSE))","v":0},0,0,0,0,0,0,0,0,0,0,0,0,0,0,0,{"$f":"IF(ISNONTEXT($T66),0,VLOOKUP($B70,ItemList,HLOOKUP(S$22,StatLoC,2,FALSE),FALSE))","v":0},{"$f":"IF(ISNONTEXT($T66),0,VLOOKUP($B70,ItemList,HLOOKUP(T$22,StatLoC,2,FALSE),FALSE))","v":0},{"$f":"IF(ISNONTEXT($T66),0,VLOOKUP($B70,ItemList,HLOOKUP(U$22,StatLoC,2,FALSE),FALSE))","v":0},{"$f":"IF(ISNONTEXT($T66),0,VLOOKUP($B70,ItemList,HLOOKUP(V$22,StatLoC,2,FALSE),FALSE))","v":0},{"$f":"IF(ISNONTEXT(T66),\"\",IF(OR(T66=S70,T66=T70,T66=U70),\"\",\"Fail\"))","v":""},null,{"$f":"IF(OR(S70=\"r\",T70=\"r\",U70=\"r\"),1,0)","v":0},{"$f":"IF(OR(S70=\"y\",T70=\"y\",U70=\"y\"),1,0)","v":0},{"$f":"IF(OR(S70=\"b\",T70=\"b\",U70=\"b\"),1,0)","v":0}]
["Free","Bold Inferno Ruby (40 Str)",{"$f":"IF(ISNONTEXT($B71),0,VLOOKUP($B71,ItemList,HLOOKUP(C$22,StatLoC,2,FALSE),FALSE))","v":0},0,40,0,0,0,0,0,0,0,0,0,0,0,{"$f":"10*C71","v":0},{"$f":"(D71*15)","v":0},{"$f":"IF(ISNONTEXT($B71),0,VLOOKUP($B71,ItemList,HLOOKUP(S$22,StatLoC,2,FALSE),FALSE))","v":"r"},{"$f":"IF(ISNONTEXT($B71),0,VLOOKUP($B71,ItemList,HLOOKUP(T$22,StatLoC,2,FALSE),FALSE))","v":0},{"$f":"IF(ISNONTEXT($B71),0,VLOOKUP($B71,ItemList,HLOOKUP(U$22,StatLoC,2,FALSE),FALSE))","v":0},null,"Free",null,{"$f":"IF(OR(S71=\"r\",T71=\"r\",U71=\"r\"),1,0)","v":1},{"$f":"IF(OR(S71=\"y\",T71=\"y\",U71=\"y\"),1,0)","v":0},{"$f":"IF(OR(S71=\"b\",T71=\"b\",U71=\"b\"),1,0)","v":0}]
[{"$f":"IF(AND(ISNONTEXT(#REF!),ISNONTEXT(A70),ISNONTEXT(A69)),\"\",\"bo\")","v":"bo"},"Bonus:",{"$f":"IF($W72=TRUE,IF(C$22=$W66,$X66,0),0)","v":0},0,10,0,0,0,0,0,0,0,0,0,0,0,0,0,null,null,null,null,{"$f":"IF(OR(W69=\"Fail\",W70=\"Fail\"),FALSE,TRUE)","v":true}]
[null,"Earthcrack Bracers",{"$f":"IF(OR($B73=\"None\",ISBLANK($B73)),0,VLOOKUP($B73,ItemList,HLOOKUP(C$22,StatLoC,2,FALSE),FALSE))","v":341},0,227,0,0,0,158,140,0,0,0,{"$f":"IF(OR($B73=\"None\",ISBLANK($B73)),0,VLOOKUP($B73,ItemList,HLOOKUP(N$22,StatLoC,2,FALSE),FALSE))","v":0},0,0,3410,0,{"$f":"IF(OR($B73=\"None\",ISBLANK($B73)),0,VLOOKUP($B73,ItemList,HLOOKUP(S$22,StatLoC,2,FALSE),FALSE))","v":0},0,0,0,0,0]
[null,"Reforge: Crit to Mastery",null,null,null,null,null,{"$f":"IF(RIGHT(B74,3)=\"Hit\",(-1 * SUM(I74:L74)),IF(RIGHT(LEFT(B74,12),3)=\"Hit\",ROUNDDOWN((-0.4 * H73),0),0))","v":0},{"$f":"IF(RIGHT(B74,4)=\"Crit\",(-1 * SUM(H74,J74,K74,L74)),IF(RIGHT(LEFT(B74,13),4)=\"Crit\",ROUNDDOWN((-0.4 * I73),0),0))","v":-63},{"$f":"IF(RIGHT(B74,5)=\"Haste\",(-1 * SUM(H74:I74,K74:L74)),IF(RIGHT(LEFT(B74,14),5)=\"Haste\",ROUNDDOWN((-0.4 * J73),0),0))","v":0},{"$f":"IF(RIGHT(B74,7)=\"Mastery\",(-1 * SUM(H74:J74,L74)),IF(RIGHT(LEFT(B74,16),7)=\"Mastery\",ROUNDDOWN((-0.4 * K73),0),0))","v":63},{"$f":"IF(RIGHT(B74,9)=\"Expertise\",(-1 * SUM(H74:K74)),IF(RIGHT(LEFT(B74,18),9)=\"Expertise\",ROUNDDOWN((-0.4 * L73),0),0))","v":0}]
[null,"Major Strength",0,0,50,0,0,0,0,0,0,0,0,0,0,0,0,0,null,null,null,null,{"$f":"IF(SUM(S75:V75)>0,1,0)","v":0}]
[{"$f":"S73","v":0},"Bold Inferno Ruby (40 Str)",{"$f":"IF(ISNONTEXT($S73),0,VLOOKUP($B76,ItemList,HLOOKUP(C$22,StatLoC,2,FALSE),FALSE))","v":0},0,0,0,0,0,0,0,0,0,0,0,0,0,0,0,{"$f":"IF(ISNONTEXT($S73),0,VLOOKUP($B76,ItemList,HLOOKUP(S$22,StatLoC,2,FALSE),FALSE))","v":0},{"$f":"IF(ISNONTEXT($S73),0,VLOOKUP($B76,ItemList,HLOOKUP(T$22,StatLoC,2,FALSE),FALSE))","v":0},{"$f":"IF(ISNONTEXT($S73),0,VLOOKUP($B76,ItemList,HLOOKUP(U$22,StatLoC,2,FALSE),FALSE))","v":0},{"$f":"IF(ISNONTEXT($S73),0,VLOOKUP($B76,ItemList,HLOOKUP(V$22,StatLoC,2,FALSE),FALSE))","v":0},{"$f":"IF(ISNONTEXT(S73),\"\",IF(OR(S73=S76,S73=T76, S73=U76),\"\",\"Fail\"))","v":""},null,{"$f":"IF(OR(S76=\"r\",T76=\"r\",U76=\"r\"),1,0)","v":0},{"$f":"IF(OR(S76=\"y\",T76=\"y\",U76=\"y\"),1,0)","v":0},{"$f":"IF(OR(S76=\"b\",T76=\"b\",U76=\"b\"),1,0)","v":0}]
[{"$f":"T73","v":0},"Bold Inferno Ruby (40 Str)",{"$f":"IF(ISNONTEXT($T73),0,VLOOKUP($B77,ItemList,HLOOKUP(C$22,StatLoC,2,FALSE),FALSE))","v":0},0,0,0,0,0,0,0,0,0,0,0,0,0,0,0,{"$f":"IF(ISNONTEXT($T73),0,VLOOKUP($B77,ItemList,HLOOKUP(S$22,StatLoC,2,FALSE),FALSE))","v":0},{"$f":"IF(ISNONTEXT($T73),0,VLOOKUP($B77,ItemList,HLOOKUP(T$22,StatLoC,2,FALSE),FALSE))","v":0},{"$f":"IF(ISNONTEXT($T73),0,VLOOKUP($B77,ItemList,HLOOKUP(U$22,StatLoC,2,FALSE),FALSE))","v":0},{"$f":"IF(ISNONTEXT($T73),0,VLOOKUP($B77,ItemList,HLOOKUP(V$22,StatLoC,2,FALSE),FALSE))","v":0},{"$f":"IF(ISNONTEXT(T73),\"\",IF(OR(T73=S77,T73=T77,T73=U77),\"\",\"Fail\"))","v":""},null,{"$f":"IF(OR(S77=\"r\",T77=\"r\",U77=\"r\"),1,0)","v":0},{"$f":"IF(OR(S77=\"y\",T77=\"y\",U77=\"y\"),1,0)","v":0},{"$f":"IF(OR(S77=\"b\",T77=\"b\",U77=\"b\"),1,0)","v":0}]
["Blacksmith","Bold Inferno Ruby (40 Str)",{"$f":"IF(OR(Profession1=\"Blacksmithing\",Profession2=\"Blacksmithing\"),IF(ISNONTEXT($B78),0,VLOOKUP($B78,ItemList,HLOOKUP(C$22,StatLoC,2,FALSE),FALSE)),0)","v":0},0,40,0,0,0,0,0,0,0,0,0,0,0,{"$f":"10*C78","v":0},{"$f":"(D78*15)","v":0},{"$f":"IF(OR(Profession1=\"Blacksmithing\",Profession2=\"Blacksmithing\"),IF(ISNONTEXT($B78),0,VLOOKUP($B78,ItemList,HLOOKUP(S$22,StatLoC,2,FALSE),FALSE)),0)","v":"r"},{"$f":"IF(OR(Profession1=\"Blacksmithing\",Profession2=\"Blacksmithing\"),IF(ISNONTEXT($B78),0,VLOOKUP($B78,ItemList,HLOOKUP(T$22,StatLoC,2,FALSE),FALSE)),0)","v":0},{"$f":"IF(OR(Profession1=\"Blacksmithing\",Profession2=\"Blacksmithing\"),IF(ISNONTEXT($B78),0,VLOOKUP($B78,ItemList,HLOOKUP(U$22,StatLoC,2,FALSE),FALSE)),0)","v":0},null,"Perk",null,{"$f":"IF(OR(S78=\"r\",T78=\"r\",U78=\"r\"),1,0)","v":1},{"$f":"IF(OR(S78=\"y\",T78=\"y\",U78=\"y\"),1,0)","v":0},{"$f":"IF(OR(S78=\"b\",T78=\"b\",U78=\"b\"),1,0)","v":0}]
[{"$f":"IF(AND(ISNONTEXT(#REF!),ISNONTEXT(A77),ISNONTEXT(A76)),\"\",\"bo\")","v":""},"Bonus:",{"$f":"IF($W79=TRUE,IF(C$22=$W73,$X73,0),0)","v":0},0,0,0,0,0,0,0,0,0,0,0,0,0,0,0,null,null,null,null,{"$f":"IF(OR(W76=\"Fail\",W77=\"Fail\"),FALSE,TRUE)","v":true}]
[null,"Bladed Flamewrath Cover",{"$f":"IF(OR($B80=\"None\",ISBLANK($B80)),0,VLOOKUP($B80,ItemList,HLOOKUP(C$22,StatLoC,2,FALSE),FALSE))","v":341},0,227,0,0,0,0,173,0,115,0,{"$f":"IF(OR($B80=\"None\",ISBLANK($B80)),0,VLOOKUP($B80,ItemList,HLOOKUP(N$22,StatLoC,2,FALSE),FALSE))","v":0},0,0,3410,0,{"$f":"IF(OR($B80=\"None\",ISBLANK($B80)),0,VLOOKUP($B80,ItemList,HLOOKUP(S$22,StatLoC,2,FALSE),FALSE))","v":0},0,0,0,0,0]
[null,"Reforge: Expertise to Mastery",null,null,null,null,null,{"$f":"IF(RIGHT(B81,3)=\"Hit\",(-1 * SUM(I81:L81)),IF(RIGHT(LEFT(B81,12),3)=\"Hit\",ROUNDDOWN((-0.4 * H80),0),0))","v":0},{"$f":"IF(RIGHT(B81,4)=\"Crit\",(-1 * SUM(H81,J81,K81,L81)),IF(RIGHT(LEFT(B81,13),4)=\"Crit\",ROUNDDOWN((-0.4 * I80),0),0))","v":0},{"$f":"IF(RIGHT(B81,5)=\"Haste\",(-1 * SUM(H81:I81,K81:L81)),IF(RIGHT(LEFT(B81,14),5)=\"Haste\",ROUNDDOWN((-0.4 * J80),0),0))","v":0},{"$f":"IF(RIGHT(B81,7)=\"Mastery\",(-1 * SUM(H81:J81,L81)),IF(RIGHT(LEFT(B81,16),7)=\"Mastery\",ROUNDDOWN((-0.4 * K80),0),0))","v":46},{"$f":"IF(RIGHT(B81,9)=\"Expertise\",(-1 * SUM(H81:K81)),IF(RIGHT(LEFT(B81,18),9)=\"Expertise\",ROUNDDOWN((-0.4 * L80),0),0))","v":-46}]
[null,"Critical Strike",0,0,0,0,0,0,50,0,0,0,0,0,0,0,0,0,null,null,null,null,{"$f":"IF(SUM(S82:V82)>0,1,0)","v":0}]
[{"$f":"S80","v":0},"Bold Inferno Ruby (40 Str)",{"$f":"IF(ISNONTEXT($S80),0,VLOOKUP($B83,ItemList,HLOOKUP(C$22,StatLoC,2,FALSE),FALSE))","v":0},0,0,0,0,0,0,0,0,0,0,0,0,0,0,0,{"$f":"IF(ISNONTEXT($S80),0,VLOOKUP($B83,ItemList,HLOOKUP(S$22,StatLoC,2,FALSE),FALSE))","v":0},{"$f":"IF(ISNONTEXT($S80),0,VLOOKUP($B83,ItemList,HLOOKUP(T$22,StatLoC,2,FALSE),FALSE))","v":0},{"$f":"IF(ISNONTEXT($S80),0,VLOOKUP($B83,ItemList,HLOOKUP(U$22,StatLoC,2,FALSE),FALSE))","v":0},{"$f":"IF(ISNONTEXT($S80),0,VLOOKUP($B83,ItemList,HLOOKUP(V$22,StatLoC,2,FALSE),FALSE))","v":0},{"$f":"IF(ISNONTEXT(S80),\"\",IF(OR(S80=S83,S80=T83),\"\",\"Fail\"))","v":""},null,{"$f":"IF(OR(S83=\"r\",T83=\"r\",U83=\"r\"),1,0)","v":0},{"$f":"IF(OR(S83=\"y\",T83=\"y\",U83=\"y\"),1,0)","v":0},{"$f":"IF(OR(S83=\"b\",T83=\"b\",U83=\"b\"),1,0)","v":0}]
[{"$f":"T80","v":0},"Bold Inferno Ruby (40 Str)",{"$f":"IF(ISNONTEXT($T80),0,VLOOKUP($B84,ItemList,HLOOKUP(C$22,StatLoC,2,FALSE),FALSE))","v":0},0,0,0,0,0,0,0,0,0,0,0,0,0,0,0,{"$f":"IF(ISNONTEXT($T80),0,VLOOKUP($B84,ItemList,HLOOKUP(S$22,StatLoC,2,FALSE),FALSE))","v":0},{"$f":"IF(ISNONTEXT($T80),0,VLOOKUP($B84,ItemList,HLOOKUP(T$22,StatLoC,2,FALSE),FALSE))","v":0},{"$f":"IF(ISNONTEXT($T80),0,VLOOKUP($B84,ItemList,HLOOKUP(U$22,StatLoC,2,FALSE),FALSE))","v":0},{"$f":"IF(ISNONTEXT($T80),0,VLOOKUP($B84,ItemList,HLOOKUP(V$22,StatLoC,2,FALSE),FALSE))","v":0},{"$f":"IF(ISNONTEXT(T80),\"\",IF(OR(T80=S84,T80=T84),\"\",\"Fail\"))","v":""},null,{"$f":"IF(OR(S84=\"r\",T84=\"r\",U84=\"r\"),1,0)","v":0},{"$f":"IF(OR(S84=\"y\",T84=\"y\",U84=\"y\"),1,0)","v":0},{"$f":"IF(OR(S84=\"b\",T84=\"b\",U84=\"b\"),1,0)","v":0}]
[{"$f":"U80","v":0},"Bold Inferno Ruby (40 Str)",{"$f":"IF(ISNONTEXT($U80),0,VLOOKUP($B85,ItemList,HLOOKUP(C$22,StatLoC,2,FALSE),FALSE))","v":0},0,0,0,0,0,0,0,0,0,0,0,0,0,0,0,{"$f":"IF(ISNONTEXT($U80),0,VLOOKUP($B85,ItemList,HLOOKUP(S$22,StatLoC,2,FALSE),FALSE))","v":0},{"$f":"IF(ISNONTEXT($U80),0,VLOOKUP($B85,ItemList,HLOOKUP(T$22,StatLoC,2,FALSE),FALSE))","v":0},{"$f":"IF(ISNONTEXT($U80),0,VLOOKUP($B85,ItemList,HLOOKUP(U$22,StatLoC,2,FALSE),FALSE))","v":0},{"$f":"IF(ISNONTEXT($U80),0,VLOOKUP($B85,ItemList,HLOOKUP(V$22,StatLoC,2,FALSE),FALSE))","v":0},{"$f":"IF(ISNONTEXT(U80),\"\",IF(OR(U80=S85,U80=T85),\"\",\"Fail\"))","v":""},null,{"$f":"IF(OR(S85=\"r\",T85=\"r\",U85=\"r\"),1,0)","v":0},{"$f":"IF(OR(S85=\"y\",T85=\"y\",U85=\"y\"),1,0)","v":0},{"$f":"IF(OR(S85=\"b\",T85=\"b\",U85=\"b\"),1,0)","v":0}]
[null,"Gift of Nadun",{"$f":"IF(OR($B86=\"None\",ISBLANK($B86)),0,VLOOKUP($B86,ItemList,HLOOKUP(C$22,StatLoC,2,FALSE),FALSE))","v":286},0,190,0,0,0,127,127,0,0,0,{"$f":"IF(OR($B86=\"None\",ISBLANK($B86)),0,VLOOKUP($B86,ItemList,HLOOKUP(N$22,StatLoC,2,FALSE),FALSE))","v":0},{"$f":"IF(OR($B86=\"None\",ISBLANK($B86)),0,VLOOKUP($B86,ItemList,HLOOKUP(O$22,StatLoC,2,FALSE),FALSE))","v":0},{"$f":"IF(OR($B86=\"None\",ISBLANK($B86)),0,VLOOKUP($B86,ItemList,HLOOKUP(P$22,StatLoC,2,FALSE),FALSE))","v":0},2860,0,{"$f":"IF(OR($B86=\"None\",ISBLANK($B86)),0,VLOOKUP($B86,ItemList,HLOOKUP(S$22,StatLoC,2,FALSE),FALSE))","v":0},0,0,0,0,0]
[null,"Reforge: Crit to Mastery",null,null,null,null,null,{"$f":"IF(RIGHT(B87,3)=\"Hit\",(-1 * SUM(I87:L87)),IF(RIGHT(LEFT(B87,12),3)=\"Hit\",ROUNDDOWN((-0.4 * H86),0),0))","v":0},{"$f":"IF(RIGHT(B87,4)=\"Crit\",(-1 * SUM(H87,J87,K87,L87)),IF(RIGHT(LEFT(B87,13),4)=\"Crit\",ROUNDDOWN((-0.4 * I86),0),0))","v":-50},{"$f":"IF(RIGHT(B87,5)=\"Haste\",(-1 * SUM(H87:I87,K87:L87)),IF(RIGHT(LEFT(B87,14),5)=\"Haste\",ROUNDDOWN((-0.4 * J86),0),0))","v":0},{"$f":"IF(RIGHT(B87,7)=\"Mastery\",(-1 * SUM(H87:J87,L87)),IF(RIGHT(LEFT(B87,16),7)=\"Mastery\",ROUNDDOWN((-0.4 * K86),0),0))","v":50},{"$f":"IF(RIGHT(B87,9)=\"Expertise\",(-1 * SUM(H87:K87)),IF(RIGHT(LEFT(B87,18),9)=\"Expertise\",ROUNDDOWN((-0.4 * L86),0),0))","v":0}]
[{"$f":"S86","v":0},"Bold Inferno Ruby (40 Str)",{"$f":"IF(ISNONTEXT($S86),0,VLOOKUP($B88,ItemList,HLOOKUP(C$22,StatLoC,2,FALSE),FALSE))","v":0},0,0,0,0,0,0,0,0,0,0,0,0,0,0,0,{"$f":"IF(ISNONTEXT($S86),0,VLOOKUP($B88,ItemList,HLOOKUP(S$22,StatLoC,2,FALSE),FALSE))","v":0},{"$f":"IF(ISNONTEXT($S86),0,VLOOKUP($B88,ItemList,HLOOKUP(T$22,StatLoC,2,FALSE),FALSE))","v":0},{"$f":"IF(ISNONTEXT($S86),0,VLOOKUP($B88,ItemList,HLOOKUP(U$22,StatLoC,2,FALSE),FALSE))","v":0},{"$f":"IF(ISNONTEXT($S86),0,VLOOKUP($B88,ItemList,HLOOKUP(V$22,StatLoC,2,FALSE),FALSE))","v":0},{"$f":"IF(ISNONTEXT(S86),\"\",IF(OR(S86=S88,S86=T88,S86=U88),\"\",\"Fail\"))","v":""},null,{"$f":"IF(OR(S88=\"r\",T88=\"r\",U88=\"r\"),1,0)","v":0},{"$f":"IF(OR(S88=\"y\",T88=\"y\",U88=\"y\"),1,0)","v":0},{"$f":"IF(OR(S88=\"b\",T88=\"b\",U88=\"b\"),1,0)","v":0}]
[{"$f":"T86","v":0},"Bold Inferno Ruby (40 Str)",{"$f":"IF(ISNONTEXT($T86),0,VLOOKUP($B89,ItemList,HLOOKUP(C$22,StatLoC,2,FALSE),FALSE))","v":0},0,0,0,0,0,0,0,0,0,0,0,0,0,0,0,{"$f":"IF(ISNONTEXT($T86),0,VLOOKUP($B89,ItemList,HLOOKUP(S$22,StatLoC,2,FALSE),FALSE))","v":0},{"$f":"IF(ISNONTEXT($T86),0,VLOOKUP($B89,ItemList,HLOOKUP(T$22,StatLoC,2,FALSE),FALSE))","v":0},{"$f":"IF(ISNONTEXT($T86),0,VLOOKUP($B89,ItemList,HLOOKUP(U$22,StatLoC,2,FALSE),FALSE))","v":0},{"$f":"IF(ISNONTEXT($T86),0,VLOOKUP($B89,ItemList,HLOOKUP(V$22,StatLoC,2,FALSE),FALSE))","v":0},{"$f":"IF(ISNONTEXT(T86),\"\",IF(OR(T86=S89,T86=T89),\"\",\"Fail\"))","v":""},null,{"$f":"IF(OR(S89=\"r\",T89=\"r\",U89=\"r\"),1,0)","v":0},{"$f":"IF(OR(S89=\"y\",T89=\"y\",U89=\"y\"),1,0)","v":0},{"$f":"IF(OR(S89=\"b\",T89=\"b\",U89=\"b\"),1,0)","v":0}]
[{"$f":"U86","v":0},"Bold Inferno Ruby (40 Str)",{"$f":"IF(ISNONTEXT($U86),0,VLOOKUP($B90,ItemList,HLOOKUP(C$22,StatLoC,2,FALSE),FALSE))","v":0},0,0,0,0,0,0,0,0,0,0,0,0,0,0,0,{"$f":"IF(ISNONTEXT($U86),0,VLOOKUP($B90,ItemList,HLOOKUP(S$22,StatLoC,2,FALSE),FALSE))","v":0},{"$f":"IF(ISNONTEXT($U86),0,VLOOKUP($B90,ItemList,HLOOKUP(T$22,StatLoC,2,FALSE),FALSE))","v":0},{"$f":"IF(ISNONTEXT($U86),0,VLOOKUP($B90,ItemList,HLOOKUP(U$22,StatLoC,2,FALSE),FALSE))","v":0},{"$f":"IF(ISNONTEXT($U86),0,VLOOKUP($B90,ItemList,HLOOKUP(V$22,StatLoC,2,FALSE),FALSE))","v":0},{"$f":"IF(ISNONTEXT(U86),\"\",IF(OR(U86=S90,U86=T90),\"\",\"Fail\"))","v":""},null,{"$f":"IF(OR(S90=\"r\",T90=\"r\",U90=\"r\"),1,0)","v":0},{"$f":"IF(OR(S90=\"y\",T90=\"y\",U90=\"y\"),1,0)","v":0},{"$f":"IF(OR(S90=\"b\",T90=\"b\",U90=\"b\"),1,0)","v":0}]
[{"$f":"IF(AND(ISNONTEXT(A90),ISNONTEXT(A89),ISNONTEXT(A88)),\"\",\"bo\")","v":""},"Bonus:",{"$f":"IF($W91=TRUE,IF(C$22=$W86,$X86,0),0)","v":0},0,0,0,0,0,0,0,0,0,0,0,0,0,0,0,null,null,null,null,{"$f":"IF(OR(W88=\"Fail\",W89=\"Fail\",W90=\"Fail\"),FALSE,TRUE)","v":true}]
[null,"Serrated Brimstone Signet",{"$f":"IF(OR($B92=\"None\",ISBLANK($B92)),0,VLOOKUP($B92,ItemList,HLOOKUP(C$22,StatLoC,2,FALSE),FALSE))","v":341},0,227,0,0,0,156,144,0,0,0,0,0,0,3410,0,{"$f":"IF(OR($B92=\"None\",ISBLANK($B92)),0,VLOOKUP($B92,ItemList,HLOOKUP(S$22,StatLoC,2,FALSE),FALSE))","v":0},{"$f":"IF(OR($B92=\"None\",ISBLANK($B92)),0,VLOOKUP($B92,ItemList,HLOOKUP(T$22,StatLoC,2,FALSE),FALSE))","v":0},{"$f":"IF(OR($B92=\"None\",ISBLANK($B92)),0,VLOOKUP($B92,ItemList,HLOOKUP(U$22,StatLoC,2,FALSE),FALSE))","v":0},null,{"$f":"IF(OR($B92=\"None\",ISBLANK($B92)),0,VLOOKUP($B92,ItemList,HLOOKUP(W$22,StatLoC,2,FALSE),FALSE))","v":0},{"$f":"IF(OR($B92=\"None\",ISBLANK($B92)),0,VLOOKUP($B92,ItemList,HLOOKUP(X$22,StatLoC,2,FALSE),FALSE))","v":0}]
[null,"Reforge: Crit to Hit",null,null,null,null,null,{"$f":"IF(RIGHT(B93,3)=\"Hit\",(-1 * SUM(I93:L93)),IF(RIGHT(LEFT(B93,12),3)=\"Hit\",ROUNDDOWN((-0.4 * H92),0),0))","v":62},{"$f":"IF(RIGHT(B93,4)=\"Crit\",(-1 * SUM(H93,J93,K93,L93)),IF(RIGHT(LEFT(B93,13),4)=\"Crit\",ROUNDDOWN((-0.4 * I92),0),0))","v":-62},{"$f":"IF(RIGHT(B93,5)=\"Haste\",(-1 * SUM(H93:I93,K93:L93)),IF(RIGHT(LEFT(B93,14),5)=\"Haste\",ROUNDDOWN((-0.4 * J92),0),0))","v":0},{"$f":"IF(RIGHT(B93,7)=\"Mastery\",(-1 * SUM(H93:J93,L93)),IF(RIGHT(LEFT(B93,16),7)=\"Mastery\",ROUNDDOWN((-0.4 * K92),0),0))","v":0},{"$f":"IF(RIGHT(B93,9)=\"Expertise\",(-1 * SUM(H93:K93)),IF(RIGHT(LEFT(B93,18),9)=\"Expertise\",ROUNDDOWN((-0.4 * L92),0),0))","v":0}]
[{"$f":"\"Enchant\"","v":"Enchant"},"None",{"$f":"IF(OR($B94=\"None\",ISBLANK($B94)),0,VLOOKUP($B94,ItemList,HLOOKUP(C$22,StatLoC,2,FALSE),FALSE))","v":0},0,0,0,0,0,0,0,0,0,0,{"$f":"IF(OR($B94=\"None\",ISBLANK($B94)),0,VLOOKUP($B94,ItemList,HLOOKUP(N$22,StatLoC,2,FALSE),FALSE))","v":0},{"$f":"IF(OR($B94=\"None\",ISBLANK($B94)),0,VLOOKUP($B94,ItemList,HLOOKUP(O$22,StatLoC,2,FALSE),FALSE))","v":0},{"$f":"IF(OR($B94=\"None\",ISBLANK($B94)),0,VLOOKUP($B94,ItemList,HLOOKUP(P$22,StatLoC,2,FALSE),FALSE))","v":0},0,0,"Perk",null,null,null,{"$f":"IF(SUM(S94:V94)>0,1,0)","v":0}]
[{"$f":"S92","v":0},"Bold Inferno Ruby (40 Str)",{"$f":"IF(ISNONTEXT($S92),0,VLOOKUP($B95,ItemList,HLOOKUP(C$22,StatLoC,2,FALSE),FALSE))","v":0},0,0,0,0,0,0,0,0,0,0,0,0,0,{"$f":"10*C95","v":0},{"$f":"(D95*15)","v":0},{"$f":"IF(ISNONTEXT($S92),0,VLOOKUP($B95,ItemList,HLOOKUP(S$22,StatLoC,2,FALSE),FALSE))","v":0},{"$f":"IF(ISNONTEXT($S92),0,VLOOKUP($B95,ItemList,HLOOKUP(T$22,StatLoC,2,FALSE),FALSE))","v":0},{"$f":"IF(ISNONTEXT($S92),0,VLOOKUP($B95,ItemList,HLOOKUP(U$22,StatLoC,2,FALSE),FALSE))","v":0},{"$f":"IF(ISNONTEXT($S92),0,VLOOKUP($B95,ItemList,HLOOKUP(V$22,StatLoC,2,FALSE),FALSE))","v":0},{"$f":"IF(ISNONTEXT(S92),\"\",IF(OR(S92=S95,S92=T95, S92=U95),\"\",\"Fail\"))","v":""},null,{"$f":"IF(OR(S95=\"r\",T95=\"r\",U95=\"r\"),1,0)","v":0},{"$f":"IF(OR(S95=\"y\",T95=\"y\",U95=\"y\"),1,0)","v":0},{"$f":"IF(OR(S95=\"b\",T95=\"b\",U95=\"b\"),1,0)","v":0}]
[{"$f":"T92","v":0},"Bold Inferno Ruby (40 Str)",{"$f":"IF(ISNONTEXT($T92),0,VLOOKUP($B96,ItemList,HLOOKUP(C$22,StatLoC,2,FALSE),FALSE))","v":0},0,0,0,0,0,0,0,0,0,0,0,0,0,{"$f":"10*C96","v":0},{"$f":"(D96*15)","v":0},{"$f":"IF(ISNONTEXT($T92),0,VLOOKUP($B96,ItemList,HLOOKUP(S$22,StatLoC,2,FALSE),FALSE))","v":0},{"$f":"IF(ISNONTEXT($T92),0,VLOOKUP($B96,ItemList,HLOOKUP(T$22,StatLoC,2,FALSE),FALSE))","v":0},{"$f":"IF(ISNONTEXT($T92),0,VLOOKUP($B96,ItemList,HLOOKUP(U$22,StatLoC,2,FALSE),FALSE))","v":0},{"$f":"IF(ISNONTEXT($T92),0,VLOOKUP($B96,ItemList,HLOOKUP(V$22,StatLoC,2,FALSE),FALSE))","v":0},{"$f":"IF(ISNONTEXT(T92),\"\",IF(OR(T92=S96,T92=T96, T92=U96),\"\",\"Fail\"))","v":""}]
[{"$f":"U92","v":0},"Bold Inferno Ruby (40 Str)",{"$f":"IF(ISNONTEXT($U92),0,VLOOKUP($B97,ItemList,HLOOKUP(C$22,StatLoC,2,FALSE),FALSE))","v":0},0,0,0,0,0,0,0,0,0,0,0,0,0,{"$f":"10*C97","v":0},{"$f":"(D97*15)","v":0},{"$f":"IF(ISNONTEXT($U92),0,VLOOKUP($B97,ItemList,HLOOKUP(S$22,StatLoC,2,FALSE),FALSE))","v":0},{"$f":"IF(ISNONTEXT($U92),0,VLOOKUP($B97,ItemList,HLOOKUP(T$22,StatLoC,2,FALSE),FALSE))","v":0},{"$f":"IF(ISNONTEXT($U92),0,VLOOKUP($B97,ItemList,HLOOKUP(U$22,StatLoC,2,FALSE),FALSE))","v":0},{"$f":"IF(ISNONTEXT($U92),0,VLOOKUP($B97,ItemList,HLOOKUP(V$22,StatLoC,2,FALSE),FALSE))","v":0},{"$f":"IF(ISNONTEXT(U92),\"\",IF(OR(U92=S97,U92=T97, U92=U97),\"\",\"Fail\"))","v":""}]
[{"$f":"IF(AND(ISNONTEXT(A97),ISNONTEXT(A96),ISNONTEXT(A95)),\"\",\"bo\")","v":""},"Bonus:",{"$f":"IF($W98=TRUE,IF(C$22=$W92,$X92,0),0)","v":0},0,0,0,0,0,0,0,0,0,0,0,0,0,{"$f":"10*C98","v":0},{"$f":"(D98*15)","v":0},null,null,null,null,{"$f":"IF(OR(W95=\"Fail\",W96=\"Fail\",W97=\"Fail\"),FALSE,TRUE)","v":true}]
[null,"Alysrazor's Band",{"$f":"IF(OR($B99=\"None\",ISBLANK($B99)),0,VLOOKUP($B99,ItemList,HLOOKUP(C$22,StatLoC,2,FALSE),FALSE))","v":341},0,227,0,0,0,0,107,0,150,0,0,0,0,3410,{"$f":"(D99*15)","v":0},{"$f":"IF(OR($B99=\"None\",ISBLANK($B99)),0,VLOOKUP($B99,ItemList,HLOOKUP(S$22,StatLoC,2,FALSE),FALSE))","v":"r"},{"$f":"IF(OR($B99=\"None\",ISBLANK($B99)),0,VLOOKUP($B99,ItemList,HLOOKUP(T$22,StatLoC,2,FALSE),FALSE))","v":0},{"$f":"IF(OR($B99=\"None\",ISBLANK($B99)),0,VLOOKUP($B99,ItemList,HLOOKUP(U$22,StatLoC,2,FALSE),FALSE))","v":0},null,{"$f":"IF(OR($B99=\"None\",ISBLANK($B99)),0,VLOOKUP($B99,ItemList,HLOOKUP(W$22,StatLoC,2,FALSE),FALSE))","v":"Str"},{"$f":"IF(OR($B99=\"None\",ISBLANK($B99)),0,VLOOKUP($B99,ItemList,HLOOKUP(X$22,StatLoC,2,FALSE),FALSE))","v":10}]
[null,"Reforge: Expertise to Hit",null,null,null,null,null,{"$f":"IF(RIGHT(B100,3)=\"Hit\",(-1 * SUM(I100:L100)),IF(RIGHT(LEFT(B100,12),3)=\"Hit\",ROUNDDOWN((-0.4 * H99),0),0))","v":60},{"$f":"IF(RIGHT(B100,4)=\"Crit\",(-1 * SUM(H100,J100,K100,L100)),IF(RIGHT(LEFT(B100,13),4)=\"Crit\",ROUNDDOWN((-0.4 * I99),0),0))","v":0},{"$f":"IF(RIGHT(B100,5)=\"Haste\",(-1 * SUM(H100:I100,K100:L100)),IF(RIGHT(LEFT(B100,14),5)=\"Haste\",ROUNDDOWN((-0.4 * J99),0),0))","v":0},{"$f":"IF(RIGHT(B100,7)=\"Mastery\",(-1 * SUM(H100:J100,L100)),IF(RIGHT(LEFT(B100,16),7)=\"Mastery\",ROUNDDOWN((-0.4 * K99),0),0))","v":0},{"$f":"IF(RIGHT(B100,9)=\"Expertise\",(-1 * SUM(H100:K100)),IF(RIGHT(LEFT(B100,18),9)=\"Expertise\",ROUNDDOWN((-0.4 * L99),0),0))","v":-60}]
["Enchant","None",{"$f":"IF(OR($B101=\"None\",ISBLANK($B101)),0,VLOOKUP($B101,ItemList,HLOOKUP(C$22,StatLoC,2,FALSE),FALSE))","v":0},0,0,0,0,0,0,0,0,0,0,{"$f":"IF(OR($B101=\"None\",ISBLANK($B101)),0,VLOOKUP($B101,ItemList,HLOOKUP(N$22,StatLoC,2,FALSE),FALSE))","v":0},{"$f":"IF(OR($B101=\"None\",ISBLANK($B101)),0,VLOOKUP($B101,ItemList,HLOOKUP(O$22,StatLoC,2,FALSE),FALSE))","v":0},{"$f":"IF(OR($B101=\"None\",ISBLANK($B101)),0,VLOOKUP($B101,ItemList,HLOOKUP(P$22,StatLoC,2,FALSE),FALSE))","v":0},{"$f":"10*C101","v":0},0,"Perk",null,null,null,{"$f":"IF(SUM(S101:V101)>0,1,0)","v":0}]
[{"$f":"S99","v":"r"},"Bold Inferno Ruby (40 Str)",{"$f":"IF(ISNONTEXT($S99),0,VLOOKUP($B102,ItemList,HLOOKUP(C$22,StatLoC,2,FALSE),FALSE))","v":0},0,40,0,0,0,0,0,0,0,0,0,0,0,0,0,{"$f":"IF(ISNONTEXT($S99),0,VLOOKUP($B102,ItemList,HLOOKUP(S$22,StatLoC,2,FALSE),FALSE))","v":"r"},{"$f":"IF(ISNONTEXT($S99),0,VLOOKUP($B102,ItemList,HLOOKUP(T$22,StatLoC,2,FALSE),FALSE))","v":0},{"$f":"IF(ISNONTEXT($S99),0,VLOOKUP($B102,ItemList,HLOOKUP(U$22,StatLoC,2,FALSE),FALSE))","v":0},{"$f":"IF(ISNONTEXT($S99),0,VLOOKUP($B102,ItemList,HLOOKUP(V$22,StatLoC,2,FALSE),FALSE))","v":0},{"$f":"IF(ISNONTEXT(S99),\"\",IF(OR(S99=S102,S99=T102, S99=U102),\"\",\"Fail\"))","v":""},null,{"$f":"IF(OR(S102=\"r\",T102=\"r\",U102=\"r\"),1,0)","v":1},{"$f":"IF(OR(S102=\"y\",T102=\"y\",U102=\"y\"),1,0)","v":0},{"$f":"IF(OR(S102=\"b\",T102=\"b\",U102=\"b\"),1,0)","v":0}]
[{"$f":"T99","v":0},"Bold Inferno Ruby (40 Str)",{"$f":"IF(ISNONTEXT($T99),0,VLOOKUP($B103,ItemList,HLOOKUP(C$22,StatLoC,2,FALSE),FALSE))","v":0},0,0,0,0,0,0,0,0,0,0,0,0,0,0,0,{"$f":"IF(ISNONTEXT($T99),0,VLOOKUP($B103,ItemList,HLOOKUP(S$22,StatLoC,2,FALSE),FALSE))","v":0},{"$f":"IF(ISNONTEXT($T99),0,VLOOKUP($B103,ItemList,HLOOKUP(T$22,StatLoC,2,FALSE),FALSE))","v":0},{"$f":"IF(ISNONTEXT($T99),0,VLOOKUP($B103,ItemList,HLOOKUP(U$22,StatLoC,2,FALSE),FALSE))","v":0},{"$f":"IF(ISNONTEXT($T99),0,VLOOKUP($B103,ItemList,HLOOKUP(V$22,StatLoC,2,FALSE),FALSE))","v":0},{"$f":"IF(ISNONTEXT(T99),\"\",IF(OR(T99=S103,T99=T103, T99=U103),\"\",\"Fail\"))","v":""}]
[{"$f":"U99","v":0},"Bold Inferno Ruby (40 Str)",{"$f":"IF(ISNONTEXT($U99),0,VLOOKUP($B104,ItemList,HLOOKUP(C$22,StatLoC,2,FALSE),FALSE))","v":0},0,0,0,0,0,0,0,0,0,0,0,0,0,0,0,{"$f":"IF(ISNONTEXT($U99),0,VLOOKUP($B104,ItemList,HLOOKUP(S$22,StatLoC,2,FALSE),FALSE))","v":0},{"$f":"IF(ISNONTEXT($U99),0,VLOOKUP($B104,ItemList,HLOOKUP(T$22,StatLoC,2,FALSE),FALSE))","v":0},{"$f":"IF(ISNONTEXT($U99),0,VLOOKUP($B104,ItemList,HLOOKUP(U$22,StatLoC,2,FALSE),FALSE))","v":0},{"$f":"IF(ISNONTEXT($U99),0,VLOOKUP($B104,ItemList,HLOOKUP(V$22,StatLoC,2,FALSE),FALSE))","v":0},{"$f":"IF(ISNONTEXT(U99),\"\",IF(OR(U99=S104,U99=T104, U99=U104),\"\",\"Fail\"))","v":""}]
[{"$f":"IF(AND(ISNONTEXT(A104),ISNONTEXT(A103),ISNONTEXT(A102)),\"\",\"bo\")","v":"bo"},"Bonus:",{"$f":"IF($W105=TRUE,IF(C$22=$W99,$X99,0),0)","v":0},{"$f":"IF($W105=TRUE,IF(D$22=$W99,$X99,0),0)","v":0},10,0,0,0,0,0,0,0,0,0,0,0,{"$f":"10*C105","v":0},{"$f":"(D105*15)","v":0},null,null,null,null,{"$f":"IF(OR(W102=\"Fail\",W103=\"Fail\",W104=\"Fail\"),FALSE,TRUE)","v":true}]
[null,"Essence of the Eternal Flame",{"$f":"IF(OR($B106=\"None\",ISBLANK($B106)),0,VLOOKUP($B106,ItemList,HLOOKUP(C$22,StatLoC,2,FALSE),FALSE)) + IF(AND(NOT(ISTEXT($S106)),NOT(ISTEXT($T106)),NOT(ISTEXT($U106)),NOT(ISTEXT($V106)),$W106=C$22),$X106,0)","v":0},0,319.25,0,0,0,0,0,383,0,0,{"$f":"IF(OR($B106=\"None\",ISBLANK($B106)),0,VLOOKUP($B106,ItemList,HLOOKUP(N$22,StatLoC,2,FALSE),FALSE))","v":0},0,0,0,0,{"$f":"IF(OR($B106=\"None\",ISBLANK($B106)),0,VLOOKUP($B106,ItemList,HLOOKUP(S$22,StatLoC,2,FALSE),FALSE))","v":0},{"$f":"IF(OR($B106=\"None\",ISBLANK($B106)),0,VLOOKUP($B106,ItemList,HLOOKUP(T$22,StatLoC,2,FALSE),FALSE))","v":0},{"$f":"IF(OR($B106=\"None\",ISBLANK($B106)),0,VLOOKUP($B106,ItemList,HLOOKUP(U$22,StatLoC,2,FALSE),FALSE))","v":0},null,{"$f":"IF(OR($B106=\"None\",ISBLANK($B106)),0,VLOOKUP($B106,ItemList,HLOOKUP(W$22,StatLoC,2,FALSE),FALSE))","v":"Str"},{"$f":"IF(OR($B106=\"None\",ISBLANK($B106)),0,VLOOKUP($B106,ItemList,HLOOKUP(X$22,StatLoC,2,FALSE),FALSE))","v":319.25}]
[null,"Reforge: Mastery to Hit",null,null,null,null,null,{"$f":"IF(RIGHT(B107,3)=\"Hit\",(-1 * SUM(I107:L107)),IF(RIGHT(LEFT(B107,12),3)=\"Hit\",ROUNDDOWN((-0.4 * H106),0),0))","v":153},{"$f":"IF(RIGHT(B107,4)=\"Crit\",(-1 * SUM(H107,J107,K107,L107)),IF(RIGHT(LEFT(B107,13),4)=\"Crit\",ROUNDDOWN((-0.4 * I106),0),0))","v":0},{"$f":"IF(RIGHT(B107,5)=\"Haste\",(-1 * SUM(H107:I107,K107:L107)),IF(RIGHT(LEFT(B107,14),5)=\"Haste\",ROUNDDOWN((-0.4 * J106),0),0))","v":0},{"$f":"IF(RIGHT(B107,7)=\"Mastery\",(-1 * SUM(H107:J107,L107)),IF(RIGHT(LEFT(B107,16),7)=\"Mastery\",ROUNDDOWN((-0.4 * K106),0),0))","v":-153},{"$f":"IF(RIGHT(B107,9)=\"Expertise\",(-1 * SUM(H107:K107)),IF(RIGHT(LEFT(B107,18),9)=\"Expertise\",ROUNDDOWN((-0.4 * L106),0),0))","v":0}]
[null,"None"]
[{"$f":"S106","v":0},"Bold Inferno Ruby (40 Str)",{"$f":"IF(ISNONTEXT($S106),0,VLOOKUP($B109,ItemList,HLOOKUP(C$22,StatLoC,2,FALSE),FALSE))","v":0},0,0,0,0,0,0,0,0,0,0,0,0,0,{"$f":"10*C109","v":0},{"$f":"(D109*15)","v":0},{"$f":"IF(ISNONTEXT($S106),0,VLOOKUP($B109,ItemList,HLOOKUP(S$22,StatLoC,2,FALSE),FALSE))","v":0},{"$f":"IF(ISNONTEXT($S106),0,VLOOKUP($B109,ItemList,HLOOKUP(T$22,StatLoC,2,FALSE),FALSE))","v":0},{"$f":"IF(ISNONTEXT($S106),0,VLOOKUP($B109,ItemList,HLOOKUP(U$22,StatLoC,2,FALSE),FALSE))","v":0},{"$f":"IF(ISNONTEXT($S106),0,VLOOKUP($B109,ItemList,HLOOKUP(V$22,StatLoC,2,FALSE),FALSE))","v":0},{"$f":"IF(ISNONTEXT(S106),\"\",IF(OR(S106=S109,S106=T109, S106=U109),\"\",\"Fail\"))","v":""},null,{"$f":"IF(OR(S109=\"r\",T109=\"r\",U109=\"r\"),1,0)","v":0},{"$f":"IF(OR(S109=\"y\",T109=\"y\",U109=\"y\"),1,0)","v":0},{"$f":"IF(OR(S109=\"b\",T109=\"b\",U109=\"b\"),1,0)","v":0}]
[{"$f":"T106","v":0},"Bold Inferno Ruby (40 Str)",{"$f":"IF(ISNONTEXT($T106),0,VLOOKUP($B110,ItemList,HLOOKUP(C$22,StatLoC,2,FALSE),FALSE))","v":0},0,0,0,0,0,0,0,0,0,0,0,0,0,{"$f":"10*C110","v":0},{"$f":"(D110*15)","v":0},{"$f":"IF(ISNONTEXT($T106),0,VLOOKUP($B110,ItemList,HLOOKUP(S$22,StatLoC,2,FALSE),FALSE))","v":0},{"$f":"IF(ISNONTEXT($T106),0,VLOOKUP($B110,ItemList,HLOOKUP(T$22,StatLoC,2,FALSE),FALSE))","v":0},{"$f":"IF(ISNONTEXT($T106),0,VLOOKUP($B110,ItemList,HLOOKUP(U$22,StatLoC,2,FALSE),FALSE))","v":0},{"$f":"IF(ISNONTEXT($T106),0,VLOOKUP($B110,ItemList,HLOOKUP(V$22,StatLoC,2,FALSE),FALSE))","v":0},{"$f":"IF(ISNONTEXT(T106),\"\",IF(OR(T106=S110,T106=T110, T106=U110),\"\",\"Fail\"))","v":""}]
[{"$f":"U106","v":0},"Bold Inferno Ruby (40 Str)",{"$f":"IF(ISNONTEXT($U106),0,VLOOKUP($B111,ItemList,HLOOKUP(C$22,StatLoC,2,FALSE),FALSE))","v":0},0,0,0,0,0,0,0,0,0,0,0,0,0,{"$f":"10*C111","v":0},{"$f":"(D111*15)","v":0},{"$f":"IF(ISNONTEXT($U106),0,VLOOKUP($B111,ItemList,HLOOKUP(S$22,StatLoC,2,FALSE),FALSE))","v":0},{"$f":"IF(ISNONTEXT($U106),0,VLOOKUP($B111,ItemList,HLOOKUP(T$22,StatLoC,2,FALSE),FALSE))","v":0},{"$f":"IF(ISNONTEXT($U106),0,VLOOKUP($B111,ItemList,HLOOKUP(U$22,StatLoC,2,FALSE),FALSE))","v":0},{"$f":"IF(ISNONTEXT($U106),0,VLOOKUP($B111,ItemList,HLOOKUP(V$22,StatLoC,2,FALSE),FALSE))","v":0},{"$f":"IF(ISNONTEXT(U106),\"\",IF(OR(U106=S111,U106=T111, U106=U111),\"\",\"Fail\"))","v":""}]
[{"$f":"IF(AND(ISNONTEXT(A111),ISNONTEXT(A110),ISNONTEXT(A109)),\"\",\"bo\")","v":""},"Bonus:",{"$f":"IF($W112=TRUE,IF(C$22=$W106,$X106,0),0)","v":0},{"$f":"IF($W112=TRUE,IF(D$22=$W106,$X106,0),0)","v":0},0,0,0,0,0,0,0,0,0,0,0,{"$f":"IF($W112=TRUE,IF(P$22=$W106,$X106,0),0)","v":0},{"$f":"10*C112","v":0},{"$f":"(D112*15)","v":0},null,null,null,null,{"$f":"IF(OR(W109=\"Fail\",W110=\"Fail\",W111=\"Fail\"),FALSE,IF(AND(S106=0,T106=0,U106=0),FALSE,TRUE))","v":false}]
[null,"Darkmoon Card: Hurricane",{"$f":"IF(OR($B113=\"None\",ISBLANK($B113)),0,VLOOKUP($B113,ItemList,HLOOKUP(C$22,StatLoC,2,FALSE),FALSE)) + IF(AND(NOT(ISTEXT($S113)),NOT(ISTEXT($T113)),NOT(ISTEXT($U113)),NOT(ISTEXT($V113)),$W113=C$22),$X113,0)","v":0},0,321,0,0,0,0,0,0,0,0,{"$f":"IF(OR($B113=\"None\",ISBLANK($B113)),0,VLOOKUP($B113,ItemList,HLOOKUP(N$22,StatLoC,2,FALSE),FALSE))","v":0},0,0,0,0,{"$f":"IF(OR($B113=\"None\",ISBLANK($B113)),0,VLOOKUP($B113,ItemList,HLOOKUP(S$22,StatLoC,2,FALSE),FALSE))","v":0},{"$f":"IF(OR($B113=\"None\",ISBLANK($B113)),0,VLOOKUP($B113,ItemList,HLOOKUP(T$22,StatLoC,2,FALSE),FALSE))","v":0},{"$f":"IF(OR($B113=\"None\",ISBLANK($B113)),0,VLOOKUP($B113,ItemList,HLOOKUP(U$22,StatLoC,2,FALSE),FALSE))","v":0},null,{"$f":"IF(OR($B113=\"None\",ISBLANK($B113)),0,VLOOKUP($B113,ItemList,HLOOKUP(W$22,StatLoC,2,FALSE),FALSE))","v":"DPS"},{"$f":"IF(OR($B113=\"None\",ISBLANK($B113)),0,VLOOKUP($B113,ItemList,HLOOKUP(X$22,StatLoC,2,FALSE),FALSE))","v":404.1701888986434}]
[null,"None",null,null,null,null,null,{"$f":"IF(RIGHT(B114,3)=\"Hit\",(-1 * SUM(I114:L114)),IF(RIGHT(LEFT(B114,12),3)=\"Hit\",ROUNDDOWN((-0.4 * H113),0),0))","v":0},{"$f":"IF(RIGHT(B114,4)=\"Crit\",(-1 * SUM(H114,J114,K114,L114)),IF(RIGHT(LEFT(B114,13),4)=\"Crit\",ROUNDDOWN((-0.4 * I113),0),0))","v":0},{"$f":"IF(RIGHT(B114,5)=\"Haste\",(-1 * SUM(H114:I114,K114:L114)),IF(RIGHT(LEFT(B114,14),5)=\"Haste\",ROUNDDOWN((-0.4 * J113),0),0))","v":0},{"$f":"IF(RIGHT(B114,7)=\"Mastery\",(-1 * SUM(H114:J114,L114)),IF(RIGHT(LEFT(B114,16),7)=\"Mastery\",ROUNDDOWN((-0.4 * K113),0),0))","v":0},{"$f":"IF(RIGHT(B114,9)=\"Expertise\",(-1 * SUM(H114:K114)),IF(RIGHT(LEFT(B114,18),9)=\"Expertise\",ROUNDDOWN((-0.4 * L113),0),0))","v":0}]
[null,"None"]
[{"$f":"S113","v":0},"Bold Inferno Ruby (40 Str)",{"$f":"IF(ISNONTEXT($S113),0,VLOOKUP($B116,ItemList,HLOOKUP(C$22,StatLoC,2,FALSE),FALSE))","v":0},0,0,0,0,0,0,0,0,0,0,0,0,0,0,0,{"$f":"IF(ISNONTEXT($S113),0,VLOOKUP($B116,ItemList,HLOOKUP(S$22,StatLoC,2,FALSE),FALSE))","v":0},{"$f":"IF(ISNONTEXT($S113),0,VLOOKUP($B116,ItemList,HLOOKUP(T$22,StatLoC,2,FALSE),FALSE))","v":0},{"$f":"IF(ISNONTEXT($S113),0,VLOOKUP($B116,ItemList,HLOOKUP(U$22,StatLoC,2,FALSE),FALSE))","v":0},{"$f":"IF(ISNONTEXT($S113),0,VLOOKUP($B116,ItemList,HLOOKUP(V$22,StatLoC,2,FALSE),FALSE))","v":0},{"$f":"IF(ISNONTEXT(S113),\"\",IF(OR(S113=S116,S113=T116, S113=U116),\"\",\"Fail\"))","v":""},null,{"$f":"IF(OR(S116=\"r\",T116=\"r\",U116=\"r\"),1,0)","v":0},{"$f":"IF(OR(S116=\"y\",T116=\"y\",U116=\"y\"),1,0)","v":0},{"$f":"IF(OR(S116=\"b\",T116=\"b\",U116=\"b\"),1,0)","v":0}]
[{"$f":"T113","v":0},"Bold Inferno Ruby (40 Str)",{"$f":"IF(ISNONTEXT($T113),0,VLOOKUP($B117,ItemList,HLOOKUP(C$22,StatLoC,2,FALSE),FALSE))","v":0},0,0,0,0,0,0,0,0,0,0,0,0,0,0,0,{"$f":"IF(ISNONTEXT($T113),0,VLOOKUP($B117,ItemList,HLOOKUP(S$22,StatLoC,2,FALSE),FALSE))","v":0},{"$f":"IF(ISNONTEXT($T113),0,VLOOKUP($B117,ItemList,HLOOKUP(T$22,StatLoC,2,FALSE),FALSE))","v":0},{"$f":"IF(ISNONTEXT($T113),0,VLOOKUP($B117,ItemList,HLOOKUP(U$22,StatLoC,2,FALSE),FALSE))","v":0},{"$f":"IF(ISNONTEXT($T113),0,VLOOKUP($B117,ItemList,HLOOKUP(V$22,StatLoC,2,FALSE),FALSE))","v":0},{"$f":"IF(ISNONTEXT(T113),\"\",IF(OR(T113=S117,T113=T117, T113=U117),\"\",\"Fail\"))","v":""}]
[{"$f":"U113","v":0},"Bold Inferno Ruby (40 Str)",{"$f":"IF(ISNONTEXT($U113),0,VLOOKUP($B118,ItemList,HLOOKUP(C$22,StatLoC,2,FALSE),FALSE))","v":0},0,0,0,0,0,0,0,0,0,0,0,0,0,0,0,{"$f":"IF(ISNONTEXT($U113),0,VLOOKUP($B118,ItemList,HLOOKUP(S$22,StatLoC,2,FALSE),FALSE))","v":0},{"$f":"IF(ISNONTEXT($U113),0,VLOOKUP($B118,ItemList,HLOOKUP(T$22,StatLoC,2,FALSE),FALSE))","v":0},{"$f":"IF(ISNONTEXT($U113),0,VLOOKUP($B118,ItemList,HLOOKUP(U$22,StatLoC,2,FALSE),FALSE))","v":0},{"$f":"IF(ISNONTEXT($U113),0,VLOOKUP($B118,ItemList,HLOOKUP(V$22,StatLoC,2,FALSE),FALSE))","v":0},{"$f":"IF(ISNONTEXT(U113),\"\",IF(OR(U113=S118,U113=T118, U113=U118),\"\",\"Fail\"))","v":""}]
[{"$f":"IF(AND(ISNONTEXT(A118),ISNONTEXT(A117),ISNONTEXT(A116)),\"\",\"bo\")","v":""},"Bonus:",{"$f":"IF($W119=TRUE,IF(C$22=$W112,$X112,0),0)","v":0},{"$f":"IF($W119=TRUE,IF(D$22=$W112,$X112,0),0)","v":0},0,0,0,0,0,0,0,0,0,0,0,0,{"$f":"10*C119","v":0},{"$f":"(D119*15)","v":0},null,null,null,null,{"$f":"IF(OR(W116=\"Fail\",W117=\"Fail\",W118=\"Fail\"),FALSE,IF(AND(S113=0,T113=0,U113=0),FALSE,TRUE))","v":false}]
[null,"Relic of the Elemental Lords",{"$f":"IF(OR($B120=\"None\",ISBLANK($B120)),0,VLOOKUP($B120,ItemList,HLOOKUP(C$22,StatLoC,2,FALSE),FALSE))","v":192},0,128,0,0,0,83,86,0,0,0,0,0,0,{"$f":"10*C120","v":1920},{"$f":"(D120*15)","v":0},{"$f":"IF(OR($B120=\"None\",ISBLANK($B120)),0,VLOOKUP($B120,ItemList,HLOOKUP(S$22,StatLoC,2,FALSE),FALSE))","v":"r"},null,null,null,{"$f":"IF(OR($B120=\"None\",ISBLANK($B120)),0,VLOOKUP($B120,ItemList,HLOOKUP(W$22,StatLoC,2,FALSE),FALSE))","v":0},{"$f":"IF(OR($B120=\"None\",ISBLANK($B120)),0,VLOOKUP($B120,ItemList,HLOOKUP(X$22,StatLoC,2,FALSE),FALSE))","v":0},"Speed","Dps"]
[null,"Reforge: Crit to Hit",null,null,null,null,null,{"$f":"IF(RIGHT(B121,3)=\"Hit\",(-1 * SUM(I121:L121)),IF(RIGHT(LEFT(B121,12),3)=\"Hit\",ROUNDDOWN((-0.4 * H120),0),0))","v":33},{"$f":"IF(RIGHT(B121,4)=\"Crit\",(-1 * SUM(H121,J121,K121,L121)),IF(RIGHT(LEFT(B121,13),4)=\"Crit\",ROUNDDOWN((-0.4 * I120),0),0))","v":-33},{"$f":"IF(RIGHT(B121,5)=\"Haste\",(-1 * SUM(H121:I121,K121:L121)),IF(RIGHT(LEFT(B121,14),5)=\"Haste\",ROUNDDOWN((-0.4 * J120),0),0))","v":0},{"$f":"IF(RIGHT(B121,7)=\"Mastery\",(-1 * SUM(H121:J121,L121)),IF(RIGHT(LEFT(B121,16),7)=\"Mastery\",ROUNDDOWN((-0.4 * K120),0),0))","v":0},{"$f":"IF(RIGHT(B121,9)=\"Expertise\",(-1 * SUM(H121:K121)),IF(RIGHT(LEFT(B121,18),9)=\"Expertise\",ROUNDDOWN((-0.4 * L120),0),0))","v":0}]
[null,"None"]
[{"$f":"S123","v":"r"},"Bold Inferno Ruby (40 Str)",{"$f":"IF(ISNONTEXT($S120),0,VLOOKUP($B123,ItemList,HLOOKUP(C$22,StatLoC,2,FALSE),FALSE))","v":0},0,40,0,0,0,0,0,0,0,0,0,0,0,0,0,{"$f":"IF(ISNONTEXT($S120),0,VLOOKUP($B123,ItemList,HLOOKUP(S$22,StatLoC,2,FALSE),FALSE))","v":"r"},{"$f":"IF(ISNONTEXT($S120),0,VLOOKUP($B123,ItemList,HLOOKUP(T$22,StatLoC,2,FALSE),FALSE))","v":0},{"$f":"IF(ISNONTEXT($S120),0,VLOOKUP($B123,ItemList,HLOOKUP(U$22,StatLoC,2,FALSE),FALSE))","v":0},{"$f":"IF(ISNONTEXT($S120),0,VLOOKUP($B123,ItemList,HLOOKUP(V$22,StatLoC,2,FALSE),FALSE))","v":0},{"$f":"IF(ISNONTEXT(S120),\"\",IF(OR(S120=S123,S120=T123),\"\",\"Fail\"))","v":""},null,{"$f":"IF(OR(S123=\"r\",T123=\"r\",U123=\"r\"),1,0)","v":1},{"$f":"IF(OR(S123=\"y\",T123=\"y\",U123=\"y\"),1,0)","v":0},{"$f":"IF(OR(S123=\"b\",T123=\"b\",U123=\"b\"),1,0)","v":0}]
[{"$f":"T120","v":0},"None",{"$f":"IF(ISNONTEXT($T120),0,VLOOKUP($B124,ItemList,HLOOKUP(C$22,StatLoC,2,FALSE),FALSE))","v":0},0,0,0,0,0,0,0,0,0,0,0,0,0,0,0,{"$f":"IF(ISNONTEXT($T120),0,VLOOKUP($B124,ItemList,HLOOKUP(S$22,StatLoC,2,FALSE),FALSE))","v":0},{"$f":"IF(ISNONTEXT($T120),0,VLOOKUP($B124,ItemList,HLOOKUP(T$22,StatLoC,2,FALSE),FALSE))","v":0},{"$f":"IF(ISNONTEXT($T120),0,VLOOKUP($B124,ItemList,HLOOKUP(U$22,StatLoC,2,FALSE),FALSE))","v":0},{"$f":"IF(ISNONTEXT($T120),0,VLOOKUP($B124,ItemList,HLOOKUP(V$22,StatLoC,2,FALSE),FALSE))","v":0},{"$f":"IF(ISNONTEXT(T120),\"\",IF(OR(T120=S124,T120=T124, T120=U124),\"\",\"Fail\"))","v":""}]
[{"$f":"U120","v":0},"None",{"$f":"IF(ISNONTEXT($U120),0,VLOOKUP($B125,ItemList,HLOOKUP(C$22,StatLoC,2,FALSE),FALSE))","v":0},0,0,0,0,0,0,0,0,0,0,0,0,0,0,0,{"$f":"IF(ISNONTEXT($U120),0,VLOOKUP($B125,ItemList,HLOOKUP(S$22,StatLoC,2,FALSE),FALSE))","v":0},{"$f":"IF(ISNONTEXT($U120),0,VLOOKUP($B125,ItemList,HLOOKUP(T$22,StatLoC,2,FALSE),FALSE))","v":0},{"$f":"IF(ISNONTEXT($U120),0,VLOOKUP($B125,ItemList,HLOOKUP(U$22,StatLoC,2,FALSE),FALSE))","v":0},{"$f":"IF(ISNONTEXT($U120),0,VLOOKUP($B125,ItemList,HLOOKUP(V$22,StatLoC,2,FALSE),FALSE))","v":0},{"$f":"IF(ISNONTEXT(U120),\"\",IF(OR(U120=S125,U120=T125, U120=U125),\"\",\"Fail\"))","v":""}]
[null,"Zoid's Firelit Greatsword",{"$f":"IF(OR($B126=\"None\",ISBLANK($B126)),0,VLOOKUP($B126,ItemList,HLOOKUP(C$22,StatLoC,2,FALSE),FALSE))","v":611},{"$f":"IF(OR($B126=\"None\",ISBLANK($B126)),0,VLOOKUP($B126,ItemList,HLOOKUP(D$22,StatLoC,2,FALSE),FALSE))","v":0},{"$f":"IF(OR($B126=\"None\",ISBLANK($B126)),0,VLOOKUP($B126,ItemList,HLOOKUP(E$22,StatLoC,2,FALSE),FALSE))","v":408},0,0,0,284,232,0,0,0,{"$f":"IF(OR($B126=\"None\",ISBLANK($B126)),0,VLOOKUP($B126,ItemList,HLOOKUP(N$22,StatLoC,2,FALSE),FALSE))","v":0},0,0,6110,0,{"$f":"IF(OR($B126=\"None\",ISBLANK($B126)),0,VLOOKUP($B126,ItemList,HLOOKUP(S$22,StatLoC,2,FALSE),FALSE))","v":"b"},0,0,0,"Str",10,{"$f":"IF(OR($B126=\"None\",ISBLANK($B126)),0,VLOOKUP($B126,ItemList,HLOOKUP(Y$120,StatLoC,2,FALSE),FALSE)) + Y220","v":3.6},{"$f":"IF(OR($B126=\"None\",ISBLANK($B126)),0,VLOOKUP($B126,ItemList,HLOOKUP(Z$120,StatLoC,2,FALSE),FALSE)) + Z220","v":744.1}]
[null,"Reforge: Crit to Mastery",null,null,null,null,null,{"$f":"IF(RIGHT(B127,3)=\"Hit\",(-1 * SUM(I127:L127)),IF(RIGHT(LEFT(B127,12),3)=\"Hit\",ROUNDDOWN((-0.4 * H126),0),0))","v":0},{"$f":"IF(RIGHT(B127,4)=\"Crit\",(-1 * SUM(H127,J127,K127,L127)),IF(RIGHT(LEFT(B127,13),4)=\"Crit\",ROUNDDOWN((-0.4 * I126),0),0))","v":-113},{"$f":"IF(RIGHT(B127,5)=\"Haste\",(-1 * SUM(H127:I127,K127:L127)),IF(RIGHT(LEFT(B127,14),5)=\"Haste\",ROUNDDOWN((-0.4 * J126),0),0))","v":0},{"$f":"IF(RIGHT(B127,7)=\"Mastery\",(-1 * SUM(H127:J127,L127)),IF(RIGHT(LEFT(B127,16),7)=\"Mastery\",ROUNDDOWN((-0.4 * K126),0),0))","v":113},{"$f":"IF(RIGHT(B127,9)=\"Expertise\",(-1 * SUM(H127:K127)),IF(RIGHT(LEFT(B127,18),9)=\"Expertise\",ROUNDDOWN((-0.4 * L126),0),0))","v":0}]
[null,"Landslide",{"$f":"IF(OR($B128=\"None\",ISBLANK($B128)),0,VLOOKUP($B128,ItemList,HLOOKUP(C$22,StatLoC,2,FALSE),FALSE))","v":0},{"$f":"IF(OR($B128=\"None\",ISBLANK($B128)),0,VLOOKUP($B128,ItemList,HLOOKUP(D$22,StatLoC,2,FALSE),FALSE))","v":0},0,471.73380914165455,0,0,0,0,0,0,0,0,0,0,0,0,null,null,null,null,{"$f":"IF(OR($B128=\"None\",ISBLANK($B128)),0,VLOOKUP($B128,ItemList,HLOOKUP(W$22,StatLoC,2,FALSE),FALSE))","v":0},{"$f":"IF(OR($B128=\"None\",ISBLANK($B128)),0,VLOOKUP($B128,ItemList,HLOOKUP(X$22,StatLoC,2,FALSE),FALSE))","v":0}]
[{"$f":"S126","v":"b"},"Etched Demonseye (20 Str/20 Hit)",{"$f":"IF(ISNONTEXT($S126),0,VLOOKUP($B129,ItemList,HLOOKUP(C$22,StatLoC,2,FALSE),FALSE))","v":0},0,20,0,0,20,0,0,0,0,0,0,0,0,0,0,{"$f":"IF(ISNONTEXT($S126),0,VLOOKUP($B129,ItemList,HLOOKUP(S$22,StatLoC,2,FALSE),FALSE))","v":"r"},{"$f":"IF(ISNONTEXT($S126),0,VLOOKUP($B129,ItemList,HLOOKUP(T$22,StatLoC,2,FALSE),FALSE))","v":"b"},{"$f":"IF(ISNONTEXT($S126),0,VLOOKUP($B129,ItemList,HLOOKUP(U$22,StatLoC,2,FALSE),FALSE))","v":0},{"$f":"IF(ISNONTEXT($S126),0,VLOOKUP($B129,ItemList,HLOOKUP(V$22,StatLoC,2,FALSE),FALSE))","v":0},{"$f":"IF(ISNONTEXT(S126),\"\",IF(OR(S126=S129,S126=T129),\"\",\"Fail\"))","v":""},null,{"$f":"IF(OR(S129=\"r\",T129=\"r\",U129=\"r\"),1,0)","v":1},{"$f":"IF(OR(S129=\"y\",T129=\"y\",U129=\"y\"),1,0)","v":0},{"$f":"IF(OR(S129=\"b\",T129=\"b\",U129=\"b\"),1,0)","v":1}]
[{"$f":"T126","v":0},"Bold Inferno Ruby (40 Str)",{"$f":"IF(ISNONTEXT($T126),0,VLOOKUP($B130,ItemList,HLOOKUP(C$22,StatLoC,2,FALSE),FALSE))","v":0},0,0,0,0,0,0,0,0,0,0,0,0,0,0,0,{"$f":"IF(ISNONTEXT($T126),0,VLOOKUP($B130,ItemList,HLOOKUP(S$22,StatLoC,2,FALSE),FALSE))","v":0},{"$f":"IF(ISNONTEXT($T126),0,VLOOKUP($B130,ItemList,HLOOKUP(T$22,StatLoC,2,FALSE),FALSE))","v":0},{"$f":"IF(ISNONTEXT($T126),0,VLOOKUP($B130,ItemList,HLOOKUP(U$22,StatLoC,2,FALSE),FALSE))","v":0},{"$f":"IF(ISNONTEXT($T126),0,VLOOKUP($B130,ItemList,HLOOKUP(V$22,StatLoC,2,FALSE),FALSE))","v":0},{"$f":"IF(ISNONTEXT(T126),\"\",IF(OR(T126=S130,T126=T130,T126=U130),\"\",\"Fail\"))","v":""},null,{"$f":"IF(OR(S130=\"r\",T130=\"r\",U130=\"r\"),1,0)","v":0},{"$f":"IF(OR(S130=\"y\",T130=\"y\",U130=\"y\"),1,0)","v":0},{"$f":"IF(OR(S130=\"b\",T130=\"b\",U130=\"b\"),1,0)","v":0}]
[{"$f":"U126","v":0},"Bold Inferno Ruby (40 Str)",{"$f":"IF(ISNONTEXT($U126),0,VLOOKUP($B131,ItemList,HLOOKUP(C$22,StatLoC,2,FALSE),FALSE))","v":0},0,0,0,0,0,0,0,0,0,0,0,0,0,0,0,{"$f":"IF(ISNONTEXT($U126),0,VLOOKUP($B131,ItemList,HLOOKUP(S$22,StatLoC,2,FALSE),FALSE))","v":0},{"$f":"IF(ISNONTEXT($U126),0,VLOOKUP($B131,ItemList,HLOOKUP(T$22,StatLoC,2,FALSE),FALSE))","v":0},{"$f":"IF(ISNONTEXT($U126),0,VLOOKUP($B131,ItemList,HLOOKUP(U$22,StatLoC,2,FALSE),FALSE))","v":0},{"$f":"IF(ISNONTEXT($U126),0,VLOOKUP($B131,ItemList,HLOOKUP(V$22,StatLoC,2,FALSE),FALSE))","v":0},{"$f":"IF(ISNONTEXT(U126),\"\",IF(OR(U126=S131,U126=T131,U126=U131),\"\",\"Fail\"))","v":""},null,{"$f":"IF(OR(S131=\"r\",T131=\"r\",U131=\"r\"),1,0)","v":0},{"$f":"IF(OR(S131=\"y\",T131=\"y\",U131=\"y\"),1,0)","v":0},{"$f":"IF(OR(S131=\"b\",T131=\"b\",U131=\"b\"),1,0)","v":0}]
[{"$f":"IF(AND(ISNONTEXT(A131),ISNONTEXT(A130),ISNONTEXT(A129)),\"\",\"bo\")","v":"bo"},"Bonus:",{"$f":"IF($W132=TRUE,IF(C$22=$W126,$X126,0),0)","v":0},0,10,0,0,0,0,0,0,0,0,0,0,0,0,0,null,null,null,null,{"$f":"IF(OR(W129=\"Fail\",W130=\"Fail\",W131=\"Fail\"),FALSE,TRUE)","v":true}]
[null,null,"Stam","Int","Str","AP","Agi","Hit","Crit","Haste","Mastery","WE","SpD","SpH","SpC","Mp5","Health","Mana","G1","G2","G3","G4","Bonus","Amount"]
[null,"Rating Totals",{"$f":"SUM(C23:C132)","v":5949},{"$f":"SUM(D23:D132)","v":20},5291.25,661.73380914165455,20,961,1014,1766,1481,422,0,0,0,0,59490,300]
[null,"Goals",null,null,null,null,null,{"$f":"ROUNDUP(((8 * H223) - IF(Race=\"Base Information (Draenei)\",H223,0)),0)","v":961},null,null,null,{"$f":"ROUNDUP((781 - (L17 * L223) - IF(GlyphOfSoT=\"On\",(10 * L223),0)),0)","v":391}]
[]
[null,"Talents","Stam","Int","Str","AP","Agi","Hit","Crit","Haste","Mastery","WE","SpD","SpH","SpC","Mp5","Health","Mana",{"$f":"SUM(A142:A145)","v":7},{"$f":"SUM(A146:A148)","v":2},{"$f":"SUM(A149:A168)","v":32}]
[null,"Hand of Light"]
[null,"Judgements of the Wise"]
[null,"Sheath of Light",null,null,null,null,null,null,null,null,null,null,{"$f":"0.3 * (F17 + F18 + F19 + F220)","v":4664.9146695167456},0.08]
[null,"Two-Handed Weapon Specialization"]
[2,"Arbiter of Light",null,null,null,null,null,null,null,null,null,null,null,null,null,null,null,null,null,"Spec"]
[0,"Protector of the Innocent",null,null,null,null,null,null,null,null,null,null,null,null,null,null,null,null,null,{"$f":"CONCATENATE(S137,\"/\",T137,\"/\",U137)","v":"7/2/32"}]
[3,"Judgements of the Pure",null,null,null,null,null,null,null,{"$f":"3%*A144","v":0.09}]
[2,"Blazing Light"]
[0,"Divinity"]
[2,"Seals of the Pure"]
[0,"Eternal Glory"]
[2,"Eye for an Eye"]
[3,"Crusade"]
[2,"Improved Judgement"]
[0,"Eternal Glory"]
[3,"Rule of Law"]
[2,"Pursuit of Justice"]
[1,"Communion"]
[3,"Art of War"]
[2,"Long Arm of the Law"]
[1,"Divine Storm"]
[1,"Sacred Shield"]
[1,"Sanctity of Battle"]
[1,"Seals of Command"]
[3,"Sanctified Wrath"]
[0,"Selfless Healer"]
[1,"Repentance"]
[2,"Divine Purpose"]
[3,"Inquiry of Faith"]
[0,"Acts of Sacrifice"]
[1,"Zealotry"]
[]
[null,"Glyphs","Stam","Int","Str","AP","Agi","Hit","Crit","Haste","Mastery","WE","SpD","SpH","SpC","Mp5","Health","Mana"]
["Off","Glyph of Crusader Strike (Prime)",null,null,null,null,null,null,null,null,null,null,null,null,null,null,null,null,{"$f":"IF(A171=\"On\",1,0)","v":0}]
["On","Glyph of Exorcism (Prime)",null,null,null,null,null,null,null,null,null,null,null,null,null,null,null,null,1]
["Off","Glyph of Judgement (Prime)",null,null,null,null,null,null,null,null,null,null,null,null,null,null,null,null,0]
["On","Glyph of Seal of Truth (Prime)",null,null,null,null,null,null,null,null,null,{"$f":"IF(A174=\"On\",10,0)","v":10},null,null,null,null,null,null,1]
["On","Glyph of Templar's Verdict (Prime)",null,null,null,null,null,null,null,null,null,null,null,null,null,null,null,null,1]
["On","Glyph of the Ascetic Crusader (Major)",null,null,null,null,null,null,null,null,null,null,null,null,null,null,null,null,1]
["Off","Glyph of Consecration (Major)",null,null,null,null,null,null,null,null,null,null,null,null,null,null,null,null,{"$f":"IF(A177=\"On\",1,0)","v":0}]
["Off","Glyph of Divine Plea (Major)",null,null,null,null,null,null,null,null,null,null,null,null,null,null,null,null,0]
["Off","Glyph of Divinity (Major)",null,null,null,null,null,null,null,null,null,null,null,null,null,null,null,null,{"$f":"IF(A179=\"On\",1,0)","v":0}]
["On","Glyph of Hammer of Wrath (Major)",null,null,null,null,null,null,null,null,null,null,null,null,null,null,null,null,{"$f":"IF(A180=\"On\",1,0)","v":1}]
["Off","Glyph of Holy Wrath (Major)",null,null,null,null,null,null,null,null,null,null,null,null,null,null,null,null,{"$f":"IF(A181=\"On\",1,0)","v":0}]
["On","Glyph of Rebuke (Major)",null,null,null,null,null,null,null,null,null,null,null,null,null,null,null,null,1]
[]
[null,"Buffs / Debuffs","Stam","Int","Str","AP","Agi","Hit","Crit","Haste","Mastery","WE","SpD","SpH","SpC","Mp5","Health","Mana"]
[null,"Plate Specialization: +5% Str",null,null,{"$f":"5% * SUM(E17,E18,E138:E184,E186,E188:E215,E220)","v":300.21250000000003},{"$f":"E185*2","v":600.42500000000007}]
["On","Attack Power: +10%",0,0,0,{"$f":"(IF(A186=\"On\",10% * SUM(F17,F18,F138:F185,F187:F215,F220),0))","v":1413.6105059141655},0,0,0,null,0,0,0,0,0,0,{"$f":"C186*10","v":0},{"$f":"(D186*15)","v":0},"DK/Hunter/Paladin/Enh Shaman"]
["On","Stats: +5%",{"$f":"(IF(A187=\"On\",5% * (SUM(C17,C18,C138:C186,C188:C215,C220)+IF(OR(Profession1=\"Mining\",Profession2=\"Mining\"),50,0)),0))","v":334.45000000000005},{"$f":"(IF(A187=\"On\",5% * SUM(D17,D18,D138:D186,D188:D215,D220),0))","v":6.3000000000000007},{"$f":"(IF(A187=\"On\",5% * SUM(E17,E18,E138:E185,E186,E188:E215,E220),0))","v":315.22312499999998},{"$f":"E187*2","v":630.44624999999996},{"$f":"(IF(A187=\"On\",5% * SUM(G17,G18,G138:G186,G188:G215,G220),0))","v":33.300000000000004},0,{"$f":"(G187*G223)","v":0.16383600000000001},null,0,0,null,0,{"$f":"D187*D223","v":1.2600000000000002E-2},0,{"$f":"C187*10","v":3344.5000000000005},{"$f":"(D187*15)","v":94.500000000000014},"Paladin"]
["On","Mana Regen",null,null,null,null,null,null,null,null,null,null,null,null,null,{"$f":"(IF(A188=\"On\",828,0))","v":828},null,null,"Paladin/Shaman/Warlock(Felhunter)"]
["On","Damage: +3%",null,null,null,null,null,null,null,null,null,null,null,null,null,null,null,null,"Hunter/Mage/Paladin"]
["On","Crit: +5%",0,0,0,0,0,0,{"$f":"(IF(A190=\"On\",5,0))","v":5},null,0,0,0,0,{"$f":"(IF(A190=\"On\",5,0))","v":5},0,{"$f":"C190*10","v":0},{"$f":"(D190*15)","v":0},"Feral Druid/Subtlety Rogue/Elemental Shaman/Warrior"]
["On","Melee Attack Speed: +10%",0,0,0,0,0,0,0,{"$f":"IF(A191=\"On\",10%,0)","v":0.1},0,0,0,0,0,0,{"$f":"C191*10","v":0},0,"Hunter/Enh Shaman/Frost DK"]
["On","Agility and Strength",0,0,{"$f":"IF(A192=\"On\",549,0)","v":549},{"$f":"(2*E192)","v":1098},{"$f":"IF(A192=\"On\",549,0)","v":549},0,{"$f":"(G192*G223)","v":2.7010800000000001},null,0,null,0,0,0,0,{"$f":"C192*10","v":0},0,"DK/Shaman/Warrior"]
["On","Spell Haste: +5%",null,null,null,null,null,null,null,{"$f":"IF(A193=\"On\",5%,0)","v":0.05},null,null,null,null,null,null,null,null,"Balance Druid/Shadow Priest/Shaman"]
[10,{"$f":"CONCATENATE(\"Spell Power: +\", IF(A194=\"Off\",\"\",A194),\"%\")","v":"Spell Power: +10%"},null,null,null,null,null,null,null,null,null,null,{"$f":"(IF(A194=\"Off\",0,A194% * SUM(M17,M18,M138:M193,M195:M215,M220)))","v":478.09146695167459},null,0,null,null,0,"Shaman, Mage (Ele Shaman, Demo Warlock)"]
["On","Mana Pool",null,null,null,null,null,null,null,null,null,null,null,null,{"$f":"D195*D223","v":0},null,null,{"$f":"IF(A195=\"On\",5401,0)","v":5401},"Mage/Warlock(Felhunter)"]
["On","Tricks of the Trade",null,null,null,null,null,null,null,null,null,null,null,null,null,null,null,null,"Rogue"]
["On","Stamina",{"$f":"IF(A197=\"On\",584,0)","v":584},null,null,null,null,null,null,null,null,null,null,null,null,null,{"$f":"10*C197","v":5840},null,"Priest/Warlock(Imp)/Warrior"]
["On","Physical Damage Debuff: +4%",null,null,null,null,null,null,null,null,null,0,null,null,null,null,{"$f":"C198*10","v":0},{"$f":"(D198*15)","v":0},"Warrior/Rogue"]
["On","Armor Debuff: -12%",null,null,null,null,null,null,null,null,null,null,null,null,null,null,null,{"$f":"(D199*15)","v":0},"Warrior/Rogue"]
["On","Spell Damage Debuff: +8%",null,null,null,null,null,null,null,null,null,null,null,null,null,null,null,{"$f":"(D200*15)","v":0},"Unholy DK/Balance Druid/Warlock"]
["On","Heroism",null,null,null,null,null,null,null,{"$f":"IF(AND(A201=\"On\",Estimations=\"On\"),(30% * (40 / Length)),0)","v":2.6666666666666668E-2},null,null,null,null,null,null,null,null,"Shaman/Mage"]
["Off","Spell Crit Debuff: +5%",null,null,null,null,null,null,null,null,null,null,null,null,{"$f":"(IF(A202=\"On\",5,0))","v":0},null,null,null,"Fire Mage/Warlock"]
[0,"Icecrown Buff (read Note)",null,null,null,null,null,null,null,null,null,null,null,null,null,null,{"$f":"SUM(Q17:Q19) * ICCBuff","v":0}]
[]
[null,"Consumables","Stam","Int","Str","AP","Agi","Hit","Crit","Haste","Mastery","WE","SpD","SpH","SpC","Mp5","Health","Mana"]
["Off","Dark Rune/Demonic Rune",null,null,null,null,null,null,null,null,null,null,null,null,null,null,null,{"$f":"IF(A206=\"Off\",0,1200)","v":0}]
["Off","Mythical Mana Potion",null,null,null,null,null,null,null,null,null,null,null,null,null,null,null,{"$f":"IF(A207=\"Off\",0,10000)","v":0}]
["Off","Golemblood Potion",null,null,{"$f":"IF(C3=\"On\",IF(A208=\"On\",1200*((25 + PrePot)/Length),0),0)","v":0},null,null,null,null,null,null,null,null,null,null,null,null,null,null,"Pre-Pot Duration",null,null,0]
["Off","Flask of Endless Rage",0,0,0,{"$f":"IF(A209=\"Off\",0,IF(OR(Profession1=\"Alchemy\",Profession2=\"Alchemy\"),244,180))","v":0},0,0,0,null,0,0,0,0,0,0,{"$f":"C209*10","v":0},{"$f":"(D209*15)","v":0}]
["Off","Flask of Titanic Strength",null,null,{"$f":"IF(A210=\"On\",300,0)","v":0},{"$f":"(E210*2)","v":0}]
["Off","Saronite Bomb",null,null,null,null,null,null,null,null,null,null,null,null,null,null,null,null,{"$f":"IF(AND(OR(Profession1=\"Engineering\",Profession2=\"Engineering\"),SaroniteBomb=\"On\"),(((AVERAGE(1150,1500) * CoE * Communion * (1 + ICCBuff)) * (Length / 60  * IF(SapperCharge=\"On\",(4/5),1))) / Length),0)","v":0}]
["Off","Global Thermal Sapper Charge",null,null,null,null,null,null,null,null,null,null,null,null,null,null,null,null,{"$f":"IF(AND(OR(Profession1=\"Engineering\",Profession2=\"Engineering\"),SapperCharge=\"On\"),(((AVERAGE(2188,2812) * CoE * Communion * (1 + ICCBuff)) * (Length / 300 )) / Length),0)","v":0}]
["Off","Broiled Dragon Feast",{"$f":"IF(A213=\"On\",60,0)","v":0},null,{"$f":"IF(A213=\"On\",60,0)","v":0},{"$f":"(E213*2)","v":0},null,0,null,null,null,null,null,0,null,null,{"$f":"C213*10","v":0}]
["Off","Seafood Magnifique Feast",{"$f":"IF(A214=\"On\",90,0)","v":0},null,{"$f":"IF(A214=\"On\",90,0)","v":0},{"$f":"(E214*2)","v":0},null,0,null,null,null,null,null,0,null,null,{"$f":"C214*10","v":0}]
["Off","Food",{"$f":"(IF(AND(A215<>\"Off\",A213=\"Off\",A214=\"Off\",A214=\"Off\"),90,0))","v":0},0,{"$f":"(IF(AND(A215=\"Str\",A213=\"Off\",A214=\"Off\"),90,0))","v":0},{"$f":"(E215*2)","v":0},0,{"$f":"(IF(AND(A215=\"Hit\",A213=\"Off\",A214=\"Off\"),90/H223,0))","v":0},{"$f":"(IF(AND(A215=\"Crit\",A213=\"Off\",A214=\"Off\"),90/I223,0))","v":0},{"$f":"(IF(AND(A215=\"Haste\",A213=\"Off\",A214=\"Off\"),90/J223,0))","v":0},{"$f":"(IF(AND(A215=\"Mastery\",A213=\"Off\",A214=\"Off\"),90/K223,0))","v":0},{"$f":"(IF(AND(A215=\"WE\",A213=\"Off\",A214=\"Off\"),90/L223,0))","v":0},0,{"$f":"(IF(AND(A215=\"Hit\",A213=\"Off\",A214=\"Off\"),90/N223,0))","v":0},0,0,{"$f":"C215*10","v":0},{"$f":"(D215*15)","v":0}]
["Off","Lay on Hands",null,null,null,null,null,null,null,null,null,null,null,null,null,null,null,{"$f":"IF(A216=\"On\",IF(GlyphOfDivinity=\"On\",10% * TotalMana,0),0)","v":0}]
[]
[null,"Graph Calc",null,null,null,null,null,null,null,null,null,null,null,null,null,null,null,null,null,null,null,null,null,"Weapon Speed",null,"DPS"]
[null,"Addition 1",null,null,0,null,0,0,0,0,0,0,0,null,null,null,null,null,null,null,null,null,null,null,0,0]
[null,"Addition 2",null,null,{"$f":"E219","v":0},{"$f":"(E219 * 2) + (2 * F219)","v":0},{"$f":"G219","v":0},{"$f":"H219 / H223","v":0},{"$f":"(G220 * G223) + (I219 / I223)","v":0},{"$f":"HeroHaste/J223","v":0},{"$f":"K219 / K223","v":0},{"$f":"L219 / L223","v":0},{"$f":"M219","v":0},{"$f":"H219 / N223","v":0},{"$f":"(D220 * D223) + (I219 / O223)","v":0},null,null,null,null,null,null,null,null,null,{"$f":"Y219/10","v":0},{"$f":"GraphWeapDPS","v":0}]
[]
[null,"Stat Conversions","Stam","Int","Str","AP","Agi","Hit","Crit","Haste","Mastery","WE","SpD","SpH","SpC","Mp5","Health","Mana"]
[null,"Level 85",null,2E-3,null,null,4.9199999999999999E-3,120.10899999999999,179.28,128.05700999999999,179.28,30.027200000000001,null,102.446,179.28]
[]
[]
[null,"Save / Load / Delete Functions"]
[]
[null,"Save Gearset :","Current"]
[]
[null,"Load / Delete Gearset :"]
[]
[]
[null,"Save Buffs :","25 Man"]
[]
[null,"Load / Delete Buffs :"]
[]
[]
[]
[]
[]
[]
[]
[]
[]
[]
[]
[]
[]
[]
[]
[]
[]
[]
[]
[]
[]
[]
[]
[]
[]
[]
[]
[]
[]
[]
[]
[]
[null,"MyHead","MyShoulder","MyChest","MyLegs","MyGloves","MyFeet","MyBelt","MyBracer","MyBack","MyNeck","MyRing1","MyRing2","MyTrinket1","mytrinket2","MyWeapon","my libram",null,null,null,null,null,"Consecration"]
[null,"None","None","None","None","None","None","None","None","None","None","None","None","None","None","None","None",null,null,null,null,null,"Crusader Strike"]
[null,{"$f":"IF(OR($H23<=0,$I23>0),\"None\",\"Reforge: Hit to Crit\")","v":"None"},{"$f":"IF(OR($H30<=0,$I30>0),\"None\",\"Reforge: Hit to Crit\")","v":"Reforge: Hit to Crit"},{"$f":"IF(OR($H37<=0,$I37>0),\"None\",\"Reforge: Hit to Crit\")","v":"None"},{"$f":"IF(OR($H44<=0,$I44>0),\"None\",\"Reforge: Hit to Crit\")","v":"None"},{"$f":"IF(OR($H51<=0,$I51>0),\"None\",\"Reforge: Hit to Crit\")","v":"Reforge: Hit to Crit"},{"$f":"IF(OR($H59<=0,$I59>0),\"None\",\"Reforge: Hit to Crit\")","v":"None"},{"$f":"IF(OR($H66<=0,$I66>0),\"None\",\"Reforge: Hit to Crit\")","v":"None"},{"$f":"IF(OR($H73<=0,$I73>0),\"None\",\"Reforge: Hit to Crit\")","v":"None"},{"$f":"IF(OR($H80<=0,$I80>0),\"None\",\"Reforge: Hit to Crit\")","v":"None"},{"$f":"IF(OR($H86<=0,$I86>0),\"None\",\"Reforge: Hit to Crit\")","v":"None"},{"$f":"IF(OR($H92<=0,$I92>0),\"None\",\"Reforge: Hit to Crit\")","v":"None"},{"$f":"IF(OR($H99<=0,$I99>0),\"None\",\"Reforge: Hit to Crit\")","v":"None"},{"$f":"IF(OR($H106<=0,$I106>0),\"None\",IF(Trinket1Bonus=\"Hit\",\"None\",\"Reforge: Hit to Crit\"))","v":"None"},{"$f":"IF(OR($H113<=0,$I113>0),\"None\",IF(Trinket2Bonus=\"Hit\",\"None\",\"Reforge: Hit to Crit\"))","v":"None"},{"$f":"IF(OR($H126<=0,$I126>0),\"None\",\"Reforge: Hit to Crit\")","v":"None"},{"$f":"IF(OR($H120<=0,$I120>0),\"None\",\"Reforge: Hit to Crit\")","v":"None"},null,null,null,null,null,"Exorcism"]
[null,{"$f":"IF(OR($H23<=0,$J23>0),\"None\",\"Reforge: Hit to Haste\")","v":"None"},{"$f":"IF(OR($H30<=0,$J30>0),\"None\",\"Reforge: Hit to Haste\")","v":"None"},{"$f":"IF(OR($H37<=0,$J37>0),\"None\",\"Reforge: Hit to Haste\")","v":"None"},{"$f":"IF(OR($H44<=0,$J44>0),\"None\",\"Reforge: Hit to Haste\")","v":"None"},{"$f":"IF(OR($H51<=0,$J51>0),\"None\",\"Reforge: Hit to Haste\")","v":"Reforge: Hit to Haste"},{"$f":"IF(OR($H59<=0,$J59>0),\"None\",\"Reforge: Hit to Haste\")","v":"None"},{"$f":"IF(OR($H66<=0,$J66>0),\"None\",\"Reforge: Hit to Haste\")","v":"Reforge: Hit to Haste"},{"$f":"IF(OR($H73<=0,$J73>0),\"None\",\"Reforge: Hit to Haste\")","v":"None"},{"$f":"IF(OR($H80<=0,$J80>0),\"None\",\"Reforge: Hit to Haste\")","v":"None"},{"$f":"IF(OR($H86<=0,$J86>0),\"None\",\"Reforge: Hit to Haste\")","v":"None"},{"$f":"IF(OR($H92<=0,$J92>0),\"None\",\"Reforge: Hit to Haste\")","v":"None"},{"$f":"IF(OR($H99<=0,$J99>0),\"None\",\"Reforge: Hit to Haste\")","v":"None"},{"$f":"IF(OR($H106<=0,$J106>0),\"None\",IF(Trinket1Bonus=\"Hit\",\"None\",\"Reforge: Hit to Haste\"))","v":"None"},{"$f":"IF(OR($H113<=0,$J113>0),\"None\",IF(Trinket2Bonus=\"Hit\",\"None\",\"Reforge: Hit to Haste\"))","v":"None"},{"$f":"IF(OR($H126<=0,$J126>0),\"None\",\"Reforge: Hit to Haste\")","v":"None"},{"$f":"IF(OR($H120<=0,$J120>0),\"None\",\"Reforge: Hit to Haste\")","v":"None"},null,null,null,null,null,"Hammer of Wrath"]
[null,{"$f":"IF(OR($H23<=0,$K23>0),\"None\",\"Reforge: Hit to Mastery\")","v":"None"},{"$f":"IF(OR($H30<=0,$K30>0),\"None\",\"Reforge: Hit to Mastery\")","v":"Reforge: Hit to Mastery"},{"$f":"IF(OR($H37<=0,$K37>0),\"None\",\"Reforge: Hit to Mastery\")","v":"None"},{"$f":"IF(OR($H44<=0,$K44>0),\"None\",\"Reforge: Hit to Mastery\")","v":"None"},{"$f":"IF(OR($H51<=0,$K51>0),\"None\",\"Reforge: Hit to Mastery\")","v":"None"},{"$f":"IF(OR($H59<=0,$K59>0),\"None\",\"Reforge: Hit to Mastery\")","v":"None"},{"$f":"IF(OR($H66<=0,$K66>0),\"None\",\"Reforge: Hit to Mastery\")","v":"Reforge: Hit to Mastery"},{"$f":"IF(OR($H73<=0,$K73>0),\"None\",\"Reforge: Hit to Mastery\")","v":"None"},{"$f":"IF(OR($H80<=0,$K80>0),\"None\",\"Reforge: Hit to Mastery\")","v":"None"},{"$f":"IF(OR($H86<=0,$K86>0),\"None\",\"Reforge: Hit to Mastery\")","v":"None"},{"$f":"IF(OR($H92<=0,$K92>0),\"None\",\"Reforge: Hit to Mastery\")","v":"None"},{"$f":"IF(OR($H99<=0,$K99>0),\"None\",\"Reforge: Hit to Mastery\")","v":"None"},{"$f":"IF(OR($H106<=0,$K106>0),\"None\",IF(Trinket1Bonus=\"Hit\",\"None\",\"Reforge: Hit to Mastery\"))","v":"None"},{"$f":"IF(OR($H113<=0,$K113>0),\"None\",IF(Trinket2Bonus=\"Hit\",\"None\",\"Reforge: Hit to Mastery\"))","v":"None"},{"$f":"IF(OR($H126<=0,$K126>0),\"None\",\"Reforge: Hit to Mastery\")","v":"None"},{"$f":"IF(OR($H120<=0,$K120>0),\"None\",\"Reforge: Hit to Mastery\")","v":"None"},null,null,null,null,null,"Holy Wrath"]
[null,{"$f":"IF(OR($H23<=0,$L23>0),\"None\",\"Reforge: Hit to Expertise\")","v":"None"},{"$f":"IF(OR($H30<=0,$L30>0),\"None\",\"Reforge: Hit to Expertise\")","v":"Reforge: Hit to Expertise"},{"$f":"IF(OR($H37<=0,$L37>0),\"None\",\"Reforge: Hit to Expertise\")","v":"None"},{"$f":"IF(OR($H44<=0,$L44>0),\"None\",\"Reforge: Hit to Expertise\")","v":"None"},{"$f":"IF(OR($H51<=0,$L51>0),\"None\",\"Reforge: Hit to Expertise\")","v":"Reforge: Hit to Expertise"},{"$f":"IF(OR($H59<=0,$L59>0),\"None\",\"Reforge: Hit to Expertise\")","v":"None"},{"$f":"IF(OR($H66<=0,$L66>0),\"None\",\"Reforge: Hit to Expertise\")","v":"Reforge: Hit to Expertise"},{"$f":"IF(OR($H73<=0,$L73>0),\"None\",\"Reforge: Hit to Expertise\")","v":"None"},{"$f":"IF(OR($H80<=0,$L80>0),\"None\",\"Reforge: Hit to Expertise\")","v":"None"},{"$f":"IF(OR($H86<=0,$L86>0),\"None\",\"Reforge: Hit to Expertise\")","v":"None"},{"$f":"IF(OR($H92<=0,$L92>0),\"None\",\"Reforge: Hit to Expertise\")","v":"None"},{"$f":"IF(OR($H99<=0,$L99>0),\"None\",\"Reforge: Hit to Expertise\")","v":"None"},{"$f":"IF(OR($H106<=0,$L106>0),\"None\",IF(Trinket1Bonus=\"Hit\",\"None\",\"Reforge: Hit to Expertise\"))","v":"None"},{"$f":"IF(OR($H113<=0,$L113>0),\"None\",IF(Trinket2Bonus=\"Hit\",\"None\",\"Reforge: Hit to Expertise\"))","v":"None"},{"$f":"IF(OR($H126<=0,$L126>0),\"None\",\"Reforge: Hit to Expertise\")","v":"None"},{"$f":"IF(OR($H120<=0,$L120>0),\"None\",\"Reforge: Hit to Expertise\")","v":"None"},null,null,null,null,null,{"$f":"IF(SealSelection=\"SoT\",\"Judgement of Truth\",\"Judgement of Righteousness\")","v":"Judgement of Truth"}]
[null,{"$f":"IF(OR($I23<=0,$H23>0),\"None\",\"Reforge: Crit to Hit\")","v":"None"},{"$f":"IF(OR($I30<=0,$H30>0),\"None\",\"Reforge: Crit to Hit\")","v":"None"},{"$f":"IF(OR($I37<=0,$H37>0),\"None\",\"Reforge: Crit to Hit\")","v":"None"},{"$f":"IF(OR($I44<=0,$H44>0),\"None\",\"Reforge: Crit to Hit\")","v":"Reforge: Crit to Hit"},{"$f":"IF(OR($I51<=0,$H51>0),\"None\",\"Reforge: Crit to Hit\")","v":"None"},{"$f":"IF(OR($I59<=0,$H59>0),\"None\",\"Reforge: Crit to Hit\")","v":"Reforge: Crit to Hit"},{"$f":"IF(OR($I66<=0,$H66>0),\"None\",\"Reforge: Crit to Hit\")","v":"None"},{"$f":"IF(OR($I73<=0,$H73>0),\"None\",\"Reforge: Crit to Hit\")","v":"Reforge: Crit to Hit"},{"$f":"IF(OR($I80<=0,$H80>0),\"None\",\"Reforge: Crit to Hit\")","v":"None"},{"$f":"IF(OR($I86<=0,$H86>0),\"None\",\"Reforge: Crit to Hit\")","v":"Reforge: Crit to Hit"},{"$f":"IF(OR($I92<=0,$H92>0),\"None\",\"Reforge: Crit to Hit\")","v":"Reforge: Crit to Hit"},{"$f":"IF(OR($I99<=0,$H99>0),\"None\",\"Reforge: Crit to Hit\")","v":"None"},{"$f":"IF(OR($I106<=0,$H106>0),\"None\",IF(Trinket1Bonus=\"Crit\",\"None\",\"Reforge: Crit to Hit\"))","v":"None"},{"$f":"IF(OR($I113<=0,$H113>0),\"None\",IF(Trinket2Bonus=\"Crit\",\"None\",\"Reforge: Crit to Hit\"))","v":"None"},{"$f":"IF(OR($I126<=0,$H126>0),\"None\",\"Reforge: Crit to Hit\")","v":"Reforge: Crit to Hit"},{"$f":"IF(OR($I120<=0,$H120>0),\"None\",\"Reforge: Crit to Hit\")","v":"Reforge: Crit to Hit"},null,null,null,null,null,"Templar's Verdict"]
[null,{"$f":"IF(OR($I23<=0,$J23>0),\"None\",\"Reforge: Crit to Haste\")","v":"None"},{"$f":"IF(OR($I30<=0,$J30>0),\"None\",\"Reforge: Crit to Haste\")","v":"None"},{"$f":"IF(OR($I37<=0,$J37>0),\"None\",\"Reforge: Crit to Haste\")","v":"None"},{"$f":"IF(OR($I44<=0,$J44>0),\"None\",\"Reforge: Crit to Haste\")","v":"Reforge: Crit to Haste"},{"$f":"IF(OR($I51<=0,$J51>0),\"None\",\"Reforge: Crit to Haste\")","v":"None"},{"$f":"IF(OR($I59<=0,$J59>0),\"None\",\"Reforge: Crit to Haste\")","v":"None"},{"$f":"IF(OR($I66<=0,$J66>0),\"None\",\"Reforge: Crit to Haste\")","v":"Reforge: Crit to Haste"},{"$f":"IF(OR($I73<=0,$J73>0),\"None\",\"Reforge: Crit to Haste\")","v":"None"},{"$f":"IF(OR($I80<=0,$J80>0),\"None\",\"Reforge: Crit to Haste\")","v":"None"},{"$f":"IF(OR($I86<=0,$J86>0),\"None\",\"Reforge: Crit to Haste\")","v":"None"},{"$f":"IF(OR($I92<=0,$J92>0),\"None\",\"Reforge: Crit to Haste\")","v":"None"},{"$f":"IF(OR($I99<=0,$J99>0),\"None\",\"Reforge: Crit to Haste\")","v":"None"},{"$f":"IF(OR($I106<=0,$J106>0),\"None\",IF(Trinket1Bonus=\"Crit\",\"None\",\"Reforge: Crit to Haste\"))","v":"None"},{"$f":"IF(OR($I113<=0,$J113>0),\"None\",IF(Trinket2Bonus=\"Crit\",\"None\",\"Reforge: Crit to Haste\"))","v":"None"},{"$f":"IF(OR($I126<=0,$J126>0),\"None\",\"Reforge: Crit to Haste\")","v":"None"},{"$f":"IF(OR($I120<=0,$J120>0),\"None\",\"Reforge: Crit to Haste\")","v":"None"}]
[null,{"$f":"IF(OR($I23<=0,$K23>0),\"None\",\"Reforge: Crit to Mastery\")","v":"None"},{"$f":"IF(OR($I30<=0,$K30>0),\"None\",\"Reforge: Crit to Mastery\")","v":"None"},{"$f":"IF(OR($I37<=0,$K37>0),\"None\",\"Reforge: Crit to Mastery\")","v":"None"},{"$f":"IF(OR($I44<=0,$K44>0),\"None\",\"Reforge: Crit to Mastery\")","v":"None"},{"$f":"IF(OR($I51<=0,$K51>0),\"None\",\"Reforge: Crit to Mastery\")","v":"None"},{"$f":"IF(OR($I59<=0,$K59>0),\"None\",\"Reforge: Crit to Mastery\")","v":"Reforge: Crit to Mastery"},{"$f":"IF(OR($I66<=0,$K66>0),\"None\",\"Reforge: Crit to Mastery\")","v":"Reforge: Crit to Mastery"},{"$f":"IF(OR($I73<=0,$K73>0),\"None\",\"Reforge: Crit to Mastery\")","v":"Reforge: Crit to Mastery"},{"$f":"IF(OR($I80<=0,$K80>0),\"None\",\"Reforge: Crit to Mastery\")","v":"None"},{"$f":"IF(OR($I86<=0,$K86>0),\"None\",\"Reforge: Crit to Mastery\")","v":"Reforge: Crit to Mastery"},{"$f":"IF(OR($I92<=0,$K92>0),\"None\",\"Reforge: Crit to Mastery\")","v":"Reforge: Crit to Mastery"},{"$f":"IF(OR($I99<=0,$K99>0),\"None\",\"Reforge: Crit to Mastery\")","v":"None"},{"$f":"IF(OR($I106<=0,$K106>0),\"None\",IF(Trinket1Bonus=\"Crit\",\"None\",\"Reforge: Crit to Mastery\"))","v":"None"},{"$f":"IF(OR($I113<=0,$K113>0),\"None\",IF(Trinket2Bonus=\"Crit\",\"None\",\"Reforge: Crit to Mastery\"))","v":"None"},{"$f":"IF(OR($I126<=0,$K126>0),\"None\",\"Reforge: Crit to Mastery\")","v":"Reforge: Crit to Mastery"},{"$f":"IF(OR($I120<=0,$K120>0),\"None\",\"Reforge: Crit to Mastery\")","v":"Reforge: Crit to Mastery"}]
[null,{"$f":"IF(OR($I23<=0,$L23>0),\"None\",\"Reforge: Crit to Expertise\")","v":"None"},{"$f":"IF(OR($I30<=0,$L30>0),\"None\",\"Reforge: Crit to Expertise\")","v":"None"},{"$f":"IF(OR($I37<=0,$L37>0),\"None\",\"Reforge: Crit to Expertise\")","v":"None"},{"$f":"IF(OR($I44<=0,$L44>0),\"None\",\"Reforge: Crit to Expertise\")","v":"Reforge: Crit to Expertise"},{"$f":"IF(OR($I51<=0,$L51>0),\"None\",\"Reforge: Crit to Expertise\")","v":"None"},{"$f":"IF(OR($I59<=0,$L59>0),\"None\",\"Reforge: Crit to Expertise\")","v":"Reforge: Crit to Expertise"},{"$f":"IF(OR($I66<=0,$L66>0),\"None\",\"Reforge: Crit to Expertise\")","v":"Reforge: Crit to Expertise"},{"$f":"IF(OR($I73<=0,$L73>0),\"None\",\"Reforge: Crit to Expertise\")","v":"Reforge: Crit to Expertise"},{"$f":"IF(OR($I80<=0,$L80>0),\"None\",\"Reforge: Crit to Expertise\")","v":"None"},{"$f":"IF(OR($I86<=0,$L86>0),\"None\",\"Reforge: Crit to Expertise\")","v":"Reforge: Crit to Expertise"},{"$f":"IF(OR($I92<=0,$L92>0),\"None\",\"Reforge: Crit to Expertise\")","v":"Reforge: Crit to Expertise"},{"$f":"IF(OR($I99<=0,$L99>0),\"None\",\"Reforge: Crit to Expertise\")","v":"None"},{"$f":"IF(OR($I106<=0,$L106>0),\"None\",IF(Trinket1Bonus=\"Crit\",\"None\",\"Reforge: Crit to Expertise\"))","v":"None"},{"$f":"IF(OR($I113<=0,$L113>0),\"None\",IF(Trinket2Bonus=\"Crit\",\"None\",\"Reforge: Crit to Expertise\"))","v":"None"},{"$f":"IF(OR($I126<=0,$L126>0),\"None\",\"Reforge: Crit to Expertise\")","v":"Reforge: Crit to Expertise"},{"$f":"IF(OR($I120<=0,$L120>0),\"None\",\"Reforge: Crit to Expertise\")","v":"Reforge: Crit to Expertise"}]
[null,{"$f":"IF(OR($J23<=0,$H23>0),\"None\",\"Reforge: Haste to Hit\")","v":"Reforge: Haste to Hit"},{"$f":"IF(OR($J30<=0,$H30>0),\"None\",\"Reforge: Haste to Hit\")","v":"None"},{"$f":"IF(OR($J37<=0,$H37>0),\"None\",\"Reforge: Haste to Hit\")","v":"Reforge: Haste to Hit"},{"$f":"IF(OR($J44<=0,$H44>0),\"None\",\"Reforge: Haste to Hit\")","v":"None"},{"$f":"IF(OR($J51<=0,$H51>0),\"None\",\"Reforge: Haste to Hit\")","v":"None"},{"$f":"IF(OR($J59<=0,$H59>0),\"None\",\"Reforge: Haste to Hit\")","v":"Reforge: Haste to Hit"},{"$f":"IF(OR($J66<=0,$H66>0),\"None\",\"Reforge: Haste to Hit\")","v":"None"},{"$f":"IF(OR($J73<=0,$H73>0),\"None\",\"Reforge: Haste to Hit\")","v":"Reforge: Haste to Hit"},{"$f":"IF(OR($J80<=0,$H80>0),\"None\",\"Reforge: Haste to Hit\")","v":"Reforge: Haste to Hit"},{"$f":"IF(OR($J86<=0,$H86>0),\"None\",\"Reforge: Haste to Hit\")","v":"Reforge: Haste to Hit"},{"$f":"IF(OR($J92<=0,$H92>0),\"None\",\"Reforge: Haste to Hit\")","v":"Reforge: Haste to Hit"},{"$f":"IF(OR($J99<=0,$H99>0),\"None\",\"Reforge: Haste to Hit\")","v":"Reforge: Haste to Hit"},{"$f":"IF(OR($J106<=0,$H106>0),\"None\",IF(Trinket1Bonus=\"Haste\",\"None\",\"Reforge: Haste to Hit\"))","v":"None"},{"$f":"IF(OR($J113<=0,$H113>0),\"None\",IF(Trinket2Bonus=\"Haste\",\"None\",\"Reforge: Haste to Hit\"))","v":"None"},{"$f":"IF(OR($J126<=0,$H126>0),\"None\",\"Reforge: Haste to Hit\")","v":"Reforge: Haste to Hit"},{"$f":"IF(OR($J120<=0,$H120>0),\"None\",\"Reforge: Haste to Hit\")","v":"Reforge: Haste to Hit"}]
[null,{"$f":"IF(OR($J23<=0,$I23>0),\"None\",\"Reforge: Haste to Crit\")","v":"Reforge: Haste to Crit"},{"$f":"IF(OR($J30<=0,$I30>0),\"None\",\"Reforge: Haste to Crit\")","v":"Reforge: Haste to Crit"},{"$f":"IF(OR($J37<=0,$I37>0),\"None\",\"Reforge: Haste to Crit\")","v":"Reforge: Haste to Crit"},{"$f":"IF(OR($J44<=0,$I44>0),\"None\",\"Reforge: Haste to Crit\")","v":"None"},{"$f":"IF(OR($J51<=0,$I51>0),\"None\",\"Reforge: Haste to Crit\")","v":"None"},{"$f":"IF(OR($J59<=0,$I59>0),\"None\",\"Reforge: Haste to Crit\")","v":"None"},{"$f":"IF(OR($J66<=0,$I66>0),\"None\",\"Reforge: Haste to Crit\")","v":"None"},{"$f":"IF(OR($J73<=0,$I73>0),\"None\",\"Reforge: Haste to Crit\")","v":"None"},{"$f":"IF(OR($J80<=0,$I80>0),\"None\",\"Reforge: Haste to Crit\")","v":"Reforge: Haste to Crit"},{"$f":"IF(OR($J86<=0,$I86>0),\"None\",\"Reforge: Haste to Crit\")","v":"None"},{"$f":"IF(OR($J92<=0,$I92>0),\"None\",\"Reforge: Haste to Crit\")","v":"None"},{"$f":"IF(OR($J99<=0,$I99>0),\"None\",\"Reforge: Haste to Crit\")","v":"Reforge: Haste to Crit"},{"$f":"IF(OR($J106<=0,$I106>0),\"None\",IF(Trinket1Bonus=\"Haste\",\"None\",\"Reforge: Haste to Crit\"))","v":"None"},{"$f":"IF(OR($J113<=0,$I113>0),\"None\",IF(Trinket2Bonus=\"Haste\",\"None\",\"Reforge: Haste to Crit\"))","v":"None"},{"$f":"IF(OR($J126<=0,$I126>0),\"None\",\"Reforge: Haste to Crit\")","v":"None"},{"$f":"IF(OR($J120<=0,$I120>0),\"None\",\"Reforge: Haste to Crit\")","v":"None"}]
[null,{"$f":"IF(OR($J23<=0,$K23>0),\"None\",\"Reforge: Haste to Mastery\")","v":"Reforge: Haste to Mastery"},{"$f":"IF(OR($J30<=0,$K30>0),\"None\",\"Reforge: Haste to Mastery\")","v":"Reforge: Haste to Mastery"},{"$f":"IF(OR($J37<=0,$K37>0),\"None\",\"Reforge: Haste to Mastery\")","v":"Reforge: Haste to Mastery"},{"$f":"IF(OR($J44<=0,$K44>0),\"None\",\"Reforge: Haste to Mastery\")","v":"None"},{"$f":"IF(OR($J51<=0,$K51>0),\"None\",\"Reforge: Haste to Mastery\")","v":"None"},{"$f":"IF(OR($J59<=0,$K59>0),\"None\",\"Reforge: Haste to Mastery\")","v":"Reforge: Haste to Mastery"},{"$f":"IF(OR($J66<=0,$K66>0),\"None\",\"Reforge: Haste to Mastery\")","v":"None"},{"$f":"IF(OR($J73<=0,$K73>0),\"None\",\"Reforge: Haste to Mastery\")","v":"Reforge: Haste to Mastery"},{"$f":"IF(OR($J80<=0,$K80>0),\"None\",\"Reforge: Haste to Mastery\")","v":"Reforge: Haste to Mastery"},{"$f":"IF(OR($J86<=0,$K86>0),\"None\",\"Reforge: Haste to Mastery\")","v":"Reforge: Haste to Mastery"},{"$f":"IF(OR($J92<=0,$K92>0),\"None\",\"Reforge: Haste to Mastery\")","v":"Reforge: Haste to Mastery"},{"$f":"IF(OR($J99<=0,$K99>0),\"None\",\"Reforge: Haste to Mastery\")","v":"Reforge: Haste to Mastery"},{"$f":"IF(OR($J106<=0,$K106>0),\"None\",IF(Trinket1Bonus=\"Haste\",\"None\",\"Reforge: Haste to Mastery\"))","v":"None"},{"$f":"IF(OR($J113<=0,$K113>0),\"None\",IF(Trinket2Bonus=\"Haste\",\"None\",\"Reforge: Haste to Mastery\"))","v":"None"},{"$f":"IF(OR($J126<=0,$K126>0),\"None\",\"Reforge: Haste to Mastery\")","v":"Reforge: Haste to Mastery"},{"$f":"IF(OR($J120<=0,$K120>0),\"None\",\"Reforge: Haste to Mastery\")","v":"Reforge: Haste to Mastery"}]
[null,{"$f":"IF(OR($J23<=0,$L23>0),\"None\",\"Reforge: Haste to Expertise\")","v":"None"},{"$f":"IF(OR($J30<=0,$L30>0),\"None\",\"Reforge: Haste to Expertise\")","v":"Reforge: Haste to Expertise"},{"$f":"IF(OR($J37<=0,$L37>0),\"None\",\"Reforge: Haste to Expertise\")","v":"None"},{"$f":"IF(OR($J44<=0,$L44>0),\"None\",\"Reforge: Haste to Expertise\")","v":"None"},{"$f":"IF(OR($J51<=0,$L51>0),\"None\",\"Reforge: Haste to Expertise\")","v":"None"},{"$f":"IF(OR($J59<=0,$L59>0),\"None\",\"Reforge: Haste to Expertise\")","v":"Reforge: Haste to Expertise"},{"$f":"IF(OR($J66<=0,$L66>0),\"None\",\"Reforge: Haste to Expertise\")","v":"None"},{"$f":"IF(OR($J73<=0,$L73>0),\"None\",\"Reforge: Haste to Expertise\")","v":"Reforge: Haste to Expertise"},{"$f":"IF(OR($J80<=0,$L80>0),\"None\",\"Reforge: Haste to Expertise\")","v":"None"},{"$f":"IF(OR($J86<=0,$L86>0),\"None\",\"Reforge: Haste to Expertise\")","v":"Reforge: Haste to Expertise"},{"$f":"IF(OR($J92<=0,$L92>0),\"None\",\"Reforge: Haste to Expertise\")","v":"Reforge: Haste to Expertise"},{"$f":"IF(OR($J99<=0,$L99>0),\"None\",\"Reforge: Haste to Expertise\")","v":"None"},{"$f":"IF(OR($J106<=0,$L106>0),\"None\",IF(Trinket1Bonus=\"Haste\",\"None\",\"Reforge: Haste to Expertise\"))","v":"None"},{"$f":"IF(OR($J113<=0,$L113>0),\"None\",IF(Trinket2Bonus=\"Haste\",\"None\",\"Reforge: Haste to Expertise\"))","v":"None"},{"$f":"IF(OR($J126<=0,$L126>0),\"None\",\"Reforge: Haste to Expertise\")","v":"Reforge: Haste to Expertise"},{"$f":"IF(OR($J120<=0,$L120>0),\"None\",\"Reforge: Haste to Expertise\")","v":"Reforge: Haste to Expertise"}]
[null,{"$f":"IF(OR($K23<=0,$H23>0),\"None\",\"Reforge: Mastery to Hit\")","v":"None"},{"$f":"IF(OR($K30<=0,$H30>0),\"None\",\"Reforge: Mastery to Hit\")","v":"None"},{"$f":"IF(OR($K37<=0,$H37>0),\"None\",\"Reforge: Mastery to Hit\")","v":"None"},{"$f":"IF(OR($K44<=0,$H44>0),\"None\",\"Reforge: Mastery to Hit\")","v":"Reforge: Mastery to Hit"},{"$f":"IF(OR($K51<=0,$H51>0),\"None\",\"Reforge: Mastery to Hit\")","v":"None"},{"$f":"IF(OR($K59<=0,$H59>0),\"None\",\"Reforge: Mastery to Hit\")","v":"None"},{"$f":"IF(OR($K66<=0,$H66>0),\"None\",\"Reforge: Mastery to Hit\")","v":"None"},{"$f":"IF(OR($K73<=0,$H73>0),\"None\",\"Reforge: Mastery to Hit\")","v":"None"},{"$f":"IF(OR($K80<=0,$H80>0),\"None\",\"Reforge: Mastery to Hit\")","v":"None"},{"$f":"IF(OR($K86<=0,$H86>0),\"None\",\"Reforge: Mastery to Hit\")","v":"None"},{"$f":"IF(OR($K92<=0,$H92>0),\"None\",\"Reforge: Mastery to Hit\")","v":"None"},{"$f":"IF(OR($K99<=0,$H99>0),\"None\",\"Reforge: Mastery to Hit\")","v":"None"},{"$f":"IF(OR($K106<=0,$H106>0),\"None\",IF(Trinket1Bonus=\"Mastery\",\"None\",\"Reforge: Mastery to Hit\"))","v":"Reforge: Mastery to Hit"},{"$f":"IF(OR($K113<=0,$H113>0),\"None\",IF(Trinket2Bonus=\"Mastery\",\"None\",\"Reforge: Mastery to Hit\"))","v":"None"},{"$f":"IF(OR($K126<=0,$H126>0),\"None\",\"Reforge: Mastery to Hit\")","v":"None"},{"$f":"IF(OR($K120<=0,$H120>0),\"None\",\"Reforge: Mastery to Hit\")","v":"None"}]
[null,{"$f":"IF(OR($K23<=0,$I23>0),\"None\",\"Reforge: Mastery to Crit\")","v":"None"},{"$f":"IF(OR($K30<=0,$I30>0),\"None\",\"Reforge: Mastery to Crit\")","v":"None"},{"$f":"IF(OR($K37<=0,$I37>0),\"None\",\"Reforge: Mastery to Crit\")","v":"None"},{"$f":"IF(OR($K44<=0,$I44>0),\"None\",\"Reforge: Mastery to Crit\")","v":"None"},{"$f":"IF(OR($K51<=0,$I51>0),\"None\",\"Reforge: Mastery to Crit\")","v":"Reforge: Mastery to Crit"},{"$f":"IF(OR($K59<=0,$I59>0),\"None\",\"Reforge: Mastery to Crit\")","v":"None"},{"$f":"IF(OR($K66<=0,$I66>0),\"None\",\"Reforge: Mastery to Crit\")","v":"None"},{"$f":"IF(OR($K73<=0,$I73>0),\"None\",\"Reforge: Mastery to Crit\")","v":"None"},{"$f":"IF(OR($K80<=0,$I80>0),\"None\",\"Reforge: Mastery to Crit\")","v":"None"},{"$f":"IF(OR($K86<=0,$I86>0),\"None\",\"Reforge: Mastery to Crit\")","v":"None"},{"$f":"IF(OR($K92<=0,$I92>0),\"None\",\"Reforge: Mastery to Crit\")","v":"None"},{"$f":"IF(OR($K99<=0,$I99>0),\"None\",\"Reforge: Mastery to Crit\")","v":"None"},{"$f":"IF(OR($K106<=0,$I106>0),\"None\",IF(Trinket1Bonus=\"Mastery\",\"None\",\"Reforge: Mastery to Crit\"))","v":"Reforge: Mastery to Crit"},{"$f":"IF(OR($K113<=0,$I113>0),\"None\",IF(Trinket2Bonus=\"Mastery\",\"None\",\"Reforge: Mastery to Crit\"))","v":"None"},{"$f":"IF(OR($K126<=0,$I126>0),\"None\",\"Reforge: Mastery to Crit\")","v":"None"},{"$f":"IF(OR($K120<=0,$I120>0),\"None\",\"Reforge: Mastery to Crit\")","v":"None"}]
[null,{"$f":"IF(OR($K23<=0,$J23>0),\"None\",\"Reforge: Mastery to Haste\")","v":"None"},{"$f":"IF(OR($K30<=0,$J30>0),\"None\",\"Reforge: Mastery to Haste\")","v":"None"},{"$f":"IF(OR($K37<=0,$J37>0),\"None\",\"Reforge: Mastery to Haste\")","v":"None"},{"$f":"IF(OR($K44<=0,$J44>0),\"None\",\"Reforge: Mastery to Haste\")","v":"Reforge: Mastery to Haste"},{"$f":"IF(OR($K51<=0,$J51>0),\"None\",\"Reforge: Mastery to Haste\")","v":"Reforge: Mastery to Haste"},{"$f":"IF(OR($K59<=0,$J59>0),\"None\",\"Reforge: Mastery to Haste\")","v":"None"},{"$f":"IF(OR($K66<=0,$J66>0),\"None\",\"Reforge: Mastery to Haste\")","v":"None"},{"$f":"IF(OR($K73<=0,$J73>0),\"None\",\"Reforge: Mastery to Haste\")","v":"None"},{"$f":"IF(OR($K80<=0,$J80>0),\"None\",\"Reforge: Mastery to Haste\")","v":"None"},{"$f":"IF(OR($K86<=0,$J86>0),\"None\",\"Reforge: Mastery to Haste\")","v":"None"},{"$f":"IF(OR($K92<=0,$J92>0),\"None\",\"Reforge: Mastery to Haste\")","v":"None"},{"$f":"IF(OR($K99<=0,$J99>0),\"None\",\"Reforge: Mastery to Haste\")","v":"None"},{"$f":"IF(OR($K106<=0,$J106>0),\"None\",IF(Trinket1Bonus=\"Mastery\",\"None\",\"Reforge: Mastery to Haste\"))","v":"Reforge: Mastery to Haste"},{"$f":"IF(OR($K113<=0,$J113>0),\"None\",IF(Trinket2Bonus=\"Mastery\",\"None\",\"Reforge: Mastery to Haste\"))","v":"None"},{"$f":"IF(OR($K126<=0,$J126>0),\"None\",\"Reforge: Mastery to Haste\")","v":"None"},{"$f":"IF(OR($K120<=0,$J120>0),\"None\",\"Reforge: Mastery to Haste\")","v":"None"}]
[null,{"$f":"IF(OR($K23<=0,$L23>0),\"None\",\"Reforge: Mastery to Expertise\")","v":"None"},{"$f":"IF(OR($K30<=0,$L30>0),\"None\",\"Reforge: Mastery to Expertise\")","v":"None"},{"$f":"IF(OR($K37<=0,$L37>0),\"None\",\"Reforge: Mastery to Expertise\")","v":"None"},{"$f":"IF(OR($K44<=0,$L44>0),\"None\",\"Reforge: Mastery to Expertise\")","v":"Reforge: Mastery to Expertise"},{"$f":"IF(OR($K51<=0,$L51>0),\"None\",\"Reforge: Mastery to Expertise\")","v":"Reforge: Mastery to Expertise"},{"$f":"IF(OR($K59<=0,$L59>0),\"None\",\"Reforge: Mastery to Expertise\")","v":"None"},{"$f":"IF(OR($K66<=0,$L66>0),\"None\",\"Reforge: Mastery to Expertise\")","v":"None"},{"$f":"IF(OR($K73<=0,$L73>0),\"None\",\"Reforge: Mastery to Expertise\")","v":"None"},{"$f":"IF(OR($K80<=0,$L80>0),\"None\",\"Reforge: Mastery to Expertise\")","v":"None"},{"$f":"IF(OR($K86<=0,$L86>0),\"None\",\"Reforge: Mastery to Expertise\")","v":"None"},{"$f":"IF(OR($K92<=0,$L92>0),\"None\",\"Reforge: Mastery to Expertise\")","v":"None"},{"$f":"IF(OR($K99<=0,$L99>0),\"None\",\"Reforge: Mastery to Expertise\")","v":"None"},{"$f":"IF(OR($K106<=0,$L106>0),\"None\",IF(Trinket1Bonus=\"Mastery\",\"None\",\"Reforge: Mastery to Expertise\"))","v":"Reforge: Mastery to Expertise"},{"$f":"IF(OR($K113<=0,$L113>0),\"None\",IF(Trinket2Bonus=\"Mastery\",\"None\",\"Reforge: Mastery to Expertise\"))","v":"None"},{"$f":"IF(OR($K126<=0,$L126>0),\"None\",\"Reforge: Mastery to Expertise\")","v":"None"},{"$f":"IF(OR($K120<=0,$L120>0),\"None\",\"Reforge: Mastery to Expertise\")","v":"None"}]
[null,{"$f":"IF(OR($L23<=0,$H23>0),\"None\",\"Reforge: Expertise to Hit\")","v":"Reforge: Expertise to Hit"},{"$f":"IF(OR($L30<=0,$H30>0),\"None\",\"Reforge: Expertise to Hit\")","v":"None"},{"$f":"IF(OR($L37<=0,$H37>0),\"None\",\"Reforge: Expertise to Hit\")","v":"Reforge: Expertise to Hit"},{"$f":"IF(OR($L44<=0,$H44>0),\"None\",\"Reforge: Expertise to Hit\")","v":"None"},{"$f":"IF(OR($L51<=0,$H51>0),\"None\",\"Reforge: Expertise to Hit\")","v":"None"},{"$f":"IF(OR($L59<=0,$H59>0),\"None\",\"Reforge: Expertise to Hit\")","v":"None"},{"$f":"IF(OR($L66<=0,$H66>0),\"None\",\"Reforge: Expertise to Hit\")","v":"None"},{"$f":"IF(OR($L73<=0,$H73>0),\"None\",\"Reforge: Expertise to Hit\")","v":"None"},{"$f":"IF(OR($L80<=0,$H80>0),\"None\",\"Reforge: Expertise to Hit\")","v":"Reforge: Expertise to Hit"},{"$f":"IF(OR($L86<=0,$H86>0),\"None\",\"Reforge: Expertise to Hit\")","v":"None"},{"$f":"IF(OR($L92<=0,$H92>0),\"None\",\"Reforge: Expertise to Hit\")","v":"None"},{"$f":"IF(OR($L99<=0,$H99>0),\"None\",\"Reforge: Expertise to Hit\")","v":"Reforge: Expertise to Hit"},{"$f":"IF(OR($L106<=0,$H106>0),\"None\",IF(Trinket1Bonus=\"WE\",\"None\",\"Reforge: Expertise to Hit\"))","v":"None"},{"$f":"IF(OR($L113<=0,$H113>0),\"None\",IF(Trinket2Bonus=\"WE\",\"None\",\"Reforge: Expertise to Hit\"))","v":"None"},{"$f":"IF(OR($L126<=0,$H126>0),\"None\",\"Reforge: Expertise to Hit\")","v":"None"},{"$f":"IF(OR($L120<=0,$H120>0),\"None\",\"Reforge: Expertise to Hit\")","v":"None"}]
[null,{"$f":"IF(OR($L23<=0,$I23>0),\"None\",\"Reforge: Expertise to Crit\")","v":"Reforge: Expertise to Crit"},{"$f":"IF(OR($L30<=0,$I30>0),\"None\",\"Reforge: Expertise to Crit\")","v":"None"},{"$f":"IF(OR($L37<=0,$I37>0),\"None\",\"Reforge: Expertise to Crit\")","v":"Reforge: Expertise to Crit"},{"$f":"IF(OR($L44<=0,$I44>0),\"None\",\"Reforge: Expertise to Crit\")","v":"None"},{"$f":"IF(OR($L51<=0,$I51>0),\"None\",\"Reforge: Expertise to Crit\")","v":"None"},{"$f":"IF(OR($L59<=0,$I59>0),\"None\",\"Reforge: Expertise to Crit\")","v":"None"},{"$f":"IF(OR($L66<=0,$I66>0),\"None\",\"Reforge: Expertise to Crit\")","v":"None"},{"$f":"IF(OR($L73<=0,$I73>0),\"None\",\"Reforge: Expertise to Crit\")","v":"None"},{"$f":"IF(OR($L80<=0,$I80>0),\"None\",\"Reforge: Expertise to Crit\")","v":"Reforge: Expertise to Crit"},{"$f":"IF(OR($L86<=0,$I86>0),\"None\",\"Reforge: Expertise to Crit\")","v":"None"},{"$f":"IF(OR($L92<=0,$I92>0),\"None\",\"Reforge: Expertise to Crit\")","v":"None"},{"$f":"IF(OR($L99<=0,$I99>0),\"None\",\"Reforge: Expertise to Crit\")","v":"Reforge: Expertise to Crit"},{"$f":"IF(OR($L106<=0,$I106>0),\"None\",IF(Trinket1Bonus=\"WE\",\"None\",\"Reforge: Expertise to Crit\"))","v":"None"},{"$f":"IF(OR($L113<=0,$I113>0),\"None\",IF(Trinket2Bonus=\"WE\",\"None\",\"Reforge: Expertise to Crit\"))","v":"None"},{"$f":"IF(OR($L126<=0,$I126>0),\"None\",\"Reforge: Expertise to Crit\")","v":"None"},{"$f":"IF(OR($L120<=0,$I120>0),\"None\",\"Reforge: Expertise to Crit\")","v":"None"}]
[null,{"$f":"IF(OR($L23<=0,$J23>0),\"None\",\"Reforge: Expertise to Haste\")","v":"None"},{"$f":"IF(OR($L30<=0,$J30>0),\"None\",\"Reforge: Expertise to Haste\")","v":"None"},{"$f":"IF(OR($L37<=0,$J37>0),\"None\",\"Reforge: Expertise to Haste\")","v":"None"},{"$f":"IF(OR($L44<=0,$J44>0),\"None\",\"Reforge: Expertise to Haste\")","v":"None"},{"$f":"IF(OR($L51<=0,$J51>0),\"None\",\"Reforge: Expertise to Haste\")","v":"None"},{"$f":"IF(OR($L59<=0,$J59>0),\"None\",\"Reforge: Expertise to Haste\")","v":"None"},{"$f":"IF(OR($L66<=0,$J66>0),\"None\",\"Reforge: Expertise to Haste\")","v":"None"},{"$f":"IF(OR($L73<=0,$J73>0),\"None\",\"Reforge: Expertise to Haste\")","v":"None"},{"$f":"IF(OR($L80<=0,$J80>0),\"None\",\"Reforge: Expertise to Haste\")","v":"None"},{"$f":"IF(OR($L86<=0,$J86>0),\"None\",\"Reforge: Expertise to Haste\")","v":"None"},{"$f":"IF(OR($L92<=0,$J92>0),\"None\",\"Reforge: Expertise to Haste\")","v":"None"},{"$f":"IF(OR($L99<=0,$J99>0),\"None\",\"Reforge: Expertise to Haste\")","v":"None"},{"$f":"IF(OR($L106<=0,$J106>0),\"None\",IF(Trinket1Bonus=\"WE\",\"None\",\"Reforge: Expertise to Haste\"))","v":"None"},{"$f":"IF(OR($L113<=0,$J113>0),\"None\",IF(Trinket2Bonus=\"WE\",\"None\",\"Reforge: Expertise to Haste\"))","v":"None"},{"$f":"IF(OR($L126<=0,$J126>0),\"None\",\"Reforge: Expertise to Haste\")","v":"None"},{"$f":"IF(OR($L120<=0,$J120>0),\"None\",\"Reforge: Expertise to Haste\")","v":"None"}]
[null,{"$f":"IF(OR($L23<=0,$K23>0),\"None\",\"Reforge: Expertise to Mastery\")","v":"Reforge: Expertise to Mastery"},{"$f":"IF(OR($L30<=0,$K30>0),\"None\",\"Reforge: Expertise to Mastery\")","v":"None"},{"$f":"IF(OR($L37<=0,$K37>0),\"None\",\"Reforge: Expertise to Mastery\")","v":"Reforge: Expertise to Mastery"},{"$f":"IF(OR($L44<=0,$K44>0),\"None\",\"Reforge: Expertise to Mastery\")","v":"None"},{"$f":"IF(OR($L51<=0,$K51>0),\"None\",\"Reforge: Expertise to Mastery\")","v":"None"},{"$f":"IF(OR($L59<=0,$K59>0),\"None\",\"Reforge: Expertise to Mastery\")","v":"None"},{"$f":"IF(OR($L66<=0,$K66>0),\"None\",\"Reforge: Expertise to Mastery\")","v":"None"},{"$f":"IF(OR($L73<=0,$K73>0),\"None\",\"Reforge: Expertise to Mastery\")","v":"None"},{"$f":"IF(OR($L80<=0,$K80>0),\"None\",\"Reforge: Expertise to Mastery\")","v":"Reforge: Expertise to Mastery"},{"$f":"IF(OR($L86<=0,$K86>0),\"None\",\"Reforge: Expertise to Mastery\")","v":"None"},{"$f":"IF(OR($L92<=0,$K92>0),\"None\",\"Reforge: Expertise to Mastery\")","v":"None"},{"$f":"IF(OR($L99<=0,$K99>0),\"None\",\"Reforge: Expertise to Mastery\")","v":"Reforge: Expertise to Mastery"},{"$f":"IF(OR($L106<=0,$K106>0),\"None\",IF(Trinket1Bonus=\"WE\",\"None\",\"Reforge: Expertise to Mastery\"))","v":"None"},{"$f":"IF(OR($L113<=0,$K113>0),\"None\",IF(Trinket2Bonus=\"WE\",\"None\",\"Reforge: Expertise to Mastery\"))","v":"None"},{"$f":"IF(OR($L126<=0,$K126>0),\"None\",\"Reforge: Expertise to Mastery\")","v":"None"},{"$f":"IF(OR($L120<=0,$K120>0),\"None\",\"Reforge: Expertise to Mastery\")","v":"None"}]

{"sheet":"Item Calc","index":3,"n_rows":31,"n_cols":13,"rows_kept":31,"cut":false,"hidden":false,"merged":[[30,11,30,12]]}
[null,{"$f":"\"Individual Item Upgrade Analysis - Based on \" & SealSelection & \" Rotation\"","v":"Individual Item Upgrade Analysis - Based on SoT Rotation"},null,null,null,null,null,null,null,null,null,"Options Panel"]
[]
[null,"All"]
[]
[]
[null,null,null,null,null,null,null,null,null,null,null,"Misc Options:"]
[null,null,null,null,null,null,null,null,null,null,null,"Only Show Upgrades","Yes"]
[null,null,null,null,null,null,null,null,null,null,null,"Only Show Name & Dps Diff","Yes"]
[null,null,null,null,null,null,null,null,null,null,null,"Do not show items under iLevel",365]
[]
[null,null,null,null,null,null,null,null,null,null,null,"Show Loot of Rarity:"]
[null,null,null,null,null,null,null,null,null,null,null,"Epic","Yes"]
[null,null,null,null,null,null,null,null,null,null,null,"Rare","No"]
[]
[null,null,null,null,null,null,null,null,null,null,null,"Show Loot From:"]
[null,null,null,null,null,null,null,null,null,null,null,"Pre-Raid Dungeons","No"]
[null,null,null,null,null,null,null,null,null,null,null,"Quest","No"]
[null,null,null,null,null,null,null,null,null,null,null,"World Boss","No"]
[null,null,null,null,null,null,null,null,null,null,null,"World Drop","No"]
[null,null,null,null,null,null,null,null,null,null,null,"Vendor / Badge","Yes"]
[null,null,null,null,null,null,null,null,null,null,null,"Craftable","Yes"]
[null,null,null,null,null,null,null,null,null,null,null,"PvP","Yes"]
[null,null,null,null,null,null,null,null,null,null,null,"User Added","No"]
[null,null,null,null,null,null,null,null,null,null,null,"The Bastion of Twilight","No"]
[null,null,null,null,null,null,null,null,null,null,null,"Blackwing Descent","No"]
[null,null,null,null,null,null,null,null,null,null,null,"Throne of the Four Winds","No"]
[null,null,null,null,null,null,null,null,null,null,null,"Firelands","Yes"]
[]
[]
[]
[null,null,null,null,null,null,null,null,null,null,null,"Accuracy is to within approximately 5 DPS."]

{"sheet":"Reforge Calc","index":4,"n_rows":175,"n_cols":21,"rows_kept":175,"cut":false,"hidden":true,"merged":[[1,11,1,13],[0,7,0,9],[0,2,0,4],[20,11,20,13],[0,16,0,19],[99,2,99,4],[99,7,99,9],[99,16,99,19],[119,11,119,13],[100,11,100,13]]}
["Secondary Stat Priority",null,"Priority",null,null,null,null,"Priority",null,null,null,null,null,null,null,null,"Priority"]
["Mastery > Haste > Crit",null,{"$f":"IF(OR(A2=\"Crit > Haste > Mastery\",A2=\"Crit > Mastery > Haste\"),1,IF(OR(A2=\"Mastery > Crit > Haste\",A2=\"Haste > Crit > Mastery\"),2,3))","v":3},{"$f":"IF(OR(A2=\"Haste > Mastery > Crit\",A2=\"Haste > Crit > Mastery\"),1,IF(OR(A2=\"Crit > Haste > Mastery\",A2=\"Mastery > Haste > Crit\"),2,3))","v":2},{"$f":"IF(OR(A2=\"Mastery > Haste > Crit\",A2=\"Mastery > Crit > Haste\"),1,IF(OR(A2=\"Crit > Mastery > Haste\",A2=\"Haste > Mastery > Crit\"),2,3))","v":1},null,null,{"$f":"IF(OR(A2=\"Crit > Haste > Mastery\",A2=\"Crit > Mastery > Haste\"),1,IF(OR(A2=\"Mastery > Crit > Haste\",A2=\"Haste > Crit > Mastery\"),2,3))","v":3},{"$f":"IF(OR(A2=\"Haste > Mastery > Crit\",A2=\"Haste > Crit > Mastery\"),1,IF(OR(A2=\"Crit > Haste > Mastery\",A2=\"Mastery > Haste > Crit\"),2,3))","v":2},{"$f":"IF(OR(A2=\"Mastery > Haste > Crit\",A2=\"Mastery > Crit > Haste\"),1,IF(OR(A2=\"Crit > Mastery > Haste\",A2=\"Haste > Mastery > Crit\"),2,3))","v":1},null,"Hit",null,null,null,null,3,2,1]
["Gear","Hit","Crit","Haste","Mastery","WE","Hit","Crit","Haste","Mastery","WE","Unchanged","Min","Max",null,"Reforge for Hitcap",{"$f":"HLOOKUP(3,$H$2:$J$3,2,FALSE)","v":"Crit"},{"$f":"HLOOKUP(2,$H$2:$J$3,2,FALSE)","v":"Haste"},{"$f":"HLOOKUP(1,$H$2:$J$3,2,FALSE)","v":"Mastery"},"WE","Biggest Loser"]
[{"$f":"MyHead","v":"Reinforced Sapphirium Helmet"},{"$f":"IF(OR($A4=\"None\",ISBLANK($A4)),0,VLOOKUP($A4,ItemList,HLOOKUP(B$3,StatLoC,2,FALSE),FALSE))","v":0},0,228,0,168,{"$f":"ROUNDUP((B4*0.6),0)","v":0},{"$f":"ROUNDDOWN((C4*0.4),0)","v":0},{"$f":"ROUNDDOWN((D4*0.4),0)","v":91},0,67,{"$f":"IF(B4=0,0,N4)","v":0},{"$f":"IF(G4>0,G4,LARGE(H4:K4,2))","v":67},{"$f":"IF(G4>0,B4,MAX(H4:K4))","v":91},67,{"$f":"IF(O4=L4,\"None\",IF(O4=G4,\"Reforge: Hit to \",CONCATENATE(\"Reforge: \",U4,\" to Hit\")))","v":"Reforge: Expertise to Hit"},{"$f":"IF(HLOOKUP(3,$H$2:$J$19,3,FALSE)=$O4,$Q$3,FALSE)","v":false},{"$f":"IF(HLOOKUP(2,$H$2:$J$19,3,FALSE)=$O4,$R$3,FALSE)","v":false},{"$f":"IF(HLOOKUP(1,$H$2:$J$19,3,FALSE)=$O4,$S$3,FALSE)","v":false},{"$f":"IF(K4=$O4,\"Expertise\",FALSE)","v":"Expertise"},{"$f":"IF(AND(Q4=FALSE,R4=FALSE,S4=FALSE),T4,IF(AND(Q4=FALSE,R4=FALSE),S4,IF(Q4=FALSE,R4,Q4)))","v":"Expertise"}]
[{"$f":"MyShoulder","v":"Reinforced Sapphirium Pauldrons"},149,0,169,0,0,{"$f":"ROUNDUP((B5*0.6),0)","v":90},{"$f":"ROUNDDOWN((C5*0.4),0)","v":0},{"$f":"ROUNDDOWN((D5*0.4),0)","v":67},{"$f":"ROUNDDOWN((E5*0.4),0)","v":0},{"$f":"ROUNDDOWN((F5*0.4),0)","v":0},{"$f":"IF(B5=0,0,N5)","v":149},90,149,90,{"$f":"IF(O5=L5,\"None\",IF(O5=G5,\"Reforge: Hit to \",CONCATENATE(\"Reforge: \",U5,\" to Hit\")))","v":"Reforge: Hit to "},{"$f":"IF(HLOOKUP(3,$H$2:$J$19,4,FALSE)=$O5,$Q$3,FALSE)","v":false},{"$f":"IF(HLOOKUP(2,$H$2:$J$19,4,FALSE)=$O5,$R$3,FALSE)","v":false},{"$f":"IF(HLOOKUP(1,$H$2:$J$19,4,FALSE)=$O5,$S$3,FALSE)","v":false},{"$f":"IF(K5=$O5,\"Expertise\",FALSE)","v":false},{"$f":"IF(AND(Q5=FALSE,R5=FALSE,S5=FALSE),T5,IF(AND(Q5=FALSE,R5=FALSE),S5,IF(Q5=FALSE,R5,Q5)))","v":false}]
[{"$f":"MyChest","v":"Immolation Battleplate"},0,0,235,0,269,0,0,94,0,107,0,94,107,94,"Reforge: Haste to Hit",{"$f":"IF(HLOOKUP(3,$H$2:$J$19,5,FALSE)=$O6,$Q$3,FALSE)","v":false},{"$f":"IF(HLOOKUP(2,$H$2:$J$19,5,FALSE)=$O6,$R$3,FALSE)","v":"Haste"},{"$f":"IF(HLOOKUP(1,$H$2:$J$19,5,FALSE)=$O6,$S$3,FALSE)","v":false},false,"Haste"]
[{"$f":"MyLegs","v":"Immolation Legplates"},0,227,0,274,0,0,90,0,109,0,0,90,109,90,"Reforge: Crit to Hit",{"$f":"IF(HLOOKUP(3,$H$2:$J$19,6,FALSE)=$O7,$Q$3,FALSE)","v":"Crit"},{"$f":"IF(HLOOKUP(2,$H$2:$J$19,6,FALSE)=$O7,$R$3,FALSE)","v":false},{"$f":"IF(HLOOKUP(1,$H$2:$J$19,6,FALSE)=$O7,$S$3,FALSE)","v":false},false,"Crit"]
[{"$f":"MyGloves","v":"Fireskin Gauntlets"},211,0,0,167,0,127,0,0,66,0,211,127,211,127,"Reforge: Hit to ",{"$f":"IF(HLOOKUP(3,$H$2:$J$19,7,FALSE)=$O8,$Q$3,FALSE)","v":false},{"$f":"IF(HLOOKUP(2,$H$2:$J$19,7,FALSE)=$O8,$R$3,FALSE)","v":false},{"$f":"IF(HLOOKUP(1,$H$2:$J$19,7,FALSE)=$O8,$S$3,FALSE)","v":false},false,false]
[{"$f":"MyFeet","v":"Arachnaflame Treads"},0,202,182,0,0,0,80,72,0,0,0,72,80,72,"Reforge: Haste to Hit",{"$f":"IF(HLOOKUP(3,$H$2:$J$19,8,FALSE)=$O9,$Q$3,FALSE)","v":false},{"$f":"IF(HLOOKUP(2,$H$2:$J$19,8,FALSE)=$O9,$R$3,FALSE)","v":"Haste"},{"$f":"IF(HLOOKUP(1,$H$2:$J$19,8,FALSE)=$O9,$S$3,FALSE)","v":false},false,"Haste"]
[{"$f":"MyBelt","v":"Cinch of the Flaming Ember"},133,230,0,0,0,80,92,0,0,0,133,80,133,80,"Reforge: Hit to ",{"$f":"IF(HLOOKUP(3,$H$2:$J$19,9,FALSE)=$O10,$Q$3,FALSE)","v":false},{"$f":"IF(HLOOKUP(2,$H$2:$J$19,9,FALSE)=$O10,$R$3,FALSE)","v":false},{"$f":"IF(HLOOKUP(1,$H$2:$J$19,9,FALSE)=$O10,$S$3,FALSE)","v":false},false,false]
[{"$f":"MyBracer","v":"Earthcrack Bracers"},0,158,140,0,0,0,63,56,0,0,0,56,63,56,"Reforge: Haste to Hit",{"$f":"IF(HLOOKUP(3,$H$2:$J$19,10,FALSE)=$O11,$Q$3,FALSE)","v":false},{"$f":"IF(HLOOKUP(2,$H$2:$J$19,10,FALSE)=$O11,$R$3,FALSE)","v":"Haste"},{"$f":"IF(HLOOKUP(1,$H$2:$J$19,10,FALSE)=$O11,$S$3,FALSE)","v":false},false,"Haste"]
[{"$f":"MyBack","v":"Bladed Flamewrath Cover"},0,0,173,0,115,0,0,69,0,46,0,46,69,69,"Reforge: Haste to Hit",{"$f":"IF(HLOOKUP(3,$H$2:$J$19,11,FALSE)=$O12,$Q$3,FALSE)","v":false},{"$f":"IF(HLOOKUP(2,$H$2:$J$19,11,FALSE)=$O12,$R$3,FALSE)","v":"Haste"},{"$f":"IF(HLOOKUP(1,$H$2:$J$19,11,FALSE)=$O12,$S$3,FALSE)","v":false},false,"Haste"]
[{"$f":"MyNeck","v":"Gift of Nadun"},0,127,127,0,0,0,50,50,0,0,0,50,50,50,"Reforge: Crit to Hit",{"$f":"IF(HLOOKUP(3,$H$2:$J$19,12,FALSE)=$O13,$Q$3,FALSE)","v":"Crit"},{"$f":"IF(HLOOKUP(2,$H$2:$J$19,12,FALSE)=$O13,$R$3,FALSE)","v":"Haste"},{"$f":"IF(HLOOKUP(1,$H$2:$J$19,12,FALSE)=$O13,$S$3,FALSE)","v":false},false,"Crit"]
[{"$f":"MyRing1","v":"Serrated Brimstone Signet"},{"$f":"IF(OR($A14=\"None\",ISBLANK($A14)),0,VLOOKUP($A14,ItemList,HLOOKUP(B$3,StatLoC,2,FALSE),FALSE))","v":0},156,144,0,0,0,62,57,0,0,0,57,62,62,"Reforge: Crit to Hit",{"$f":"IF(HLOOKUP(3,$H$2:$J$19,13,FALSE)=$O14,$Q$3,FALSE)","v":"Crit"},{"$f":"IF(HLOOKUP(2,$H$2:$J$19,13,FALSE)=$O14,$R$3,FALSE)","v":false},{"$f":"IF(HLOOKUP(1,$H$2:$J$19,13,FALSE)=$O14,$S$3,FALSE)","v":false},false,"Crit"]
[{"$f":"MyRing2","v":"Alysrazor's Band"},0,0,107,0,150,0,0,42,0,60,0,42,60,0,"None",{"$f":"IF(HLOOKUP(3,$H$2:$J$19,14,FALSE)=$O15,$Q$3,FALSE)","v":"Crit"},{"$f":"IF(HLOOKUP(2,$H$2:$J$19,14,FALSE)=$O15,$R$3,FALSE)","v":false},{"$f":"IF(HLOOKUP(1,$H$2:$J$19,14,FALSE)=$O15,$S$3,FALSE)","v":"Mastery"},false,"Crit"]
[{"$f":"MyTrinket1","v":"Essence of the Eternal Flame"},0,0,0,383,0,0,0,0,153,0,0,0,153,0,"None",{"$f":"IF(HLOOKUP(3,$H$2:$J$19,15,FALSE)=$O16,$Q$3,FALSE)","v":"Crit"},{"$f":"IF(HLOOKUP(2,$H$2:$J$19,15,FALSE)=$O16,$R$3,FALSE)","v":"Haste"},{"$f":"IF(HLOOKUP(1,$H$2:$J$19,15,FALSE)=$O16,$S$3,FALSE)","v":false},"Expertise","Crit"]
[{"$f":"MyTrinket2","v":"Darkmoon Card: Hurricane"},0,0,0,0,0,0,0,0,0,0,0,0,0,0,"None",{"$f":"IF(HLOOKUP(3,$H$2:$J$19,16,FALSE)=$O17,$Q$3,FALSE)","v":"Crit"},{"$f":"IF(HLOOKUP(2,$H$2:$J$19,16,FALSE)=$O17,$R$3,FALSE)","v":"Haste"},{"$f":"IF(HLOOKUP(1,$H$2:$J$19,16,FALSE)=$O17,$S$3,FALSE)","v":"Mastery"},"Expertise","Crit"]
[{"$f":"MyLibram","v":"Relic of the Elemental Lords"},0,83,86,0,0,0,33,34,0,0,0,33,34,34,"Reforge: Haste to Hit",{"$f":"IF(HLOOKUP(3,$H$2:$J$19,17,FALSE)=$O18,$Q$3,FALSE)","v":false},{"$f":"IF(HLOOKUP(2,$H$2:$J$19,17,FALSE)=$O18,$R$3,FALSE)","v":"Haste"},{"$f":"IF(HLOOKUP(1,$H$2:$J$19,17,FALSE)=$O18,$S$3,FALSE)","v":false},false,"Haste"]
[{"$f":"MyWeapon","v":"Zoid's Firelit Greatsword"},0,284,232,0,0,0,113,92,0,0,0,92,113,0,"None",{"$f":"IF(HLOOKUP(3,$H$2:$J$19,18,FALSE)=$O19,$Q$3,FALSE)","v":false},{"$f":"IF(HLOOKUP(2,$H$2:$J$19,18,FALSE)=$O19,$R$3,FALSE)","v":false},{"$f":"IF(HLOOKUP(1,$H$2:$J$19,18,FALSE)=$O19,$S$3,FALSE)","v":"Mastery"},"Expertise","Mastery"]
[]
[null,null,null,null,null,null,null,{"$f":"IF(OR(A2=\"Crit > Haste > Mastery\",A2=\"Crit > Mastery > Haste\"),1,IF(OR(A2=\"Mastery > Crit > Haste\",A2=\"Haste > Crit > Mastery\"),2,3))","v":3},{"$f":"IF(OR(A2=\"Haste > Mastery > Crit\",A2=\"Haste > Crit > Mastery\"),1,IF(OR(A2=\"Crit > Haste > Mastery\",A2=\"Mastery > Haste > Crit\"),2,3))","v":2},{"$f":"IF(OR(A2=\"Mastery > Haste > Crit\",A2=\"Mastery > Crit > Haste\"),1,IF(OR(A2=\"Crit > Mastery > Haste\",A2=\"Haste > Mastery > Crit\"),2,3))","v":1},null,"Expertise",null,null,null,null,null,3,2,1]
[null,null,null,null,null,null,"Hit","Crit","Haste","Mastery","WE","Unchanged","Min","Max",null,"Reforge for Expcap","Hit",{"$f":"HLOOKUP(3,$C$2:$E$3,2,FALSE)","v":"Crit"},{"$f":"HLOOKUP(2,$C$2:$E$3,2,FALSE)","v":"Haste"},{"$f":"HLOOKUP(1,$C$2:$E$3,2,FALSE)","v":"Mastery"},"Biggest Loser"]
[null,null,null,null,null,null,{"$f":"ROUNDDOWN((B4*0.4),0)","v":0},{"$f":"ROUNDDOWN((C4*0.4),0)","v":0},{"$f":"ROUNDDOWN((D4*0.4),0)","v":91},{"$f":"ROUNDDOWN((E4*0.4),0)","v":0},{"$f":"ROUNDUP((F4*0.6),0)","v":101},{"$f":"IF(P4=\"Reforge: Expertise to Hit\",K23,F4)","v":101},{"$f":"IF(P4=\"Reforge: Hit to \",G23,IF(P4=\"None\",IF(K23>0,K23,LARGE(H23:J23,2)),IF(P4=\"Reforge: Expertise to Hit\",K23,IF(RIGHT(P4,3)=\"Hit\",L23,0))))","v":101},{"$f":"IF(P4=\"Reforge: Hit to \",G23,IF(P4=\"None\",IF(K23>0,F4,MAX(H23:J23)),IF(P4=\"Reforge: Expertise to Hit\",K23,IF(RIGHT(P4,3)=\"Hit\",L23,0))))","v":101},101,{"$f":"IF(OR(RIGHT(P4,3)=\"Hit\",O23=F4),P4,IF(O23=K23,IF(K23=0,P4,\"Reforge: Expertise to \"),CONCATENATE(\"Reforge: \",U23,\" to Expertise\")))","v":"Reforge: Expertise to Hit"},{"$f":"IF(AND(O23>0,O23=G23),\"Hit\",FALSE)","v":false},{"$f":"IF(HLOOKUP(3,$H$21:$J$38,3,FALSE)>0,$R$22,FALSE)","v":false},{"$f":"IF(HLOOKUP(2,$H$21:$J$38,3,FALSE)>0,$S$22,FALSE)","v":"Haste"},{"$f":"IF(HLOOKUP(1,$H$21:$J$38,3,FALSE)>0,$T$22,FALSE)","v":false},{"$f":"IF(P4=\"Reforge: Hit to \",\"Hit\",IF(AND(Q23=FALSE,R23=FALSE,S23=FALSE),T23,IF(AND(Q23=FALSE,R23=FALSE),S23,IF(Q23=FALSE,R23,Q23))))","v":"Haste"}]
[null,null,null,null,null,null,59,0,67,0,0,{"$f":"IF(P5=\"Reforge: Expertise to Hit\",K24,F5)","v":0},59,{"$f":"IF(P5=\"Reforge: Hit to \",G24,IF(P5=\"None\",IF(K24>0,F5,MAX(H24:J24)),IF(P5=\"Reforge: Expertise to Hit\",K24,IF(RIGHT(P5,3)=\"Hit\",L24,0))))","v":59},0,"Reforge: Hit to ",{"$f":"IF(AND(O24>0,O24=G24),\"Hit\",FALSE)","v":false},{"$f":"IF(HLOOKUP(3,$H$21:$J$38,4,FALSE)>0,$R$22,FALSE)","v":false},{"$f":"IF(HLOOKUP(2,$H$21:$J$38,4,FALSE)>0,$S$22,FALSE)","v":"Haste"},{"$f":"IF(HLOOKUP(1,$H$21:$J$38,4,FALSE)>0,$T$22,FALSE)","v":false},{"$f":"IF(P5=\"Reforge: Hit to \",\"Hit\",IF(AND(Q24=FALSE,R24=FALSE,S24=FALSE),T24,IF(AND(Q24=FALSE,R24=FALSE),S24,IF(Q24=FALSE,R24,Q24))))","v":"Hit"}]
[null,null,null,null,null,null,0,0,94,0,162,269,269,269,269,"Reforge: Haste to Hit",{"$f":"IF(AND(O25>0,O25=G25),\"Hit\",FALSE)","v":false},{"$f":"IF(HLOOKUP(3,$H$21:$J$38,5,FALSE)>0,$R$22,FALSE)","v":false},{"$f":"IF(HLOOKUP(2,$H$21:$J$38,5,FALSE)>0,$S$22,FALSE)","v":"Haste"},{"$f":"IF(HLOOKUP(1,$H$21:$J$38,5,FALSE)>0,$T$22,FALSE)","v":false},"Haste"]
[null,null,null,null,null,null,0,90,0,109,0,0,0,0,0,"Reforge: Crit to Hit",false,{"$f":"IF(HLOOKUP(3,$H$21:$J$38,6,FALSE)>0,$R$22,FALSE)","v":"Crit"},{"$f":"IF(HLOOKUP(2,$H$21:$J$38,6,FALSE)>0,$S$22,FALSE)","v":false},{"$f":"IF(HLOOKUP(1,$H$21:$J$38,6,FALSE)>0,$T$22,FALSE)","v":"Mastery"},"Crit"]
[null,null,null,null,null,null,84,0,0,66,0,0,84,84,0,"Reforge: Hit to ",false,{"$f":"IF(HLOOKUP(3,$H$21:$J$38,7,FALSE)>0,$R$22,FALSE)","v":false},{"$f":"IF(HLOOKUP(2,$H$21:$J$38,7,FALSE)>0,$S$22,FALSE)","v":false},{"$f":"IF(HLOOKUP(1,$H$21:$J$38,7,FALSE)>0,$T$22,FALSE)","v":"Mastery"},"Hit"]
[null,null,null,null,null,null,0,80,72,0,0,0,0,0,0,"Reforge: Haste to Hit",false,{"$f":"IF(HLOOKUP(3,$H$21:$J$38,8,FALSE)>0,$R$22,FALSE)","v":"Crit"},{"$f":"IF(HLOOKUP(2,$H$21:$J$38,8,FALSE)>0,$S$22,FALSE)","v":"Haste"},{"$f":"IF(HLOOKUP(1,$H$21:$J$38,8,FALSE)>0,$T$22,FALSE)","v":false},"Crit"]
[null,null,null,null,null,null,53,92,0,0,0,0,53,53,0,"Reforge: Hit to ",false,{"$f":"IF(HLOOKUP(3,$H$21:$J$38,9,FALSE)>0,$R$22,FALSE)","v":"Crit"},{"$f":"IF(HLOOKUP(2,$H$21:$J$38,9,FALSE)>0,$S$22,FALSE)","v":false},{"$f":"IF(HLOOKUP(1,$H$21:$J$38,9,FALSE)>0,$T$22,FALSE)","v":false},"Hit"]
[null,null,null,null,null,null,0,63,56,0,0,0,0,0,0,"Reforge: Haste to Hit",false,{"$f":"IF(HLOOKUP(3,$H$21:$J$38,10,FALSE)>0,$R$22,FALSE)","v":"Crit"},{"$f":"IF(HLOOKUP(2,$H$21:$J$38,10,FALSE)>0,$S$22,FALSE)","v":"Haste"},{"$f":"IF(HLOOKUP(1,$H$21:$J$38,10,FALSE)>0,$T$22,FALSE)","v":false},"Crit"]
[null,null,null,null,null,null,0,0,69,0,69,115,115,115,115,"Reforge: Haste to Hit",false,{"$f":"IF(HLOOKUP(3,$H$21:$J$38,11,FALSE)>0,$R$22,FALSE)","v":false},{"$f":"IF(HLOOKUP(2,$H$21:$J$38,11,FALSE)>0,$S$22,FALSE)","v":"Haste"},{"$f":"IF(HLOOKUP(1,$H$21:$J$38,11,FALSE)>0,$T$22,FALSE)","v":false},"Haste"]
[null,null,null,null,null,null,0,50,50,0,0,0,0,0,0,"Reforge: Crit to Hit",false,{"$f":"IF(HLOOKUP(3,$H$21:$J$38,12,FALSE)>0,$R$22,FALSE)","v":"Crit"},{"$f":"IF(HLOOKUP(2,$H$21:$J$38,12,FALSE)>0,$S$22,FALSE)","v":"Haste"},{"$f":"IF(HLOOKUP(1,$H$21:$J$38,12,FALSE)>0,$T$22,FALSE)","v":false},"Crit"]
[null,null,null,null,null,null,0,62,57,0,0,0,0,0,0,"Reforge: Crit to Hit",false,{"$f":"IF(HLOOKUP(3,$H$21:$J$38,13,FALSE)>0,$R$22,FALSE)","v":"Crit"},{"$f":"IF(HLOOKUP(2,$H$21:$J$38,13,FALSE)>0,$S$22,FALSE)","v":"Haste"},{"$f":"IF(HLOOKUP(1,$H$21:$J$38,13,FALSE)>0,$T$22,FALSE)","v":false},"Crit"]
[null,null,null,null,null,null,0,0,42,0,90,150,90,150,90,"Reforge: Expertise to ",false,{"$f":"IF(HLOOKUP(3,$H$21:$J$38,14,FALSE)>0,$R$22,FALSE)","v":false},{"$f":"IF(HLOOKUP(2,$H$21:$J$38,14,FALSE)>0,$S$22,FALSE)","v":"Haste"},{"$f":"IF(HLOOKUP(1,$H$21:$J$38,14,FALSE)>0,$T$22,FALSE)","v":false},"Haste"]
[null,null,null,null,null,null,0,0,0,153,0,0,0,153,0,"None",false,{"$f":"IF(HLOOKUP(3,$H$21:$J$38,15,FALSE)>0,$R$22,FALSE)","v":false},{"$f":"IF(HLOOKUP(2,$H$21:$J$38,15,FALSE)>0,$S$22,FALSE)","v":false},{"$f":"IF(HLOOKUP(1,$H$21:$J$38,15,FALSE)>0,$T$22,FALSE)","v":"Mastery"},"Mastery"]
[null,null,null,null,null,null,0,0,0,0,0,0,0,0,0,"None",false,{"$f":"IF(HLOOKUP(3,$H$21:$J$38,16,FALSE)>0,$R$22,FALSE)","v":false},{"$f":"IF(HLOOKUP(2,$H$21:$J$38,16,FALSE)>0,$S$22,FALSE)","v":false},{"$f":"IF(HLOOKUP(1,$H$21:$J$38,16,FALSE)>0,$T$22,FALSE)","v":false},false]
[null,null,null,null,null,null,0,33,34,0,0,0,0,0,0,{"$f":"IF(OR(RIGHT(P18,3)=\"Hit\",O37=F18),P18,IF(O37=K37,IF(K37=0,P18,\"Reforge: Expertise to \"),CONCATENATE(\"Reforge: \",U37,\" to Expertise\")))","v":"Reforge: Haste to Hit"},false,{"$f":"IF(HLOOKUP(3,$H$21:$J$38,17,FALSE)>0,$R$22,FALSE)","v":"Crit"},{"$f":"IF(HLOOKUP(2,$H$21:$J$38,17,FALSE)>0,$S$22,FALSE)","v":"Haste"},{"$f":"IF(HLOOKUP(1,$H$21:$J$38,17,FALSE)>0,$T$22,FALSE)","v":false},"Crit"]
[null,null,null,null,null,null,0,113,92,0,0,0,{"$f":"IF(P19=\"Reforge: Hit to \",G38,IF(P19=\"None\",IF(K38>0,K38,LARGE(H38:J38,2)),IF(P19=\"Reforge: Expertise to Hit\",K38,IF(RIGHT(P19,3)=\"Hit\",L38,0))))","v":92},{"$f":"IF(P19=\"Reforge: Hit to \",G38,IF(P19=\"None\",IF(K38>0,F19,MAX(H38:J38)),IF(P19=\"Reforge: Expertise to Hit\",K38,IF(RIGHT(P19,3)=\"Hit\",L38,0))))","v":113},0,{"$f":"IF(OR(RIGHT(P19,3)=\"Hit\",O38=F19),P19,IF(O38=K38,IF(K38=0,P19,\"Reforge: Expertise to \"),CONCATENATE(\"Reforge: \",U38,\" to Expertise\")))","v":"None"},{"$f":"IF(AND(O38>0,O38=G38),\"Hit\",FALSE)","v":false},{"$f":"IF(HLOOKUP(3,$H$21:$J$38,18,FALSE)>0,$R$22,FALSE)","v":"Crit"},{"$f":"IF(HLOOKUP(2,$H$21:$J$38,18,FALSE)>0,$S$22,FALSE)","v":"Haste"},{"$f":"IF(HLOOKUP(1,$H$21:$J$38,18,FALSE)>0,$T$22,FALSE)","v":false},"Crit"]
[]
[null,null,null,null,null,null,null,null,null,null,null,null,null,null,null,null,null,1,2,3]
[null,null,null,null,null,null,null,null,null,null,null,null,null,null,null,"Complete \"Hit/Exp to\"",null,{"$f":"HLOOKUP(1,$C$2:$E$3,2,FALSE)","v":"Mastery"},{"$f":"HLOOKUP(2,$C$2:$E$3,2,FALSE)","v":"Haste"},{"$f":"HLOOKUP(3,$C$2:$E$3,2,FALSE)","v":"Crit"},"Biggest Winner"]
[null,null,null,null,null,null,null,null,null,null,null,null,null,null,null,{"$f":"IF(OR(P23=\"Reforge: Hit to \",P23=\"Reforge: Expertise to \"),CONCATENATE(P23,U42),P23)","v":"Reforge: Expertise to Hit"},null,{"$f":"IF(HLOOKUP(1,$H$21:$J$38,3,FALSE)>0,$R$41,FALSE)","v":false},{"$f":"IF(HLOOKUP(2,$H$21:$J$38,3,FALSE)>0,$S$41,FALSE)","v":"Haste"},{"$f":"IF(HLOOKUP(3,$H$21:$J$38,3,FALSE)>0,$T$41,FALSE)","v":false},{"$f":"IF(R42=FALSE,$R$41,IF(S42=FALSE,$S$41,$T$41))","v":"Mastery"}]
[null,null,null,null,null,null,null,null,null,null,null,null,null,null,null,{"$f":"IF(OR(P24=\"Reforge: Hit to \",P24=\"Reforge: Expertise to \"),CONCATENATE(P24,U43),P24)","v":"Reforge: Hit to Mastery"},null,{"$f":"IF(HLOOKUP(1,$H$21:$J$38,4,FALSE)>0,$R$41,FALSE)","v":false},{"$f":"IF(HLOOKUP(2,$H$21:$J$38,4,FALSE)>0,$S$41,FALSE)","v":"Haste"},{"$f":"IF(HLOOKUP(3,$H$21:$J$38,4,FALSE)>0,$T$41,FALSE)","v":false},{"$f":"IF(R43=FALSE,$R$41,IF(S43=FALSE,$S$41,$T$41))","v":"Mastery"}]
[null,null,null,null,null,null,null,null,null,null,null,null,null,null,null,"Reforge: Haste to Hit",null,{"$f":"IF(HLOOKUP(1,$H$21:$J$38,5,FALSE)>0,$R$41,FALSE)","v":false},{"$f":"IF(HLOOKUP(2,$H$21:$J$38,5,FALSE)>0,$S$41,FALSE)","v":"Haste"},{"$f":"IF(HLOOKUP(3,$H$21:$J$38,5,FALSE)>0,$T$41,FALSE)","v":false},"Mastery"]
[null,null,null,null,null,null,null,null,null,null,null,null,null,null,null,"Reforge: Crit to Hit",null,{"$f":"IF(HLOOKUP(1,$H$21:$J$38,6,FALSE)>0,$R$41,FALSE)","v":"Mastery"},{"$f":"IF(HLOOKUP(2,$H$21:$J$38,6,FALSE)>0,$S$41,FALSE)","v":false},{"$f":"IF(HLOOKUP(3,$H$21:$J$38,6,FALSE)>0,$T$41,FALSE)","v":"Crit"},"Haste"]
[null,null,null,null,null,null,null,null,null,null,null,null,null,null,null,"Reforge: Hit to Haste",null,{"$f":"IF(HLOOKUP(1,$H$21:$J$38,7,FALSE)>0,$R$41,FALSE)","v":"Mastery"},{"$f":"IF(HLOOKUP(2,$H$21:$J$38,7,FALSE)>0,$S$41,FALSE)","v":false},{"$f":"IF(HLOOKUP(3,$H$21:$J$38,7,FALSE)>0,$T$41,FALSE)","v":false},"Haste"]
[null,null,null,null,null,null,null,null,null,null,null,null,null,null,null,"Reforge: Haste to Hit",null,{"$f":"IF(HLOOKUP(1,$H$21:$J$38,8,FALSE)>0,$R$41,FALSE)","v":false},{"$f":"IF(HLOOKUP(2,$H$21:$J$38,8,FALSE)>0,$S$41,FALSE)","v":"Haste"},{"$f":"IF(HLOOKUP(3,$H$21:$J$38,8,FALSE)>0,$T$41,FALSE)","v":"Crit"},"Mastery"]
[null,null,null,null,null,null,null,null,null,null,null,null,null,null,null,"Reforge: Hit to Mastery",null,{"$f":"IF(HLOOKUP(1,$H$21:$J$38,9,FALSE)>0,$R$41,FALSE)","v":false},{"$f":"IF(HLOOKUP(2,$H$21:$J$38,9,FALSE)>0,$S$41,FALSE)","v":false},{"$f":"IF(HLOOKUP(3,$H$21:$J$38,9,FALSE)>0,$T$41,FALSE)","v":"Crit"},"Mastery"]
[null,null,null,null,null,null,null,null,null,null,null,null,null,null,null,"Reforge: Haste to Hit",null,{"$f":"IF(HLOOKUP(1,$H$21:$J$38,10,FALSE)>0,$R$41,FALSE)","v":false},{"$f":"IF(HLOOKUP(2,$H$21:$J$38,10,FALSE)>0,$S$41,FALSE)","v":"Haste"},{"$f":"IF(HLOOKUP(3,$H$21:$J$38,10,FALSE)>0,$T$41,FALSE)","v":"Crit"},"Mastery"]
[null,null,null,null,null,null,null,null,null,null,null,null,null,null,null,"Reforge: Haste to Hit",null,{"$f":"IF(HLOOKUP(1,$H$21:$J$38,11,FALSE)>0,$R$41,FALSE)","v":false},{"$f":"IF(HLOOKUP(2,$H$21:$J$38,11,FALSE)>0,$S$41,FALSE)","v":"Haste"},{"$f":"IF(HLOOKUP(3,$H$21:$J$38,11,FALSE)>0,$T$41,FALSE)","v":false},"Mastery"]
[null,null,null,null,null,null,null,null,null,null,null,null,null,null,null,"Reforge: Crit to Hit",null,{"$f":"IF(HLOOKUP(1,$H$21:$J$38,12,FALSE)>0,$R$41,FALSE)","v":false},{"$f":"IF(HLOOKUP(2,$H$21:$J$38,12,FALSE)>0,$S$41,FALSE)","v":"Haste"},{"$f":"IF(HLOOKUP(3,$H$21:$J$38,12,FALSE)>0,$T$41,FALSE)","v":"Crit"},"Mastery"]
[null,null,null,null,null,null,null,null,null,null,null,null,null,null,null,"Reforge: Crit to Hit",null,{"$f":"IF(HLOOKUP(1,$H$21:$J$38,13,FALSE)>0,$R$41,FALSE)","v":false},{"$f":"IF(HLOOKUP(2,$H$21:$J$38,13,FALSE)>0,$S$41,FALSE)","v":"Haste"},{"$f":"IF(HLOOKUP(3,$H$21:$J$38,13,FALSE)>0,$T$41,FALSE)","v":"Crit"},"Mastery"]
[null,null,null,null,null,null,null,null,null,null,null,null,null,null,null,"Reforge: Expertise to Mastery",null,{"$f":"IF(HLOOKUP(1,$H$21:$J$38,14,FALSE)>0,$R$41,FALSE)","v":false},{"$f":"IF(HLOOKUP(2,$H$21:$J$38,14,FALSE)>0,$S$41,FALSE)","v":"Haste"},{"$f":"IF(HLOOKUP(3,$H$21:$J$38,14,FALSE)>0,$T$41,FALSE)","v":false},"Mastery"]
[null,null,null,null,null,null,null,null,null,null,null,null,null,null,null,"None",null,{"$f":"IF(HLOOKUP(1,$H$21:$J$38,15,FALSE)>0,$R$41,FALSE)","v":"Mastery"},{"$f":"IF(HLOOKUP(2,$H$21:$J$38,15,FALSE)>0,$S$41,FALSE)","v":false},{"$f":"IF(HLOOKUP(3,$H$21:$J$38,15,FALSE)>0,$T$41,FALSE)","v":false},"Haste"]
[null,null,null,null,null,null,null,null,null,null,null,null,null,null,null,"None",null,{"$f":"IF(HLOOKUP(1,$H$21:$J$38,16,FALSE)>0,$R$41,FALSE)","v":false},{"$f":"IF(HLOOKUP(2,$H$21:$J$38,16,FALSE)>0,$S$41,FALSE)","v":false},{"$f":"IF(HLOOKUP(3,$H$21:$J$38,16,FALSE)>0,$T$41,FALSE)","v":false},"Mastery"]
[null,null,null,null,null,null,null,null,null,null,null,null,null,null,null,"Reforge: Haste to Hit",null,{"$f":"IF(HLOOKUP(1,$H$21:$J$38,17,FALSE)>0,$R$41,FALSE)","v":false},{"$f":"IF(HLOOKUP(2,$H$21:$J$38,17,FALSE)>0,$S$41,FALSE)","v":"Haste"},{"$f":"IF(HLOOKUP(3,$H$21:$J$38,17,FALSE)>0,$T$41,FALSE)","v":"Crit"},"Mastery"]
[null,null,null,null,null,null,null,null,null,null,null,null,null,null,null,"None",null,{"$f":"IF(HLOOKUP(1,$H$21:$J$38,18,FALSE)>0,$R$41,FALSE)","v":false},{"$f":"IF(HLOOKUP(2,$H$21:$J$38,18,FALSE)>0,$S$41,FALSE)","v":"Haste"},{"$f":"IF(HLOOKUP(3,$H$21:$J$38,18,FALSE)>0,$T$41,FALSE)","v":"Crit"},"Mastery"]
[]
[null,null,null,null,null,null,null,null,null,null,null,null,null,null,null,null,null,3,2,1]
[null,null,null,null,null,null,null,null,null,null,null,null,null,null,null,"Auto Reforge Recommendation",null,{"$f":"HLOOKUP(3,$C$2:$E$3,2,FALSE)","v":"Crit"},{"$f":"HLOOKUP(2,$C$2:$E$3,2,FALSE)","v":"Haste"},{"$f":"HLOOKUP(1,$C$2:$E$3,2,FALSE)","v":"Mastery"}]
[null,null,null,null,null,null,null,null,null,null,null,null,null,null,null,{"$f":"IF(P42=\"None\",U61,P42)","v":"Reforge: Expertise to Hit"},null,{"$f":"IF(HLOOKUP(3,$H$21:$J$38,3,FALSE)>0,$R$22,FALSE)","v":false},{"$f":"IF(HLOOKUP(2,$H$21:$J$38,3,FALSE)>0,$S$22,FALSE)","v":"Haste"},{"$f":"IF(HLOOKUP(1,$H$21:$J$38,3,FALSE)>0,$T$22,FALSE)","v":false},{"$f":"IF(AND(R61=$R$60,T61=FALSE),CONCATENATE(\"Reforge: \",$R$60, \" to \",$T$60),IF(AND(R61=$R$60,S61=FALSE),CONCATENATE(\"Reforge: \",$R$60, \" to \",$S$60),IF(AND(S61=$S$60,T61=FALSE),CONCATENATE(\"Reforge: \",$S$60, \" to \",$T$60),\"None\")))","v":"Reforge: Haste to Mastery"}]
[null,null,null,null,null,null,null,null,null,null,null,null,null,null,null,{"$f":"IF(P43=\"None\",U62,P43)","v":"Reforge: Hit to Mastery"},null,{"$f":"IF(HLOOKUP(3,$H$21:$J$38,4,FALSE)>0,$R$22,FALSE)","v":false},{"$f":"IF(HLOOKUP(2,$H$21:$J$38,4,FALSE)>0,$S$22,FALSE)","v":"Haste"},{"$f":"IF(HLOOKUP(1,$H$21:$J$38,4,FALSE)>0,$T$22,FALSE)","v":false},{"$f":"IF(AND(R62=$R$60,T62=FALSE),CONCATENATE(\"Reforge: \",$R$60, \" to \",$T$60),IF(AND(R62=$R$60,S62=FALSE),CONCATENATE(\"Reforge: \",$R$60, \" to \",$S$60),IF(AND(S62=$S$60,T62=FALSE),CONCATENATE(\"Reforge: \",$S$60, \" to \",$T$60),\"None\")))","v":"Reforge: Haste to Mastery"}]
[null,null,null,null,null,null,null,null,null,null,null,null,null,null,null,"Reforge: Haste to Hit",null,{"$f":"IF(HLOOKUP(3,$H$21:$J$38,5,FALSE)>0,$R$22,FALSE)","v":false},{"$f":"IF(HLOOKUP(2,$H$21:$J$38,5,FALSE)>0,$S$22,FALSE)","v":"Haste"},{"$f":"IF(HLOOKUP(1,$H$21:$J$38,5,FALSE)>0,$T$22,FALSE)","v":false},"Reforge: Haste to Mastery"]
[null,null,null,null,null,null,null,null,null,null,null,null,null,null,null,"Reforge: Crit to Hit",null,{"$f":"IF(HLOOKUP(3,$H$21:$J$38,6,FALSE)>0,$R$22,FALSE)","v":"Crit"},{"$f":"IF(HLOOKUP(2,$H$21:$J$38,6,FALSE)>0,$S$22,FALSE)","v":false},{"$f":"IF(HLOOKUP(1,$H$21:$J$38,6,FALSE)>0,$T$22,FALSE)","v":"Mastery"},"Reforge: Crit to Haste"]
[null,null,null,null,null,null,null,null,null,null,null,null,null,null,null,"Reforge: Hit to Haste",null,{"$f":"IF(HLOOKUP(3,$H$21:$J$38,7,FALSE)>0,$R$22,FALSE)","v":false},{"$f":"IF(HLOOKUP(2,$H$21:$J$38,7,FALSE)>0,$S$22,FALSE)","v":false},{"$f":"IF(HLOOKUP(1,$H$21:$J$38,7,FALSE)>0,$T$22,FALSE)","v":"Mastery"},"None"]
[null,null,null,null,null,null,null,null,null,null,null,null,null,null,null,"Reforge: Haste to Hit",null,{"$f":"IF(HLOOKUP(3,$H$21:$J$38,8,FALSE)>0,$R$22,FALSE)","v":"Crit"},{"$f":"IF(HLOOKUP(2,$H$21:$J$38,8,FALSE)>0,$S$22,FALSE)","v":"Haste"},{"$f":"IF(HLOOKUP(1,$H$21:$J$38,8,FALSE)>0,$T$22,FALSE)","v":false},"Reforge: Crit to Mastery"]
[null,null,null,null,null,null,null,null,null,null,null,null,null,null,null,"Reforge: Hit to Mastery",null,{"$f":"IF(HLOOKUP(3,$H$21:$J$38,9,FALSE)>0,$R$22,FALSE)","v":"Crit"},{"$f":"IF(HLOOKUP(2,$H$21:$J$38,9,FALSE)>0,$S$22,FALSE)","v":false},{"$f":"IF(HLOOKUP(1,$H$21:$J$38,9,FALSE)>0,$T$22,FALSE)","v":false},"Reforge: Crit to Mastery"]
[null,null,null,null,null,null,null,null,null,null,null,null,null,null,null,"Reforge: Haste to Hit",null,{"$f":"IF(HLOOKUP(3,$H$21:$J$38,10,FALSE)>0,$R$22,FALSE)","v":"Crit"},{"$f":"IF(HLOOKUP(2,$H$21:$J$38,10,FALSE)>0,$S$22,FALSE)","v":"Haste"},{"$f":"IF(HLOOKUP(1,$H$21:$J$38,10,FALSE)>0,$T$22,FALSE)","v":false},"Reforge: Crit to Mastery"]
[null,null,null,null,null,null,null,null,null,null,null,null,null,null,null,"Reforge: Haste to Hit",null,{"$f":"IF(HLOOKUP(3,$H$21:$J$38,11,FALSE)>0,$R$22,FALSE)","v":false},{"$f":"IF(HLOOKUP(2,$H$21:$J$38,11,FALSE)>0,$S$22,FALSE)","v":"Haste"},{"$f":"IF(HLOOKUP(1,$H$21:$J$38,11,FALSE)>0,$T$22,FALSE)","v":false},"Reforge: Haste to Mastery"]
[null,null,null,null,null,null,null,null,null,null,null,null,null,null,null,"Reforge: Crit to Hit",null,{"$f":"IF(HLOOKUP(3,$H$21:$J$38,12,FALSE)>0,$R$22,FALSE)","v":"Crit"},{"$f":"IF(HLOOKUP(2,$H$21:$J$38,12,FALSE)>0,$S$22,FALSE)","v":"Haste"},{"$f":"IF(HLOOKUP(1,$H$21:$J$38,12,FALSE)>0,$T$22,FALSE)","v":false},"Reforge: Crit to Mastery"]
[null,null,null,null,null,null,null,null,null,null,null,null,null,null,null,"Reforge: Crit to Hit",null,{"$f":"IF(HLOOKUP(3,$H$21:$J$38,13,FALSE)>0,$R$22,FALSE)","v":"Crit"},{"$f":"IF(HLOOKUP(2,$H$21:$J$38,13,FALSE)>0,$S$22,FALSE)","v":"Haste"},{"$f":"IF(HLOOKUP(1,$H$21:$J$38,13,FALSE)>0,$T$22,FALSE)","v":false},"Reforge: Crit to Mastery"]
[null,null,null,null,null,null,null,null,null,null,null,null,null,null,null,"Reforge: Expertise to Mastery",null,{"$f":"IF(HLOOKUP(3,$H$21:$J$38,14,FALSE)>0,$R$22,FALSE)","v":false},{"$f":"IF(HLOOKUP(2,$H$21:$J$38,14,FALSE)>0,$S$22,FALSE)","v":"Haste"},{"$f":"IF(HLOOKUP(1,$H$21:$J$38,14,FALSE)>0,$T$22,FALSE)","v":false},"Reforge: Haste to Mastery"]
[null,null,null,null,null,null,null,null,null,null,null,null,null,null,null,"None",null,{"$f":"IF(HLOOKUP(3,$H$21:$J$38,15,FALSE)>0,$R$22,FALSE)","v":false},{"$f":"IF(HLOOKUP(2,$H$21:$J$38,15,FALSE)>0,$S$22,FALSE)","v":false},{"$f":"IF(HLOOKUP(1,$H$21:$J$38,15,FALSE)>0,$T$22,FALSE)","v":"Mastery"},"None"]
[null,null,null,null,null,null,null,null,null,null,null,null,null,null,null,"None",null,{"$f":"IF(HLOOKUP(3,$H$21:$J$38,16,FALSE)>0,$R$22,FALSE)","v":false},{"$f":"IF(HLOOKUP(2,$H$21:$J$38,16,FALSE)>0,$S$22,FALSE)","v":false},{"$f":"IF(HLOOKUP(1,$H$21:$J$38,16,FALSE)>0,$T$22,FALSE)","v":false},"None"]
[null,null,null,null,null,null,null,null,null,null,null,null,null,null,null,"Reforge: Haste to Hit",null,{"$f":"IF(HLOOKUP(3,$H$21:$J$38,17,FALSE)>0,$R$22,FALSE)","v":"Crit"},{"$f":"IF(HLOOKUP(2,$H$21:$J$38,17,FALSE)>0,$S$22,FALSE)","v":"Haste"},{"$f":"IF(HLOOKUP(1,$H$21:$J$38,17,FALSE)>0,$T$22,FALSE)","v":false},"Reforge: Crit to Mastery"]
[null,null,null,null,null,null,null,null,null,null,null,null,null,null,null,"Reforge: Crit to Mastery",null,{"$f":"IF(HLOOKUP(3,$H$21:$J$38,18,FALSE)>0,$R$22,FALSE)","v":"Crit"},{"$f":"IF(HLOOKUP(2,$H$21:$J$38,18,FALSE)>0,$S$22,FALSE)","v":"Haste"},{"$f":"IF(HLOOKUP(1,$H$21:$J$38,18,FALSE)>0,$T$22,FALSE)","v":false},"Reforge: Crit to Mastery"]
[]
[]
[]
[]
[]
[]
[]
[]
[]
[]
[]
[]
[]
[]
[]
[]
[]
[]
[]
[]
[]
[]
[]
[null,null,"Priority",null,null,null,null,"Priority",null,null,null,null,null,null,null,null,"Priority"]
[null,null,{"$f":"IF(OR(StatPrio=\"Crit > Haste > Mastery\",StatPrio=\"Crit > Mastery > Haste\"),1,IF(OR(StatPrio=\"Mastery > Crit > Haste\",StatPrio=\"Haste > Crit > Mastery\"),2,3))","v":3},{"$f":"IF(OR(StatPrio=\"Haste > Mastery > Crit\",StatPrio=\"Haste > Crit > Mastery\"),1,IF(OR(StatPrio=\"Crit > Haste > Mastery\",StatPrio=\"Mastery > Haste > Crit\"),2,3))","v":2},{"$f":"IF(OR(StatPrio=\"Mastery > Haste > Crit\",StatPrio=\"Mastery > Crit > Haste\"),1,IF(OR(StatPrio=\"Crit > Mastery > Haste\",StatPrio=\"Haste > Mastery > Crit\"),2,3))","v":1},null,null,{"$f":"IF(OR(StatPrio=\"Crit > Haste > Mastery\",StatPrio=\"Crit > Mastery > Haste\"),1,IF(OR(StatPrio=\"Mastery > Crit > Haste\",StatPrio=\"Haste > Crit > Mastery\"),2,3))","v":3},{"$f":"IF(OR(StatPrio=\"Haste > Mastery > Crit\",StatPrio=\"Haste > Crit > Mastery\"),1,IF(OR(StatPrio=\"Crit > Haste > Mastery\",StatPrio=\"Mastery > Haste > Crit\"),2,3))","v":2},{"$f":"IF(OR(StatPrio=\"Mastery > Haste > Crit\",StatPrio=\"Mastery > Crit > Haste\"),1,IF(OR(StatPrio=\"Crit > Mastery > Haste\",StatPrio=\"Haste > Mastery > Crit\"),2,3))","v":1},null,"Expertise",null,null,null,null,3,2,1]
["Gear","Hit","Crit","Haste","Mastery","WE","Hit","Crit","Haste","Mastery","WE","Unchanged","Min","Max",null,"Reforge for Expcap",{"$f":"HLOOKUP(3,$H$2:$J$3,2,FALSE)","v":"Crit"},{"$f":"HLOOKUP(2,$H$2:$J$3,2,FALSE)","v":"Haste"},{"$f":"HLOOKUP(1,$H$2:$J$3,2,FALSE)","v":"Mastery"},"Hit","Biggest Loser"]
[{"$f":"MyHead","v":"Reinforced Sapphirium Helmet"},{"$f":"IF(OR($A103=\"None\",ISBLANK($A103)),0,VLOOKUP($A103,ItemList,HLOOKUP(B$3,StatLoC,2,FALSE),FALSE))","v":0},0,228,0,168,{"$f":"ROUNDUP((B103*0.4),0)","v":0},{"$f":"ROUNDDOWN((C103*0.4),0)","v":0},{"$f":"ROUNDDOWN((D103*0.4),0)","v":91},{"$f":"ROUNDDOWN((E103*0.4),0)","v":0},{"$f":"ROUNDDOWN((F103*0.6),0)","v":100},{"$f":"IF(F103=0,0,N103)","v":168},{"$f":"IF(K103>0,K103,LARGE(G103:J103,2))","v":100},{"$f":"IF(K103>0,F103,MAX(G103:J103))","v":168},100,{"$f":"IF(O103=L103,\"None\",IF(O103=K103,\"Reforge: Expertise to \",CONCATENATE(\"Reforge: \",U103,\" to Expertise\")))","v":"Reforge: Expertise to "},{"$f":"IF(HLOOKUP(3,$H$2:$J$19,3,FALSE)=$O103,$Q$3,FALSE)","v":false},{"$f":"IF(HLOOKUP(2,$H$2:$J$19,3,FALSE)=$O103,$R$3,FALSE)","v":false},{"$f":"IF(HLOOKUP(1,$H$2:$J$19,3,FALSE)=$O103,$S$3,FALSE)","v":false},{"$f":"IF(G103=$O103,\"Hit\",FALSE)","v":false},{"$f":"IF(AND(Q103=FALSE,R103=FALSE,S103=FALSE),T103,IF(AND(Q103=FALSE,R103=FALSE),S103,IF(Q103=FALSE,R103,Q103)))","v":false}]
[{"$f":"MyShoulder","v":"Reinforced Sapphirium Pauldrons"},149,0,169,0,0,{"$f":"ROUNDUP((B104*0.4),0)","v":60},{"$f":"ROUNDDOWN((C104*0.4),0)","v":0},67,0,{"$f":"ROUNDDOWN((F104*0.6),0)","v":0},{"$f":"IF(F104=0,0,N104)","v":0},{"$f":"IF(K104>0,K104,LARGE(G104:J104,2))","v":60},{"$f":"IF(K104>0,F104,MAX(G104:J104))","v":67},0,{"$f":"IF(O104=L104,\"None\",IF(O104=K104,\"Reforge: Expertise to \",CONCATENATE(\"Reforge: \",U104,\" to Expertise\")))","v":"None"},{"$f":"IF(HLOOKUP(3,$H$2:$J$19,4,FALSE)=$O104,$Q$3,FALSE)","v":"Crit"},{"$f":"IF(HLOOKUP(2,$H$2:$J$19,4,FALSE)=$O104,$R$3,FALSE)","v":false},{"$f":"IF(HLOOKUP(1,$H$2:$J$19,4,FALSE)=$O104,$S$3,FALSE)","v":"Mastery"},{"$f":"IF(G104=$O104,\"Hit\",FALSE)","v":false},{"$f":"IF(AND(Q104=FALSE,R104=FALSE,S104=FALSE),T104,IF(AND(Q104=FALSE,R104=FALSE),S104,IF(Q104=FALSE,R104,Q104)))","v":"Crit"}]
[{"$f":"MyChest","v":"Immolation Battleplate"},0,0,235,0,269,0,0,94,0,161,269,161,269,161,"Reforge: Expertise to ",{"$f":"IF(HLOOKUP(3,$H$2:$J$19,5,FALSE)=$O105,$Q$3,FALSE)","v":false},{"$f":"IF(HLOOKUP(2,$H$2:$J$19,5,FALSE)=$O105,$R$3,FALSE)","v":false},{"$f":"IF(HLOOKUP(1,$H$2:$J$19,5,FALSE)=$O105,$S$3,FALSE)","v":false},{"$f":"IF(G105=$O105,\"Hit\",FALSE)","v":false},false]
[{"$f":"MyLegs","v":"Immolation Legplates"},0,227,0,274,0,0,90,0,109,0,0,90,109,0,"None",{"$f":"IF(HLOOKUP(3,$H$2:$J$19,6,FALSE)=$O106,$Q$3,FALSE)","v":false},{"$f":"IF(HLOOKUP(2,$H$2:$J$19,6,FALSE)=$O106,$R$3,FALSE)","v":"Haste"},{"$f":"IF(HLOOKUP(1,$H$2:$J$19,6,FALSE)=$O106,$S$3,FALSE)","v":false},"Hit","Haste"]
[{"$f":"MyGloves","v":"Fireskin Gauntlets"},211,0,0,167,0,85,0,0,66,0,0,66,85,0,"None",{"$f":"IF(HLOOKUP(3,$H$2:$J$19,7,FALSE)=$O107,$Q$3,FALSE)","v":"Crit"},{"$f":"IF(HLOOKUP(2,$H$2:$J$19,7,FALSE)=$O107,$R$3,FALSE)","v":"Haste"},{"$f":"IF(HLOOKUP(1,$H$2:$J$19,7,FALSE)=$O107,$S$3,FALSE)","v":false},false,"Crit"]
[{"$f":"MyFeet","v":"Arachnaflame Treads"},0,202,182,0,0,0,80,72,0,0,0,72,80,0,"None",{"$f":"IF(HLOOKUP(3,$H$2:$J$19,8,FALSE)=$O108,$Q$3,FALSE)","v":false},{"$f":"IF(HLOOKUP(2,$H$2:$J$19,8,FALSE)=$O108,$R$3,FALSE)","v":false},{"$f":"IF(HLOOKUP(1,$H$2:$J$19,8,FALSE)=$O108,$S$3,FALSE)","v":"Mastery"},"Hit","Mastery"]
[{"$f":"MyBelt","v":"Cinch of the Flaming Ember"},133,230,0,0,0,54,92,0,0,0,0,54,92,0,"None",{"$f":"IF(HLOOKUP(3,$H$2:$J$19,9,FALSE)=$O109,$Q$3,FALSE)","v":false},{"$f":"IF(HLOOKUP(2,$H$2:$J$19,9,FALSE)=$O109,$R$3,FALSE)","v":"Haste"},{"$f":"IF(HLOOKUP(1,$H$2:$J$19,9,FALSE)=$O109,$S$3,FALSE)","v":"Mastery"},false,"Haste"]
[{"$f":"MyBracer","v":"Earthcrack Bracers"},0,158,140,0,0,0,63,56,0,0,0,56,63,0,"None",{"$f":"IF(HLOOKUP(3,$H$2:$J$19,10,FALSE)=$O110,$Q$3,FALSE)","v":false},{"$f":"IF(HLOOKUP(2,$H$2:$J$19,10,FALSE)=$O110,$R$3,FALSE)","v":false},{"$f":"IF(HLOOKUP(1,$H$2:$J$19,10,FALSE)=$O110,$S$3,FALSE)","v":"Mastery"},"Hit","Mastery"]
[{"$f":"MyBack","v":"Bladed Flamewrath Cover"},0,0,173,0,115,0,0,69,0,69,115,69,115,69,"Reforge: Expertise to ",{"$f":"IF(HLOOKUP(3,$H$2:$J$19,11,FALSE)=$O111,$Q$3,FALSE)","v":false},{"$f":"IF(HLOOKUP(2,$H$2:$J$19,11,FALSE)=$O111,$R$3,FALSE)","v":"Haste"},{"$f":"IF(HLOOKUP(1,$H$2:$J$19,11,FALSE)=$O111,$S$3,FALSE)","v":false},false,"Haste"]
[{"$f":"MyNeck","v":"Gift of Nadun"},0,127,127,0,0,0,50,50,0,0,0,50,50,0,"None",{"$f":"IF(HLOOKUP(3,$H$2:$J$19,12,FALSE)=$O112,$Q$3,FALSE)","v":false},{"$f":"IF(HLOOKUP(2,$H$2:$J$19,12,FALSE)=$O112,$R$3,FALSE)","v":false},{"$f":"IF(HLOOKUP(1,$H$2:$J$19,12,FALSE)=$O112,$S$3,FALSE)","v":"Mastery"},"Hit","Mastery"]
[{"$f":"MyRing1","v":"Serrated Brimstone Signet"},0,156,144,0,0,0,62,57,0,0,0,57,62,0,"None",{"$f":"IF(HLOOKUP(3,$H$2:$J$19,13,FALSE)=$O113,$Q$3,FALSE)","v":false},{"$f":"IF(HLOOKUP(2,$H$2:$J$19,13,FALSE)=$O113,$R$3,FALSE)","v":false},{"$f":"IF(HLOOKUP(1,$H$2:$J$19,13,FALSE)=$O113,$S$3,FALSE)","v":"Mastery"},"Hit","Mastery"]
[{"$f":"MyRing2","v":"Alysrazor's Band"},0,0,107,0,150,0,0,42,0,90,150,90,150,90,"Reforge: Expertise to ",{"$f":"IF(HLOOKUP(3,$H$2:$J$19,14,FALSE)=$O114,$Q$3,FALSE)","v":false},{"$f":"IF(HLOOKUP(2,$H$2:$J$19,14,FALSE)=$O114,$R$3,FALSE)","v":false},{"$f":"IF(HLOOKUP(1,$H$2:$J$19,14,FALSE)=$O114,$S$3,FALSE)","v":false},false,false]
[{"$f":"MyTrinket1","v":"Essence of the Eternal Flame"},0,0,0,383,0,0,0,0,153,0,0,0,153,0,"None",{"$f":"IF(HLOOKUP(3,$H$2:$J$19,15,FALSE)=$O115,$Q$3,FALSE)","v":"Crit"},{"$f":"IF(HLOOKUP(2,$H$2:$J$19,15,FALSE)=$O115,$R$3,FALSE)","v":"Haste"},{"$f":"IF(HLOOKUP(1,$H$2:$J$19,15,FALSE)=$O115,$S$3,FALSE)","v":false},"Hit","Crit"]
[{"$f":"MyTrinket2","v":"Darkmoon Card: Hurricane"},0,0,0,0,0,0,0,0,0,0,0,0,0,0,"None",{"$f":"IF(HLOOKUP(3,$H$2:$J$19,16,FALSE)=$O116,$Q$3,FALSE)","v":"Crit"},{"$f":"IF(HLOOKUP(2,$H$2:$J$19,16,FALSE)=$O116,$R$3,FALSE)","v":"Haste"},{"$f":"IF(HLOOKUP(1,$H$2:$J$19,16,FALSE)=$O116,$S$3,FALSE)","v":"Mastery"},"Hit","Crit"]
[{"$f":"MyLibram","v":"Relic of the Elemental Lords"},0,83,86,0,0,0,33,34,0,0,0,33,34,0,"None",{"$f":"IF(HLOOKUP(3,$H$2:$J$19,17,FALSE)=$O117,$Q$3,FALSE)","v":false},{"$f":"IF(HLOOKUP(2,$H$2:$J$19,17,FALSE)=$O117,$R$3,FALSE)","v":false},{"$f":"IF(HLOOKUP(1,$H$2:$J$19,17,FALSE)=$O117,$S$3,FALSE)","v":"Mastery"},"Hit","Mastery"]
[{"$f":"MyWeapon","v":"Zoid's Firelit Greatsword"},0,284,232,0,0,0,113,92,0,0,0,92,113,0,"None",{"$f":"IF(HLOOKUP(3,$H$2:$J$19,18,FALSE)=$O118,$Q$3,FALSE)","v":false},{"$f":"IF(HLOOKUP(2,$H$2:$J$19,18,FALSE)=$O118,$R$3,FALSE)","v":false},{"$f":"IF(HLOOKUP(1,$H$2:$J$19,18,FALSE)=$O118,$S$3,FALSE)","v":"Mastery"},{"$f":"IF(G118=$O118,\"Hit\",FALSE)","v":"Hit"},"Mastery"]
[]
[null,null,null,null,null,null,null,{"$f":"IF(OR(StatPrio=\"Crit > Haste > Mastery\",StatPrio=\"Crit > Mastery > Haste\"),1,IF(OR(StatPrio=\"Mastery > Crit > Haste\",StatPrio=\"Haste > Crit > Mastery\"),2,3))","v":3},{"$f":"IF(OR(StatPrio=\"Haste > Mastery > Crit\",StatPrio=\"Haste > Crit > Mastery\"),1,IF(OR(StatPrio=\"Crit > Haste > Mastery\",StatPrio=\"Mastery > Haste > Crit\"),2,3))","v":2},{"$f":"IF(OR(StatPrio=\"Mastery > Haste > Crit\",StatPrio=\"Mastery > Crit > Haste\"),1,IF(OR(StatPrio=\"Crit > Mastery > Haste\",StatPrio=\"Haste > Mastery > Crit\"),2,3))","v":1},null,"Hit",null,null,null,null,null,3,2,1]
[null,null,null,null,null,null,"Hit","Crit","Haste","Mastery","WE","Unchanged","Min","Max",null,"Reforge for Hitcap","WE",{"$f":"HLOOKUP(3,$C$2:$E$3,2,FALSE)","v":"Crit"},{"$f":"HLOOKUP(2,$C$2:$E$3,2,FALSE)","v":"Haste"},{"$f":"HLOOKUP(1,$C$2:$E$3,2,FALSE)","v":"Mastery"},"Biggest Loser"]
[null,null,null,null,null,null,{"$f":"ROUNDDOWN((B103*0.6),0)","v":0},{"$f":"ROUNDDOWN((C103*0.4),0)","v":0},{"$f":"ROUNDDOWN((D103*0.4),0)","v":91},{"$f":"ROUNDDOWN((E103*0.4),0)","v":0},{"$f":"ROUNDUP((F103*0.4),0)","v":68},{"$f":"IF(P103=\"Reforge: Expertise to Hit\",G122,B103)","v":0},{"$f":"IF(P103=\"Reforge: Expertise to \",K122,IF(P103=\"None\",IF(G122>0,G122,LARGE(H122:J122,2)),IF(P103=\"Reforge: Hit to Expertise\",G122,IF(RIGHT(P103,3)=\"Expertise\",L122,0))))","v":68},{"$f":"IF(P103=\"Reforge: Expertise to \",K122,IF(P103=\"None\",IF(G122>0,B103,MAX(H122:K122)),IF(P103=\"Reforge: Hit to Expertise\",G122,IF(RIGHT(P103,3)=\"Expertise\",L122,0))))","v":68},68,{"$f":"IF(OR(RIGHT(P103,9)=\"Expertise\",O122=B103),P103,IF(O122=G122,IF(G122=0,P103,\"Reforge: Hit to \"),CONCATENATE(\"Reforge: \",U122,\" to Hit\")))","v":"Reforge: Expertise to Hit"},{"$f":"IF(AND(O122>0,O122=K122),\"Expertise\",FALSE)","v":"Expertise"},{"$f":"IF(HLOOKUP(3,$H$21:$J$38,3,FALSE)>0,$R$22,FALSE)","v":false},{"$f":"IF(HLOOKUP(2,$H$21:$J$38,3,FALSE)>0,$S$22,FALSE)","v":"Haste"},{"$f":"IF(HLOOKUP(1,$H$21:$J$38,3,FALSE)>0,$T$22,FALSE)","v":false},{"$f":"IF(P103=\"Reforge: Hit to \",\"Hit\",IF(AND(Q122=FALSE,R122=FALSE,S122=FALSE),T122,IF(AND(Q122=FALSE,R122=FALSE),S122,IF(Q122=FALSE,R122,Q122))))","v":"Expertise"}]
[null,null,null,null,null,null,{"$f":"ROUNDDOWN((B104*0.6),0)","v":89},0,67,0,{"$f":"ROUNDUP((F104*0.4),0)","v":0},{"$f":"IF(P104=\"Reforge: Expertise to Hit\",G123,B104)","v":149},89,149,89,{"$f":"IF(OR(RIGHT(P104,9)=\"Expertise\",O123=B104),P104,IF(O123=G123,IF(G123=0,P104,\"Reforge: Hit to \"),CONCATENATE(\"Reforge: \",U123,\" to Hit\")))","v":"Reforge: Hit to "},{"$f":"IF(AND(O123>0,O123=K123),\"Expertise\",FALSE)","v":false},{"$f":"IF(HLOOKUP(3,$H$21:$J$38,4,FALSE)>0,$R$22,FALSE)","v":false},{"$f":"IF(HLOOKUP(2,$H$21:$J$38,4,FALSE)>0,$S$22,FALSE)","v":"Haste"},{"$f":"IF(HLOOKUP(1,$H$21:$J$38,4,FALSE)>0,$T$22,FALSE)","v":false},{"$f":"IF(P104=\"Reforge: Hit to \",\"Hit\",IF(AND(Q123=FALSE,R123=FALSE,S123=FALSE),T123,IF(AND(Q123=FALSE,R123=FALSE),S123,IF(Q123=FALSE,R123,Q123))))","v":"Haste"}]
[null,null,null,null,null,null,0,0,94,0,108,{"$f":"IF(P105=\"Reforge: Expertise to Hit\",G124,B105)","v":0},108,108,108,"Reforge: Expertise to Hit",{"$f":"IF(AND(O124>0,O124=K124),\"Expertise\",FALSE)","v":"Expertise"},{"$f":"IF(HLOOKUP(3,$H$21:$J$38,5,FALSE)>0,$R$22,FALSE)","v":false},{"$f":"IF(HLOOKUP(2,$H$21:$J$38,5,FALSE)>0,$S$22,FALSE)","v":"Haste"},{"$f":"IF(HLOOKUP(1,$H$21:$J$38,5,FALSE)>0,$T$22,FALSE)","v":false},"Expertise"]
[null,null,null,null,null,null,0,90,0,109,0,0,90,109,90,"Reforge: Crit to Hit",false,{"$f":"IF(HLOOKUP(3,$H$21:$J$38,6,FALSE)>0,$R$22,FALSE)","v":"Crit"},{"$f":"IF(HLOOKUP(2,$H$21:$J$38,6,FALSE)>0,$S$22,FALSE)","v":false},{"$f":"IF(HLOOKUP(1,$H$21:$J$38,6,FALSE)>0,$T$22,FALSE)","v":"Mastery"},"Crit"]
[null,null,null,null,null,null,126,0,0,66,0,211,126,211,126,"Reforge: Hit to ",false,{"$f":"IF(HLOOKUP(3,$H$21:$J$38,7,FALSE)>0,$R$22,FALSE)","v":false},{"$f":"IF(HLOOKUP(2,$H$21:$J$38,7,FALSE)>0,$S$22,FALSE)","v":false},{"$f":"IF(HLOOKUP(1,$H$21:$J$38,7,FALSE)>0,$T$22,FALSE)","v":"Mastery"},"Mastery"]
[null,null,null,null,null,null,0,80,72,0,0,0,72,80,72,"Reforge: Crit to Hit",false,{"$f":"IF(HLOOKUP(3,$H$21:$J$38,8,FALSE)>0,$R$22,FALSE)","v":"Crit"},{"$f":"IF(HLOOKUP(2,$H$21:$J$38,8,FALSE)>0,$S$22,FALSE)","v":"Haste"},{"$f":"IF(HLOOKUP(1,$H$21:$J$38,8,FALSE)>0,$T$22,FALSE)","v":false},"Crit"]
[null,null,null,null,null,null,79,92,0,0,0,133,79,133,79,"Reforge: Hit to ",false,{"$f":"IF(HLOOKUP(3,$H$21:$J$38,9,FALSE)>0,$R$22,FALSE)","v":"Crit"},{"$f":"IF(HLOOKUP(2,$H$21:$J$38,9,FALSE)>0,$S$22,FALSE)","v":false},{"$f":"IF(HLOOKUP(1,$H$21:$J$38,9,FALSE)>0,$T$22,FALSE)","v":false},"Crit"]
[null,null,null,null,null,null,0,63,56,0,0,0,56,63,56,"Reforge: Crit to Hit",false,{"$f":"IF(HLOOKUP(3,$H$21:$J$38,10,FALSE)>0,$R$22,FALSE)","v":"Crit"},{"$f":"IF(HLOOKUP(2,$H$21:$J$38,10,FALSE)>0,$S$22,FALSE)","v":"Haste"},{"$f":"IF(HLOOKUP(1,$H$21:$J$38,10,FALSE)>0,$T$22,FALSE)","v":false},"Crit"]
[null,null,null,null,null,null,0,0,69,0,46,0,46,46,0,"Reforge: Expertise to ",false,{"$f":"IF(HLOOKUP(3,$H$21:$J$38,11,FALSE)>0,$R$22,FALSE)","v":false},{"$f":"IF(HLOOKUP(2,$H$21:$J$38,11,FALSE)>0,$S$22,FALSE)","v":"Haste"},{"$f":"IF(HLOOKUP(1,$H$21:$J$38,11,FALSE)>0,$T$22,FALSE)","v":false},"Haste"]
[null,null,null,null,null,null,0,50,50,0,0,0,50,50,50,"Reforge: Crit to Hit",false,{"$f":"IF(HLOOKUP(3,$H$21:$J$38,12,FALSE)>0,$R$22,FALSE)","v":"Crit"},{"$f":"IF(HLOOKUP(2,$H$21:$J$38,12,FALSE)>0,$S$22,FALSE)","v":"Haste"},{"$f":"IF(HLOOKUP(1,$H$21:$J$38,12,FALSE)>0,$T$22,FALSE)","v":false},"Crit"]
[null,null,null,null,null,null,0,62,57,0,0,0,57,62,0,"None",false,{"$f":"IF(HLOOKUP(3,$H$21:$J$38,13,FALSE)>0,$R$22,FALSE)","v":"Crit"},{"$f":"IF(HLOOKUP(2,$H$21:$J$38,13,FALSE)>0,$S$22,FALSE)","v":"Haste"},{"$f":"IF(HLOOKUP(1,$H$21:$J$38,13,FALSE)>0,$T$22,FALSE)","v":false},"Crit"]
[null,null,null,null,null,null,0,0,42,0,60,0,60,60,0,"Reforge: Expertise to ",false,{"$f":"IF(HLOOKUP(3,$H$21:$J$38,14,FALSE)>0,$R$22,FALSE)","v":false},{"$f":"IF(HLOOKUP(2,$H$21:$J$38,14,FALSE)>0,$S$22,FALSE)","v":"Haste"},{"$f":"IF(HLOOKUP(1,$H$21:$J$38,14,FALSE)>0,$T$22,FALSE)","v":false},"Haste"]
[null,null,null,null,null,null,0,0,0,153,0,0,0,153,153,"Reforge: Mastery to Hit",false,{"$f":"IF(HLOOKUP(3,$H$21:$J$38,15,FALSE)>0,$R$22,FALSE)","v":false},{"$f":"IF(HLOOKUP(2,$H$21:$J$38,15,FALSE)>0,$S$22,FALSE)","v":false},{"$f":"IF(HLOOKUP(1,$H$21:$J$38,15,FALSE)>0,$T$22,FALSE)","v":"Mastery"},"Mastery"]
[null,null,null,null,null,null,0,0,0,0,0,0,0,0,0,"None",false,{"$f":"IF(HLOOKUP(3,$H$21:$J$38,16,FALSE)>0,$R$22,FALSE)","v":false},{"$f":"IF(HLOOKUP(2,$H$21:$J$38,16,FALSE)>0,$S$22,FALSE)","v":false},{"$f":"IF(HLOOKUP(1,$H$21:$J$38,16,FALSE)>0,$T$22,FALSE)","v":false},false]
[null,null,null,null,null,null,0,33,34,0,0,0,33,34,0,"None",false,{"$f":"IF(HLOOKUP(3,$H$21:$J$38,17,FALSE)>0,$R$22,FALSE)","v":"Crit"},{"$f":"IF(HLOOKUP(2,$H$21:$J$38,17,FALSE)>0,$S$22,FALSE)","v":"Haste"},{"$f":"IF(HLOOKUP(1,$H$21:$J$38,17,FALSE)>0,$T$22,FALSE)","v":false},"Crit"]
[null,null,null,null,null,null,0,113,92,0,0,{"$f":"IF(P118=\"Reforge: Expertise to Hit\",G137,B118)","v":0},92,113,0,"None",{"$f":"IF(AND(O137>0,O137=K137),\"Expertise\",FALSE)","v":false},{"$f":"IF(HLOOKUP(3,$H$21:$J$38,18,FALSE)>0,$R$22,FALSE)","v":"Crit"},{"$f":"IF(HLOOKUP(2,$H$21:$J$38,18,FALSE)>0,$S$22,FALSE)","v":"Haste"},{"$f":"IF(HLOOKUP(1,$H$21:$J$38,18,FALSE)>0,$T$22,FALSE)","v":false},"Crit"]
[]
[null,null,null,null,null,null,null,null,null,null,null,null,null,null,null,null,null,1,2,3]
[null,null,null,null,null,null,null,null,null,null,null,null,null,null,null,"Complete \"Hit/Exp to\"",null,{"$f":"HLOOKUP(1,$C$2:$E$3,2,FALSE)","v":"Mastery"},{"$f":"HLOOKUP(2,$C$2:$E$3,2,FALSE)","v":"Haste"},{"$f":"HLOOKUP(3,$C$2:$E$3,2,FALSE)","v":"Crit"},"Biggest Winner"]
[null,null,null,null,null,null,null,null,null,null,null,null,null,null,null,{"$f":"IF(OR(P122=\"Reforge: Hit to \",P122=\"Reforge: Expertise to \"),CONCATENATE(P122,U141),P122)","v":"Reforge: Expertise to Hit"},null,{"$f":"IF(HLOOKUP(1,$H$21:$J$38,3,FALSE)>0,$R$41,FALSE)","v":false},{"$f":"IF(HLOOKUP(2,$H$21:$J$38,3,FALSE)>0,$S$41,FALSE)","v":"Haste"},{"$f":"IF(HLOOKUP(3,$H$21:$J$38,3,FALSE)>0,$T$41,FALSE)","v":false},{"$f":"IF(R141=FALSE,$R$41,IF(S141=FALSE,$S$41,$T$41))","v":"Mastery"}]
[null,null,null,null,null,null,null,null,null,null,null,null,null,null,null,{"$f":"IF(OR(P123=\"Reforge: Hit to \",P123=\"Reforge: Expertise to \"),CONCATENATE(P123,U142),P123)","v":"Reforge: Hit to Mastery"},null,{"$f":"IF(HLOOKUP(1,$H$21:$J$38,4,FALSE)>0,$R$41,FALSE)","v":false},{"$f":"IF(HLOOKUP(2,$H$21:$J$38,4,FALSE)>0,$S$41,FALSE)","v":"Haste"},{"$f":"IF(HLOOKUP(3,$H$21:$J$38,4,FALSE)>0,$T$41,FALSE)","v":false},{"$f":"IF(R142=FALSE,$R$41,IF(S142=FALSE,$S$41,$T$41))","v":"Mastery"}]
[null,null,null,null,null,null,null,null,null,null,null,null,null,null,null,"Reforge: Expertise to Hit",null,{"$f":"IF(HLOOKUP(1,$H$21:$J$38,5,FALSE)>0,$R$41,FALSE)","v":false},{"$f":"IF(HLOOKUP(2,$H$21:$J$38,5,FALSE)>0,$S$41,FALSE)","v":"Haste"},{"$f":"IF(HLOOKUP(3,$H$21:$J$38,5,FALSE)>0,$T$41,FALSE)","v":false},"Mastery"]
[null,null,null,null,null,null,null,null,null,null,null,null,null,null,null,"Reforge: Crit to Hit",null,{"$f":"IF(HLOOKUP(1,$H$21:$J$38,6,FALSE)>0,$R$41,FALSE)","v":"Mastery"},{"$f":"IF(HLOOKUP(2,$H$21:$J$38,6,FALSE)>0,$S$41,FALSE)","v":false},{"$f":"IF(HLOOKUP(3,$H$21:$J$38,6,FALSE)>0,$T$41,FALSE)","v":"Crit"},"Haste"]
[null,null,null,null,null,null,null,null,null,null,null,null,null,null,null,"Reforge: Hit to Haste",null,{"$f":"IF(HLOOKUP(1,$H$21:$J$38,7,FALSE)>0,$R$41,FALSE)","v":"Mastery"},{"$f":"IF(HLOOKUP(2,$H$21:$J$38,7,FALSE)>0,$S$41,FALSE)","v":false},{"$f":"IF(HLOOKUP(3,$H$21:$J$38,7,FALSE)>0,$T$41,FALSE)","v":false},"Haste"]
[null,null,null,null,null,null,null,null,null,null,null,null,null,null,null,"Reforge: Crit to Hit",null,{"$f":"IF(HLOOKUP(1,$H$21:$J$38,8,FALSE)>0,$R$41,FALSE)","v":false},{"$f":"IF(HLOOKUP(2,$H$21:$J$38,8,FALSE)>0,$S$41,FALSE)","v":"Haste"},{"$f":"IF(HLOOKUP(3,$H$21:$J$38,8,FALSE)>0,$T$41,FALSE)","v":"Crit"},"Mastery"]
[null,null,null,null,null,null,null,null,null,null,null,null,null,null,null,"Reforge: Hit to Mastery",null,{"$f":"IF(HLOOKUP(1,$H$21:$J$38,9,FALSE)>0,$R$41,FALSE)","v":false},{"$f":"IF(HLOOKUP(2,$H$21:$J$38,9,FALSE)>0,$S$41,FALSE)","v":false},{"$f":"IF(HLOOKUP(3,$H$21:$J$38,9,FALSE)>0,$T$41,FALSE)","v":"Crit"},"Mastery"]
[null,null,null,null,null,null,null,null,null,null,null,null,null,null,null,"Reforge: Crit to Hit",null,{"$f":"IF(HLOOKUP(1,$H$21:$J$38,10,FALSE)>0,$R$41,FALSE)","v":false},{"$f":"IF(HLOOKUP(2,$H$21:$J$38,10,FALSE)>0,$S$41,FALSE)","v":"Haste"},{"$f":"IF(HLOOKUP(3,$H$21:$J$38,10,FALSE)>0,$T$41,FALSE)","v":"Crit"},"Mastery"]
[null,null,null,null,null,null,null,null,null,null,null,null,null,null,null,"Reforge: Expertise to Mastery",null,{"$f":"IF(HLOOKUP(1,$H$21:$J$38,11,FALSE)>0,$R$41,FALSE)","v":false},{"$f":"IF(HLOOKUP(2,$H$21:$J$38,11,FALSE)>0,$S$41,FALSE)","v":"Haste"},{"$f":"IF(HLOOKUP(3,$H$21:$J$38,11,FALSE)>0,$T$41,FALSE)","v":false},"Mastery"]
[null,null,null,null,null,null,null,null,null,null,null,null,null,null,null,"Reforge: Crit to Hit",null,{"$f":"IF(HLOOKUP(1,$H$21:$J$38,12,FALSE)>0,$R$41,FALSE)","v":false},{"$f":"IF(HLOOKUP(2,$H$21:$J$38,12,FALSE)>0,$S$41,FALSE)","v":"Haste"},{"$f":"IF(HLOOKUP(3,$H$21:$J$38,12,FALSE)>0,$T$41,FALSE)","v":"Crit"},"Mastery"]
[null,null,null,null,null,null,null,null,null,null,null,null,null,null,null,"None",null,{"$f":"IF(HLOOKUP(1,$H$21:$J$38,13,FALSE)>0,$R$41,FALSE)","v":false},{"$f":"IF(HLOOKUP(2,$H$21:$J$38,13,FALSE)>0,$S$41,FALSE)","v":"Haste"},{"$f":"IF(HLOOKUP(3,$H$21:$J$38,13,FALSE)>0,$T$41,FALSE)","v":"Crit"},"Mastery"]
[null,null,null,null,null,null,null,null,null,null,null,null,null,null,null,"Reforge: Expertise to Mastery",null,{"$f":"IF(HLOOKUP(1,$H$21:$J$38,14,FALSE)>0,$R$41,FALSE)","v":false},{"$f":"IF(HLOOKUP(2,$H$21:$J$38,14,FALSE)>0,$S$41,FALSE)","v":"Haste"},{"$f":"IF(HLOOKUP(3,$H$21:$J$38,14,FALSE)>0,$T$41,FALSE)","v":false},"Mastery"]
[null,null,null,null,null,null,null,null,null,null,null,null,null,null,null,"Reforge: Mastery to Hit",null,{"$f":"IF(HLOOKUP(1,$H$21:$J$38,15,FALSE)>0,$R$41,FALSE)","v":"Mastery"},{"$f":"IF(HLOOKUP(2,$H$21:$J$38,15,FALSE)>0,$S$41,FALSE)","v":false},{"$f":"IF(HLOOKUP(3,$H$21:$J$38,15,FALSE)>0,$T$41,FALSE)","v":false},"Haste"]
[null,null,null,null,null,null,null,null,null,null,null,null,null,null,null,"None",null,{"$f":"IF(HLOOKUP(1,$H$21:$J$38,16,FALSE)>0,$R$41,FALSE)","v":false},{"$f":"IF(HLOOKUP(2,$H$21:$J$38,16,FALSE)>0,$S$41,FALSE)","v":false},{"$f":"IF(HLOOKUP(3,$H$21:$J$38,16,FALSE)>0,$T$41,FALSE)","v":false},"Mastery"]
[null,null,null,null,null,null,null,null,null,null,null,null,null,null,null,"None",null,{"$f":"IF(HLOOKUP(1,$H$21:$J$38,17,FALSE)>0,$R$41,FALSE)","v":false},{"$f":"IF(HLOOKUP(2,$H$21:$J$38,17,FALSE)>0,$S$41,FALSE)","v":"Haste"},{"$f":"IF(HLOOKUP(3,$H$21:$J$38,17,FALSE)>0,$T$41,FALSE)","v":"Crit"},"Mastery"]
[null,null,null,null,null,null,null,null,null,null,null,null,null,null,null,"None",null,{"$f":"IF(HLOOKUP(1,$H$21:$J$38,18,FALSE)>0,$R$41,FALSE)","v":false},{"$f":"IF(HLOOKUP(2,$H$21:$J$38,18,FALSE)>0,$S$41,FALSE)","v":"Haste"},{"$f":"IF(HLOOKUP(3,$H$21:$J$38,18,FALSE)>0,$T$41,FALSE)","v":"Crit"},"Mastery"]
[]
[null,null,null,null,null,null,null,null,null,null,null,null,null,null,null,null,null,3,2,1]
[null,null,null,null,null,null,null,null,null,null,null,null,null,null,null,"Auto Reforge Recommendation",null,{"$f":"HLOOKUP(3,$C$2:$E$3,2,FALSE)","v":"Crit"},{"$f":"HLOOKUP(2,$C$2:$E$3,2,FALSE)","v":"Haste"},{"$f":"HLOOKUP(1,$C$2:$E$3,2,FALSE)","v":"Mastery"}]
[null,null,null,null,null,null,null,null,null,null,null,null,null,null,null,{"$f":"IF(P141=\"None\",U160,P141)","v":"Reforge: Expertise to Hit"},null,{"$f":"IF(HLOOKUP(3,$H$21:$J$38,3,FALSE)>0,$R$22,FALSE)","v":false},{"$f":"IF(HLOOKUP(2,$H$21:$J$38,3,FALSE)>0,$S$22,FALSE)","v":"Haste"},{"$f":"IF(HLOOKUP(1,$H$21:$J$38,3,FALSE)>0,$T$22,FALSE)","v":false},{"$f":"IF(AND(R160=$R$60,T160=FALSE),CONCATENATE(\"Reforge: \",$R$60, \" to \",$T$60),IF(AND(R160=$R$60,S160=FALSE),CONCATENATE(\"Reforge: \",$R$60, \" to \",$S$60),IF(AND(S160=$S$60,T160=FALSE),CONCATENATE(\"Reforge: \",$S$60, \" to \",$T$60),\"None\")))","v":"Reforge: Haste to Mastery"}]
[null,null,null,null,null,null,null,null,null,null,null,null,null,null,null,{"$f":"IF(P142=\"None\",U161,P142)","v":"Reforge: Hit to Mastery"},null,{"$f":"IF(HLOOKUP(3,$H$21:$J$38,4,FALSE)>0,$R$22,FALSE)","v":false},{"$f":"IF(HLOOKUP(2,$H$21:$J$38,4,FALSE)>0,$S$22,FALSE)","v":"Haste"},{"$f":"IF(HLOOKUP(1,$H$21:$J$38,4,FALSE)>0,$T$22,FALSE)","v":false},{"$f":"IF(AND(R161=$R$60,T161=FALSE),CONCATENATE(\"Reforge: \",$R$60, \" to \",$T$60),IF(AND(R161=$R$60,S161=FALSE),CONCATENATE(\"Reforge: \",$R$60, \" to \",$S$60),IF(AND(S161=$S$60,T161=FALSE),CONCATENATE(\"Reforge: \",$S$60, \" to \",$T$60),\"None\")))","v":"Reforge: Haste to Mastery"}]
[null,null,null,null,null,null,null,null,null,null,null,null,null,null,null,"Reforge: Expertise to Hit",null,{"$f":"IF(HLOOKUP(3,$H$21:$J$38,5,FALSE)>0,$R$22,FALSE)","v":false},{"$f":"IF(HLOOKUP(2,$H$21:$J$38,5,FALSE)>0,$S$22,FALSE)","v":"Haste"},{"$f":"IF(HLOOKUP(1,$H$21:$J$38,5,FALSE)>0,$T$22,FALSE)","v":false},"Reforge: Haste to Mastery"]
[null,null,null,null,null,null,null,null,null,null,null,null,null,null,null,"Reforge: Crit to Hit",null,{"$f":"IF(HLOOKUP(3,$H$21:$J$38,6,FALSE)>0,$R$22,FALSE)","v":"Crit"},{"$f":"IF(HLOOKUP(2,$H$21:$J$38,6,FALSE)>0,$S$22,FALSE)","v":false},{"$f":"IF(HLOOKUP(1,$H$21:$J$38,6,FALSE)>0,$T$22,FALSE)","v":"Mastery"},"Reforge: Crit to Haste"]
[null,null,null,null,null,null,null,null,null,null,null,null,null,null,null,"Reforge: Hit to Haste",null,{"$f":"IF(HLOOKUP(3,$H$21:$J$38,7,FALSE)>0,$R$22,FALSE)","v":false},{"$f":"IF(HLOOKUP(2,$H$21:$J$38,7,FALSE)>0,$S$22,FALSE)","v":false},{"$f":"IF(HLOOKUP(1,$H$21:$J$38,7,FALSE)>0,$T$22,FALSE)","v":"Mastery"},"None"]
[null,null,null,null,null,null,null,null,null,null,null,null,null,null,null,"Reforge: Crit to Hit",null,{"$f":"IF(HLOOKUP(3,$H$21:$J$38,8,FALSE)>0,$R$22,FALSE)","v":"Crit"},{"$f":"IF(HLOOKUP(2,$H$21:$J$38,8,FALSE)>0,$S$22,FALSE)","v":"Haste"},{"$f":"IF(HLOOKUP(1,$H$21:$J$38,8,FALSE)>0,$T$22,FALSE)","v":false},"Reforge: Crit to Mastery"]
[null,null,null,null,null,null,null,null,null,null,null,null,null,null,null,"Reforge: Hit to Mastery",null,{"$f":"IF(HLOOKUP(3,$H$21:$J$38,9,FALSE)>0,$R$22,FALSE)","v":"Crit"},{"$f":"IF(HLOOKUP(2,$H$21:$J$38,9,FALSE)>0,$S$22,FALSE)","v":false},{"$f":"IF(HLOOKUP(1,$H$21:$J$38,9,FALSE)>0,$T$22,FALSE)","v":false},"Reforge: Crit to Mastery"]
[null,null,null,null,null,null,null,null,null,null,null,null,null,null,null,"Reforge: Crit to Hit",null,{"$f":"IF(HLOOKUP(3,$H$21:$J$38,10,FALSE)>0,$R$22,FALSE)","v":"Crit"},{"$f":"IF(HLOOKUP(2,$H$21:$J$38,10,FALSE)>0,$S$22,FALSE)","v":"Haste"},{"$f":"IF(HLOOKUP(1,$H$21:$J$38,10,FALSE)>0,$T$22,FALSE)","v":false},"Reforge: Crit to Mastery"]
[null,null,null,null,null,null,null,null,null,null,null,null,null,null,null,"Reforge: Expertise to Mastery",null,{"$f":"IF(HLOOKUP(3,$H$21:$J$38,11,FALSE)>0,$R$22,FALSE)","v":false},{"$f":"IF(HLOOKUP(2,$H$21:$J$38,11,FALSE)>0,$S$22,FALSE)","v":"Haste"},{"$f":"IF(HLOOKUP(1,$H$21:$J$38,11,FALSE)>0,$T$22,FALSE)","v":false},"Reforge: Haste to Mastery"]
[null,null,null,null,null,null,null,null,null,null,null,null,null,null,null,"Reforge: Crit to Hit",null,{"$f":"IF(HLOOKUP(3,$H$21:$J$38,12,FALSE)>0,$R$22,FALSE)","v":"Crit"},{"$f":"IF(HLOOKUP(2,$H$21:$J$38,12,FALSE)>0,$S$22,FALSE)","v":"Haste"},{"$f":"IF(HLOOKUP(1,$H$21:$J$38,12,FALSE)>0,$T$22,FALSE)","v":false},"Reforge: Crit to Mastery"]
[null,null,null,null,null,null,null,null,null,null,null,null,null,null,null,"Reforge: Crit to Mastery",null,{"$f":"IF(HLOOKUP(3,$H$21:$J$38,13,FALSE)>0,$R$22,FALSE)","v":"Crit"},{"$f":"IF(HLOOKUP(2,$H$21:$J$38,13,FALSE)>0,$S$22,FALSE)","v":"Haste"},{"$f":"IF(HLOOKUP(1,$H$21:$J$38,13,FALSE)>0,$T$22,FALSE)","v":false},"Reforge: Crit to Mastery"]
[null,null,null,null,null,null,null,null,null,null,null,null,null,null,null,"Reforge: Expertise to Mastery",null,{"$f":"IF(HLOOKUP(3,$H$21:$J$38,14,FALSE)>0,$R$22,FALSE)","v":false},{"$f":"IF(HLOOKUP(2,$H$21:$J$38,14,FALSE)>0,$S$22,FALSE)","v":"Haste"},{"$f":"IF(HLOOKUP(1,$H$21:$J$38,14,FALSE)>0,$T$22,FALSE)","v":false},"Reforge: Haste to Mastery"]
[null,null,null,null,null,null,null,null,null,null,null,null,null,null,null,"Reforge: Mastery to Hit",null,{"$f":"IF(HLOOKUP(3,$H$21:$J$38,15,FALSE)>0,$R$22,FALSE)","v":false},{"$f":"IF(HLOOKUP(2,$H$21:$J$38,15,FALSE)>0,$S$22,FALSE)","v":false},{"$f":"IF(HLOOKUP(1,$H$21:$J$38,15,FALSE)>0,$T$22,FALSE)","v":"Mastery"},"None"]
[null,null,null,null,null,null,null,null,null,null,null,null,null,null,null,"None",null,{"$f":"IF(HLOOKUP(3,$H$21:$J$38,16,FALSE)>0,$R$22,FALSE)","v":false},{"$f":"IF(HLOOKUP(2,$H$21:$J$38,16,FALSE)>0,$S$22,FALSE)","v":false},{"$f":"IF(HLOOKUP(1,$H$21:$J$38,16,FALSE)>0,$T$22,FALSE)","v":false},"None"]
[null,null,null,null,null,null,null,null,null,null,null,null,null,null,null,"Reforge: Crit to Mastery",null,{"$f":"IF(HLOOKUP(3,$H$21:$J$38,17,FALSE)>0,$R$22,FALSE)","v":"Crit"},{"$f":"IF(HLOOKUP(2,$H$21:$J$38,17,FALSE)>0,$S$22,FALSE)","v":"Haste"},{"$f":"IF(HLOOKUP(1,$H$21:$J$38,17,FALSE)>0,$T$22,FALSE)","v":false},"Reforge: Crit to Mastery"]
[null,null,null,null,null,null,null,null,null,null,null,null,null,null,null,"Reforge: Crit to Mastery",null,{"$f":"IF(HLOOKUP(3,$H$21:$J$38,18,FALSE)>0,$R$22,FALSE)","v":"Crit"},{"$f":"IF(HLOOKUP(2,$H$21:$J$38,18,FALSE)>0,$S$22,FALSE)","v":"Haste"},{"$f":"IF(HLOOKUP(1,$H$21:$J$38,18,FALSE)>0,$T$22,FALSE)","v":false},"Reforge: Crit to Mastery"]

{"sheet":"Graph","index":5,"n_rows":303,"n_cols":24,"rows_kept":303,"cut":false,"hidden":false,"merged":[[2,22,3,22],[2,23,3,23],[3,20,3,21],[12,20,12,21],[1,10,2,11],[1,12,2,12],[1,14,2,19],[4,20,4,21],[9,20,9,21],[7,20,7,21],[8,20,8,21],[5,20,5,21],[6,20,6,21],[11,20,11,21]]}
[]
[null,null,null,null,null,null,null,null,null,null,"Graph Scale",null,1,null,{"$f":"IF(OR(Verify3=Verify1,StrDPSGain=0),\"\",\"Settings changed, you should re-run the graph.\")","v":""}]
[null,null,null,null,null,null,null,null,null,null,null,null,null,null,null,null,null,null,null,null,null,null,"DPS Increase per point","Stat Weight"]
[null,null,null,null,null,null,null,null,null,null,null,null,null,null,null,null,null,null,null,null,"Stat"]
[null,null,null,null,null,null,null,null,null,null,null,null,null,null,null,null,null,null,null,null,"Strength",null,{"$f":"C303/B303","v":0},1]
[null,null,null,null,null,null,null,null,null,null,null,null,null,null,null,null,null,null,null,null,"Hit",null,{"$f":"D303/B303","v":0},{"$f":"W6/W5","v":{"$error":"#DIV/0!"}}]
[null,null,null,null,null,null,null,null,null,null,null,null,null,null,null,null,null,null,null,null,"Crit",null,{"$f":"E303/B303","v":0},{"$f":"W7/W5","v":{"$error":"#DIV/0!"}}]
[null,null,null,null,null,null,null,null,null,null,null,null,null,null,null,null,null,null,null,null,"Haste",null,{"$f":"F303/B303","v":0},{"$f":"W8/W5","v":{"$error":"#DIV/0!"}}]
[null,null,null,null,null,null,null,null,null,null,null,null,null,null,null,null,null,null,null,null,"Mastery",null,{"$f":"G303/B303","v":0},{"$f":"W9/W5","v":{"$error":"#DIV/0!"}}]
[null,null,null,null,null,null,null,null,null,null,null,null,null,null,null,null,null,null,null,null,"WE",null,{"$f":"H303/B303","v":0},{"$f":"W10/W5","v":{"$error":"#DIV/0!"}}]
[]
[null,null,null,null,null,null,null,null,null,null,null,null,null,null,null,null,null,null,null,null,"Weaponspeed",null,0,{"$f":"W12/W5","v":{"$error":"#DIV/0!"}}]
[null,null,null,null,null,null,null,null,null,null,null,null,null,null,null,null,null,null,null,null,"Weapon DPS",null,0,{"$f":"W13/W5","v":{"$error":"#DIV/0!"}}]
[]
[]
[]
[]
[]
[]
[]
[]
[]
[]
[]
[]
[]
[]
[]
[]
[]
[]
[]
[]
[]
[]
[]
[]
[]
[]
[]
[]
[]
[]
[]
[]
[]
[]
[]
[]
[]
[]
[]
[]
[]
[]
[]
[]
[]
[]
[]
[]
[]
[]
[]
[]
[]
[]
[]
[]
[]
[]
[]
[]
[]
[]
[]
[]
[]
[]
[]
[]
[]
[]
[]
[]
[]
[]
[]
[]
[]
[]
[]
[]
[]
[]
[]
[]
[]
[]
[]
[]
[]
[]
[]
[]
[]
[]
[]
[]
[]
[]
[]
[]
[]
[]
[]
[]
[]
[]
[]
[]
[]
[]
[]
[]
[]
[]
[]
[]
[]
[]
[]
[]
[]
[]
[]
[]
[]
[]
[]
[]
[]
[]
[]
[]
[]
[]
[]
[]
[]
[]
[]
[]
[]
[]
[]
[]
[]
[]
[]
[]
[]
[]
[]
[]
[]
[]
[]
[]
[]
[]
[]
[]
[]
[]
[]
[]
[]
[]
[]
[]
[]
[]
[]
[]
[]
[]
[]
[]
[]
[]
[]
[]
[]
[]
[]
[]
[]
[]
[]
[null,"Item Point",{"$f":"\"Str (\" & SealSelection & \")\"","v":"Str (SoT)"},{"$f":"\"Hit (\" & SealSelection & \")\"","v":"Hit (SoT)"},{"$f":"\"Crit (\" & SealSelection & \")\"","v":"Crit (SoT)"},{"$f":"\"Haste (\" & SealSelection & \")\"","v":"Haste (SoT)"},{"$f":"\"Mastery (\" & SealSelection & \")\"","v":"Mastery (SoT)"},{"$f":"\"WE (\" & SealSelection & \")\"","v":"WE (SoT)"}]
[null,0,0,0,0,0,0,0,0]
[null,{"$f":"GraphScale * I203","v":1},null,null,null,null,null,null,1]
[null,2,null,null,null,null,null,null,2]
[null,3,null,null,null,null,null,null,3]
[null,4,null,null,null,null,null,null,4]
[null,5,null,null,null,null,null,null,5]
[null,6,null,null,null,null,null,null,6]
[null,7,null,null,null,null,null,null,7]
[null,8,null,null,null,null,null,null,8]
[null,9,null,null,null,null,null,null,9]
[null,10,null,null,null,null,null,null,10]
[null,11,null,null,null,null,null,null,11]
[null,12,null,null,null,null,null,null,12]
[null,13,null,null,null,null,null,null,13]
[null,14,null,null,null,null,null,null,14]
[null,15,null,null,null,null,null,null,15]
[null,16,null,null,null,null,null,null,16]
[null,17,null,null,null,null,null,null,17]
[null,18,null,null,null,null,null,null,18]
[null,19,null,null,null,null,null,null,19]
[null,20,null,null,null,null,null,null,20]
[null,21,null,null,null,null,null,null,21]
[null,22,null,null,null,null,null,null,22]
[null,23,null,null,null,null,null,null,23]
[null,24,null,null,null,null,null,null,24]
[null,25,null,null,null,null,null,null,25]
[null,26,null,null,null,null,null,null,26]
[null,27,null,null,null,null,null,null,27]
[null,28,null,null,null,null,null,null,28]
[null,29,null,null,null,null,null,null,29]
[null,30,null,null,null,null,null,null,30]
[null,31,null,null,null,null,null,null,31]
[null,32,null,null,null,null,null,null,32]
[null,{"$f":"GraphScale * I235","v":33},null,null,null,null,null,null,33]
[null,34,null,null,null,null,null,null,34]
[null,35,null,null,null,null,null,null,35]
[null,36,null,null,null,null,null,null,36]
[null,37,null,null,null,null,null,null,37]
[null,38,null,null,null,null,null,null,38]
[null,39,null,null,null,null,null,null,39]
[null,40,null,null,null,null,null,null,40]
[null,41,null,null,null,null,null,null,41]
[null,42,null,null,null,null,null,null,42]
[null,43,null,null,null,null,null,null,43]
[null,44,null,null,null,null,null,null,44]
[null,45,null,null,null,null,null,null,45]
[null,46,null,null,null,null,null,null,46]
[null,47,null,null,null,null,null,null,47]
[null,48,null,null,null,null,null,null,48]
[null,49,null,null,null,null,null,null,49]
[null,50,null,null,null,null,null,null,50]
[null,51,null,null,null,null,null,null,51]
[null,52,null,null,null,null,null,null,52]
[null,53,null,null,null,null,null,null,53]
[null,54,null,null,null,null,null,null,54]
[null,55,null,null,null,null,null,null,55]
[null,56,null,null,null,null,null,null,56]
[null,57,null,null,null,null,null,null,57]
[null,58,null,null,null,null,null,null,58]
[null,59,null,null,null,null,null,null,59]
[null,60,null,null,null,null,null,null,60]
[null,61,null,null,null,null,null,null,61]
[null,62,null,null,null,null,null,null,62]
[null,63,null,null,null,null,null,null,63]
[null,64,null,null,null,null,null,null,64]
[null,{"$f":"GraphScale * I267","v":65},null,null,null,null,null,null,65]
[null,66,null,null,null,null,null,null,66]
[null,67,null,null,null,null,null,null,67]
[null,68,null,null,null,null,null,null,68]
[null,69,null,null,null,null,null,null,69]
[null,70,null,null,null,null,null,null,70]
[null,71,null,null,null,null,null,null,71]
[null,72,null,null,null,null,null,null,72]
[null,73,null,null,null,null,null,null,73]
[null,74,null,null,null,null,null,null,74]
[null,75,null,null,null,null,null,null,75]
[null,76,null,null,null,null,null,null,76]
[null,77,null,null,null,null,null,null,77]
[null,78,null,null,null,null,null,null,78]
[null,79,null,null,null,null,null,null,79]
[null,80,null,null,null,null,null,null,80]
[null,81,null,null,null,null,null,null,81]
[null,82,null,null,null,null,null,null,82]
[null,83,null,null,null,null,null,null,83]
[null,84,null,null,null,null,null,null,84]
[null,85,null,null,null,null,null,null,85]
[null,86,null,null,null,null,null,null,86]
[null,87,null,null,null,null,null,null,87]
[null,88,null,null,null,null,null,null,88]
[null,89,null,null,null,null,null,null,89]
[null,90,null,null,null,null,null,null,90]
[null,91,null,null,null,null,null,null,91]
[null,92,null,null,null,null,null,null,92]
[null,93,null,null,null,null,null,null,93]
[null,94,null,null,null,null,null,null,94]
[null,95,null,null,null,null,null,null,95]
[null,96,null,null,null,null,null,null,96]
[null,97,null,null,null,null,null,null,97]
[null,98,null,null,null,null,null,null,98]
[null,99,null,null,null,null,null,null,99]
[null,100,null,null,null,null,null,null,100]
[null,{"$f":"AVERAGE(B202:B302)","v":50},{"$f":"AVERAGE(C202:C302)","v":0},{"$f":"AVERAGE(D202:D302)","v":0},0,0,0,0]

{"sheet":"Priority","index":6,"n_rows":43,"n_cols":9,"rows_kept":43,"cut":false,"hidden":false,"merged":[[0,2,0,3]]}
[null,null,"--- Suggested Priority ---"]
[null,null,0,{"$f":"IF(ROUND(LastDPSValue,2)=ROUND(TotalDPS,2),\"Inquisition\",\"Recalculate\")","v":"Recalculate"}]
[null,null,1,{"$f":"SuggestedAbility1","v":""}]
[null,null,2,{"$f":"SuggestedAbility2","v":""}]
[null,null,3,{"$f":"SuggestedAbility3","v":""}]
[null,null,4,{"$f":"SuggestedAbility4","v":""}]
[null,null,5,{"$f":"SuggestedAbility5","v":""}]
[null,null,6,{"$f":"SuggestedAbility6","v":""}]
[null,null,7,{"$f":"SuggestedAbility7","v":""}]
[]
["Ability 1","Ability 2","Ability 3","Ability 4","DPS"]
["Crusader Strike","Templar's Verdict","Exorcism","Hammer of Wrath",24867.299056311829,"Crusader Strike","Templar's Verdict","Exorcism","Hammer of Wrath"]
["Crusader Strike","Templar's Verdict","Hammer of Wrath","Exorcism",24945.855105025734,"Crusader Strike","Templar's Verdict","Hammer of Wrath","Exorcism"]
["Crusader Strike","Exorcism","Templar's Verdict","Hammer of Wrath",25090.20959301891,"Crusader Strike","Exorcism","Templar's Verdict","Hammer of Wrath"]
["Crusader Strike","Exorcism","Hammer of Wrath","Templar's Verdict",25272.282281319327,"Crusader Strike","Exorcism","Hammer of Wrath","Templar's Verdict"]
["Crusader Strike","Hammer of Wrath","Templar's Verdict","Exorcism",25115.947699188531,"Crusader Strike","Hammer of Wrath","Templar's Verdict","Exorcism"]
["Crusader Strike","Hammer of Wrath","Exorcism","Templar's Verdict",25365.651242491032,"Crusader Strike","Hammer of Wrath","Exorcism","Templar's Verdict"]
["Templar's Verdict","Crusader Strike","Hammer of Wrath","Exorcism",23703.541709255438,"Templar's Verdict","Crusader Strike","Hammer of Wrath","Exorcism"]
["Templar's Verdict","Crusader Strike","Exorcism","Hammer of Wrath",23630.679355956199,"Templar's Verdict","Crusader Strike","Exorcism","Hammer of Wrath"]
["Templar's Verdict","Exorcism","Hammer of Wrath","Crusader Strike",22957.458334338586,"Templar's Verdict","Exorcism","Hammer of Wrath","Crusader Strike"]
["Templar's Verdict","Exorcism","Crusader Strike","Hammer of Wrath",23096.949013918671,"Templar's Verdict","Exorcism","Crusader Strike","Hammer of Wrath"]
["Templar's Verdict","Hammer of Wrath","Exorcism","Crusader Strike",23009.96646672791,"Templar's Verdict","Hammer of Wrath","Exorcism","Crusader Strike"]
["Templar's Verdict","Hammer of Wrath","Crusader Strike","Exorcism",23544.95060699408,"Templar's Verdict","Hammer of Wrath","Crusader Strike","Exorcism"]
["Exorcism","Crusader Strike","Templar's Verdict","Hammer of Wrath",24471.789148142936,"Exorcism","Crusader Strike","Templar's Verdict","Hammer of Wrath"]
["Exorcism","Crusader Strike","Hammer of Wrath","Templar's Verdict",24646.933077357124,"Exorcism","Crusader Strike","Hammer of Wrath","Templar's Verdict"]
["Exorcism","Templar's Verdict","Crusader Strike","Hammer of Wrath",23356.678159422674,"Exorcism","Templar's Verdict","Crusader Strike","Hammer of Wrath"]
["Exorcism","Templar's Verdict","Hammer of Wrath","Crusader Strike",23196.949986169067,"Exorcism","Templar's Verdict","Hammer of Wrath","Crusader Strike"]
["Exorcism","Hammer of Wrath","Crusader Strike","Templar's Verdict",24428.693603869684,"Exorcism","Hammer of Wrath","Crusader Strike","Templar's Verdict"]
["Exorcism","Hammer of Wrath","Templar's Verdict","Crusader Strike",23375.192443604705,"Exorcism","Hammer of Wrath","Templar's Verdict","Crusader Strike"]
["Hammer of Wrath","Crusader Strike","Exorcism","Templar's Verdict",25116.916769747426,"Hammer of Wrath","Crusader Strike","Exorcism","Templar's Verdict"]
["Hammer of Wrath","Crusader Strike","Templar's Verdict","Exorcism",24894.979340080681,"Hammer of Wrath","Crusader Strike","Templar's Verdict","Exorcism"]
["Hammer of Wrath","Templar's Verdict","Exorcism","Crusader Strike",23173.791694955122,"Hammer of Wrath","Templar's Verdict","Exorcism","Crusader Strike"]
["Hammer of Wrath","Templar's Verdict","Crusader Strike","Exorcism",23716.412476913581,"Hammer of Wrath","Templar's Verdict","Crusader Strike","Exorcism"]
["Hammer of Wrath","Exorcism","Templar's Verdict","Crusader Strike",23441.175079132096,"Hammer of Wrath","Exorcism","Templar's Verdict","Crusader Strike"]
["Hammer of Wrath","Exorcism","Crusader Strike","Templar's Verdict",24495.206531778647,"Hammer of Wrath","Exorcism","Crusader Strike","Templar's Verdict"]
[]
["Best:",{"$f":"VLOOKUP(MAX(E12:E35),E12:I35,2,FALSE)","v":"Crusader Strike"},{"$f":"IF(ROUND(LastDPSValue,2)=ROUND(TotalDPS,2),B37,\"\")","v":""},null,"Current DPS"]
[null,{"$f":"VLOOKUP(MAX(E12:E35),E12:I35,3,FALSE)","v":"Hammer of Wrath"},"",null,25365.651241511001]
[null,{"$f":"VLOOKUP(MAX(E12:E35),E12:I35,4,FALSE)","v":"Exorcism"},""]
[null,{"$f":"VLOOKUP(MAX(E12:E35),E12:I35,5,FALSE)","v":"Templar's Verdict"},""]
[null,{"$f":"IF(SealSelection=\"SoT\",\"Judgement of Truth\", \"Judgement of Righteousness\")","v":"Judgement of Truth"},""]
[null,"Holy Wrath",""]
[null,"Consecration",""]

{"sheet":"Gear","index":7,"n_rows":686,"n_cols":36,"rows_kept":686,"cut":false,"hidden":false,"merged":[[1,30,1,31],[1,32,1,33],[1,1,1,10],[1,11,1,18],[1,24,1,29],[1,19,1,21]]}
[]
[null,"General Info",null,null,null,null,null,null,null,null,null,"Melee Stats",null,null,null,null,null,null,null,"Caster Stats",null,null,null,null,"Gem Info",null,null,null,null,null,"Weapon",null,"Lookup Info"]
[null,"Name","Quality","Filter1","Filter2","DropA","DropB","Filter-Inc","Ilvl","Arm","Stam","Str","AP","Agi","Hit","Crit","Haste","Mastery","WE","Int","SpD","Mp5","SpH","SpC","G1","G2","G3","G4","Bonus","Amount","Speed","Dps","Loc","MyLoc"]
[null,1,{"$f":"B4+1","v":2},{"$f":"C4+1","v":3},4,5,6,7,8,9,10,11,12,13,14,15,16,17,18,19,20,21,22,23,24,25,26,27,28,29,30,31,32,33]
[null,"-----Plate-----"]
[null,"Crown of Chelonian Freedom","Rare","Plate","Quest","Quest","Children of Tortolla",{"$f":"IF(AND(VLOOKUP(C6,FilterRareLookup,2,FALSE)=\"Yes\",VLOOKUP(E6,FilterLootLookup,2,FALSE)=\"Yes\",I6>=iLevelFilter),\"Yes\",\"No\")","v":"No"},288,2116,264,176,0,0,0,119,115,0,0,0,0,0,null,null,null,null,null,null,null,null,null,null,"Head","MyHead"]
[null,"Bell-Ringer's Skullcap","Rare","Plate","Quest","Quest","Take Him to the Earthcaller","No",289,2125,267,178,0,0,0,107,0,125,0,0,0,0,null,null,null,null,null,null,null,null,null,null,"Head","MyHead"]
[null,"Helm of Fatal Vision","Rare","Plate","World Drop","World Drop",null,"No",308,2296,319,212,0,0,0,142,0,142,0,0,0,0,null,null,null,null,null,null,null,null,null,null,"Head","MyHead"]
[null,"Anomuran Helm","Rare","Plate","Pre-Raid Dungeons","Throne of the Tides","Mindbender Ghur'sha","No",308,2296,319,212,0,0,0,142,0,142,0,0,0,0,null,null,null,null,null,null,null,null,null,null,"Head","MyHead"]
[null,"Great General's Crown","Rare","Plate","Quest","Quest","Salhet the Tactician","No",312,2333,331,220,0,0,153,0,0,136,0,0,0,0,null,null,null,null,null,null,null,null,null,null,"Head","MyHead"]
[null,"Helm of Verdant Explosion","Rare","Plate","Quest","Quest","Breach in the Defenses","No",318,2391,349,233,0,0,171,0,129,0,0,0,0,0,null,null,null,null,null,null,null,null,null,null,"Head","MyHead"]
[null,"Stonemason's Helm (Heroic)","Rare","Plate","Pre-Raid Dungeons","Heroic The Deadmines","Vanessa VanCleef","No",346,2680,454,242,0,0,0,142,202,0,0,0,0,0,null,null,"m","b",null,null,"Str",30,null,null,"Head","MyHead"]
[null,"Helm of Easeful Death","Rare","Plate","Vendor / Badge","Vendor","2200 Justice Points","No",346,2680,454,242,0,0,0,0,162,182,0,0,0,0,null,null,"m","r",null,null,"Mastery",30,null,null,"Head","MyHead"]
[null,"Anomuran Helm (Heroic)","Rare","Plate","Pre-Raid Dungeons","Heroic Throne of the Tides","Mindbender Ghur'sha","No",346,2680,454,242,0,0,0,162,0,182,0,0,0,0,null,null,"m","y",null,null,"Crit",30,null,null,"Head","MyHead"]
[null,"Roaring Mask of Bethekk","Epic","Plate","Pre-Raid Dungeons","Heroic Zul'Gurub","High Priestess Kilnara","No",353,2735,484,263,0,0,null,192,175,0,0,0,0,0,null,null,"m","r",null,null,"Crit",30,null,null,"Head","MyHead"]
[null,"Reinforced Sapphirium Helmet","Epic","Plate","Blackwing Descent","Blackwing Descent","Nefarian","No",359,2784,512,281,0,0,0,0,228,0,168,0,0,0,null,null,"m","y",null,null,"Str",30,null,null,"Head","MyHead"]
[null,"Helm of Maddening Whispers","Epic","Plate","The Bastion of Twilight","The Bastion of Twilight","Cho'gall","No",359,2784,512,281,0,0,0,168,228,0,0,0,0,0,null,null,"m","b",null,null,"Haste",30,null,null,"Head","MyHead"]
[null,"Dragon Bone Warhelm","Epic","Plate","Blackwing Descent","Blackwing Descent","Maloriak","No",359,2784,512,259,0,0,0,0,0,281,113,0,0,0,null,null,"m","r",null,null,"Sta",45,null,null,"Head","MyHead"]
[null,"Reinforced Sapphirium Helmet (Heroic)","Epic","Plate","The Bastion of Twilight","Heroic Raid Endboss","Heroic Raid Endboss","No",372,2891,578,325,0,0,0,0,257,0,197,0,0,0,null,null,"m","y",null,null,"Str",30,null,null,"Head","MyHead"]
[null,"Helm of Maddening Whispers (Heroic)","Epic","Plate","The Bastion of Twilight","Heroic The Bastion of Twilight","Cho'gall","No",372,2891,578,325,0,0,0,197,257,0,0,0,0,0,null,null,"m","b",null,null,"Haste",30,null,null,"Head","MyHead"]
[null,"Dragon Bone Warhelm (Heroic)","Epic","Plate","Blackwing Descent","Heroic Blackwing Descent","Maloriak","No",372,2891,578,293,0,0,0,0,0,325,135,0,0,0,null,null,"m","r",null,null,"Sta",45,null,null,"Head","MyHead"]
[null,"Greathelm of the Voracious Maw","Epic","Plate","Firelands","Firelands","Alysrazor","Yes",378,2943,611,348,0,0,0,192,0,284,0,0,0,0,null,null,"m","b",null,null,"Str",30,null,null,"Head","MyHead"]
[null,"Immolation Helmet","Epic","Plate","Firelands","Firelands","Ragnaros","Yes",378,2943,611,348,0,0,199,279,0,0,0,0,0,0,null,null,"m","r",null,null,"Str",30,null,null,"Head","MyHead"]
[null,"Greathelm of the Voracious Maw (Heroic)","Epic","Plate","Firelands","Heroic Firelands","Alysrazor","Yes",391,3057,689,400,0,0,0,224,0,320,0,0,0,0,null,null,"m","b",null,null,"Str",30,null,null,"Head","MyHead"]
[null,"Immolation Helmet (Heroic)","Epic","Plate","Firelands","Heroic Firelands","Crystallized Firestone","Yes",391,3057,689,400,0,0,232,315,0,0,0,0,0,0,null,null,"m","r",null,null,"s",30,null,null,"Head","MyHead"]
[]
[null,"-----PVP-----"]
[null,"Bloodthirsty Gladiator's Scaled Helm","Rare","Plate","PvP","PvP",null,{"$f":"IF(AND(VLOOKUP(C28,FilterRareLookup,2,FALSE)=\"Yes\",VLOOKUP(E28,FilterLootLookup,2,FALSE)=\"Yes\",I28>=iLevelFilter),\"Yes\",\"No\")","v":"No"},352,2727,480,{"$f":"260 + IF(PvPBonus>1,(70/PvPBonus),0) + IF(PvPBonus>3,(90/PvPBonus),0)","v":260},0,0,0,0,0,153,0,0,0,0,null,null,"m","r",null,null,null,null,null,null,"Head","MyHead"]
[null,"Vicious Gladiator's Scaled Helm","Epic","Plate","PvP","PvP",null,"Yes",365,2833,541,{"$f":"301 + IF(PvPBonus>1,(70/PvPBonus),0) + IF(PvPBonus>3,(90/PvPBonus),0)","v":301},0,0,0,0,0,181,0,0,0,0,null,null,"m","r",null,null,null,null,null,null,"Head","MyHead"]
[]
[null,"----Craft----"]
[null,"Redsteel Helm","Rare","Plate","Craftable","Craftable","Blacksmithing",{"$f":"IF(AND(VLOOKUP(C32,FilterRareLookup,2,FALSE)=\"Yes\",VLOOKUP(E32,FilterLootLookup,2,FALSE)=\"Yes\",I32>=iLevelFilter),\"Yes\",\"No\")","v":"No"},333,2542,401,208,0,0,0,138,0,0,158,0,0,0,null,null,"m","r",null,null,"Str",30,null,null,"Head","MyHead"]
[null,"Reinforced Bio-Optic Killshades","Epic","Plate","Craftable","Craftable","Engineering",{"$f":"IF(AND(VLOOKUP(C33,FilterRareLookup,2,FALSE)=\"Yes\",VLOOKUP(E33,FilterLootLookup,2,FALSE)=\"Yes\",I33>=iLevelFilter),\"Yes\",\"No\")","v":"No"},359,2784,512,301,0,0,0,0,0,0,0,0,0,0,null,null,"m","c","c",null,"Str",20,null,null,"Head","MyHead"]
[]
[null,"----User Added----"]
[]
[]
[]
[null,"-----Plate-----"]
[null,"Pauldrons of Toil","Rare","Plate","World Drop","World Drop",null,{"$f":"IF(AND(VLOOKUP(C40,FilterRareLookup,2,FALSE)=\"Yes\",VLOOKUP(E40,FilterLootLookup,2,FALSE)=\"Yes\",I40>=iLevelFilter),\"Yes\",\"No\")","v":"No"},292,1985,204,136,0,0,0,79,0,97,0,0,0,0,null,null,null,null,null,null,null,null,null,null,"Shoulder","MyShoulder"]
[null,"Geodecrack Shoulderguards","Rare","Plate","Quest","Quest","Clingy","No",305,2093,230,153,0,0,102,0,102,0,0,0,0,0,null,null,null,null,null,null,null,null,null,null,"Shoulder","MyShoulder"]
[null,"Raz's Pauldrons","Rare","Plate","Pre-Raid Dungeons","Blackrock Caverns","Ascendant Lord Obsidius","No",308,2119,237,158,0,0,92,0,0,113,0,0,0,0,null,null,null,null,null,null,null,null,null,null,"Shoulder","MyShoulder"]
[null,"Staffseeker Shoulderplates","Rare","Plate","Quest","Quest","Just the Tip","No",312,2154,245,164,0,0,0,0,124,83,0,0,0,0,null,null,null,null,null,null,null,null,null,null,"Shoulder","MyShoulder"]
[null,"Caimas' Spaulders","Rare","Plate","Quest","Quest","The Pit of Scales","No",312,2154,245,164,0,0,0,114,0,0,101,0,0,0,null,null,null,null,null,null,null,null,null,null,"Shoulder","MyShoulder"]
[null,"Pauldrons of Unholy Rituals","Rare","Plate","Quest","Quest","Followers and Leaders","No",316,2189,255,170,0,0,0,99,0,121,0,0,0,0,null,null,null,null,null,null,null,null,null,null,"Shoulder","MyShoulder"]
[null,"Song-Reflecting Spaulders","Rare","Plate","Quest","Quest","Siren's Song/Mo' Better Shredder","No",318,2207,260,173,0,0,0,0,0,104,122,0,0,0,null,null,null,null,null,null,null,null,null,null,"Shoulder","MyShoulder"]
[null,"Signal Smoke Shoulderpads","Rare","Plate","Quest","Quest","Call in the Artillery","No",318,2207,260,173,0,0,0,117,112,0,0,0,0,0,null,null,null,null,null,null,null,null,null,null,"Shoulder","MyShoulder"]
[null,"Raz's Pauldrons (Heroic)","Rare","Plate","Pre-Raid Dungeons","Heroic Blackrock Caverns","Ascendant Lord Obsidius","No",346,2474,337,205,0,0,111,0,0,161,0,0,0,0,null,null,"r",null,null,null,"Hit",10,null,null,"Shoulder","MyShoulder"]
[null,"Pauldrons of the High Requiem","Rare","Plate","Vendor / Badge","Vendor","1650 Justice Points","No",346,2474,337,205,0,0,111,0,0,0,161,0,0,0,null,null,"r",null,null,null,"WE",10,null,null,"Shoulder","MyShoulder"]
[null,"Missing Diplomat's Pauldrons (Heroic)","Rare","Plate","Pre-Raid Dungeons","Heroic The Deadmines","Glubtok","No",346,2474,337,205,0,0,0,150,0,130,0,0,0,0,null,null,"b",null,null,null,"Str",10,null,null,"Shoulder","MyShoulder"]
[null,"Skullpiercer Pauldrons","Epic","Plate","Pre-Raid Dungeons","Heroic Zul'Aman","Daakara","No",353,2525,360,220,0,0,0,152,0,148,0,0,0,0,null,null,"r",null,null,null,"WE",10,null,null,"Shoulder","MyShoulder"]
[null,"Reinforced Sapphirium Pauldrons","Epic","Plate","The Bastion of Twilight","Bastion of Twilight","Cho'gall","No",359,2570,380,233,0,0,149,0,169,0,0,0,0,0,null,null,"r",null,null,null,"Haste",10,null,null,"Shoulder","MyShoulder"]
[null,"Pauldrons of the Great Ettin","Epic","Plate","The Bastion of Twilight","Bastion of Twilight","Halfus Wyrmbreaker","No",359,2570,380,233,0,0,0,169,0,149,0,0,0,0,null,null,"b",null,null,null,"Str",10,null,null,"Shoulder","MyShoulder"]
[null,"Reinforced Sapphirium Pauldrons (Heroic)","Epic","Plate","The Bastion of Twilight","Heroic Raid Endboss","Heroic Raid Endboss","No",372,2669,429,266,0,0,171,0,191,0,0,0,0,0,null,null,"r",null,null,null,"Haste",10,null,null,"Shoulder","MyShoulder"]
[null,"Pauldrons of the Great Ettin (Heroic)","Epic","Plate","The Bastion of Twilight","Heroic Bastion of Twilight","Halfus Wyrmbreaker","No",372,2669,429,266,0,0,0,191,0,171,0,0,0,0,null,null,"b",null,null,null,"Str",10,null,null,"Shoulder","MyShoulder"]
[null,"Immolation Pauldrons","Epic","Plate","Firelands","Firelands","Majordomo Staghelm","Yes",378,2716,454,282,0,0,0,211,167,0,0,0,0,0,null,null,"y",null,null,null,"Str",10,null,null,"Shoulder","MyShoulder"]
[null,"Immolation Pauldrons (Heroic)","Epic","Plate","Firelands","Heroic Firelands","Crystallized Firestone","Yes",391,2822,513,322,0,0,0,238,191,0,0,0,0,0,null,null,"y",null,null,null,"Str",10,null,null,"Shoulder","MyShoulder"]
[]
[null,"-----PVP-----"]
[null,"Bloodthirsty Gladiator's Scaled Shoulders","Rare","Plate","PvP","PVP",null,{"$f":"IF(AND(VLOOKUP(C60,FilterRareLookup,2,FALSE)=\"Yes\",VLOOKUP(E60,FilterLootLookup,2,FALSE)=\"Yes\",I60>=iLevelFilter),\"Yes\",\"No\")","v":"No"},352,2517,357,{"$f":"218 + IF(PvPBonus>1,(70/PvPBonus),0) + IF(PvPBonus>3,(90/PvPBonus),0)","v":218},0,0,0,0,0,0,138,0,0,0,0,0,"y",null,null,null,"Str",10,null,null,"Shoulder","MyShoulder"]
[null,"Vicious Gladiator's Scaled Shoulders","Epic","Plate","PvP","PVP",null,{"$f":"IF(AND(VLOOKUP(C61,FilterRareLookup,2,FALSE)=\"Yes\",VLOOKUP(E61,FilterLootLookup,2,FALSE)=\"Yes\",I61>=iLevelFilter),\"Yes\",\"No\")","v":"Yes"},365,2615,402,{"$f":"248 + IF(PvPBonus>1,(70/PvPBonus),0) + IF(PvPBonus>3,(90/PvPBonus),0)","v":248},0,0,0,0,0,0,159,0,0,0,0,0,"y",null,null,null,"Str",10,null,null,"Shoulder","MyShoulder"]
[]
[null,"----Craft----"]
[null,"Redsteel Shoulders","Rare","Plate","Craftable","Craftable","Blacksmithing",{"$f":"IF(AND(VLOOKUP(C64,FilterRareLookup,2,FALSE)=\"Yes\",VLOOKUP(E64,FilterLootLookup,2,FALSE)=\"Yes\",I64>=iLevelFilter),\"Yes\",\"No\")","v":"No"},325,2271,277,185,0,0,0,0,123,0,123,0,0,0,null,null,null,null,null,null,null,null,null,null,"Shoulder","MyShoulder"]
[]
[null,"----User Added----"]
[]
[]
[null,"-----Plate-----"]
[null,"Chestplate of Viridian Renewal","Rare","Plate","Quest","Quest","Aessina's Miracle",{"$f":"IF(AND(VLOOKUP(C70,FilterRareLookup,2,FALSE)=\"Yes\",VLOOKUP(E70,FilterLootLookup,2,FALSE)=\"Yes\",I70>=iLevelFilter),\"Yes\",\"No\")","v":"No"},288,2614,264,176,0,0,0,115,0,119,0,0,0,0,null,null,null,null,null,null,null,null,null,null,"Chest","MyChest"]
[null,"Rough Stone Carapace","Rare","Plate","Quest","Quest","Question the Slaves","No",289,2615,267,178,0,0,0,125,107,0,0,0,0,0,null,null,null,null,null,null,null,null,null,null,"Chest","MyChest"]
[null,"Colossus Smasher Breastplate","Rare","Plate","Quest","Quest","Fortune and Glory","No",312,2872,331,220,0,0,125,0,160,0,0,0,0,0,null,null,null,null,null,null,null,null,null,null,"Chest","MyChest"]
[null,"Canopic Chestplate","Rare","Plate","Quest","Quest","Fire From the Sky","No",312,2872,331,220,0,0,0,136,0,153,0,0,0,0,null,null,null,null,null,null,null,null,null,null,"Chest","MyChest"]
[null,"Harbinger's Breastplate","Rare","Plate","World Drop","World Drop",null,"No",333,3128,401,268,0,0,0,178,0,178,0,0,0,0,null,null,null,null,null,null,null,null,null,null,"Chest","MyChest"]
[null,"Flynn's Favorite Chestplate","Rare","Plate","Quest","Quest","Doing It Like a Dunwald/Krazz Works!","No",333,3128,401,268,0,0,0,0,148,196,0,0,0,0,null,null,null,null,null,null,null,null,null,null,"Chest","MyChest"]
[null,"Breastplate of the Risen Land","Rare","Plate","Pre-Raid Dungeons","Halls of Origination","Earthrager Ptah","No",333,3128,401,268,0,0,0,178,0,178,0,0,0,0,null,null,null,null,null,null,null,null,null,null,"Chest","MyChest"]
[null,"Phantom Armor (Heroic)","Rare","Plate","Pre-Raid Dungeons","Heroic Shadowfang Keep","Lord Walden","No",346,3298,454,262,0,0,0,172,0,192,0,0,0,0,null,null,"y","b",null,null,"Str",20,null,null,"Chest","MyChest"]
[null,"Lord Walden's Breastplate (Heroic)","Rare","Plate","Pre-Raid Dungeons","Heroic Shadowfang Keep","Lord Godfrey","No",346,3298,454,262,0,0,0,0,162,202,0,0,0,0,null,null,"r","b",null,null,"Haste",20,null,null,"Chest","MyChest"]
[null,"Breastplate of the Risen Land (Heroic)","Rare","Plate","Pre-Raid Dungeons","Heroic Halls of Origination","Earthrager Ptah","No",346,3298,454,262,0,0,0,202,0,162,0,0,0,0,null,null,"r","b",null,null,"Crit",20,null,null,"Chest","MyChest"]
[null,"Breastplate of Raging Fury","Rare","Plate","Vendor / Badge","Vendor","2200 Justice Points","No",346,3298,454,262,0,0,172,192,0,0,0,0,0,0,null,null,"r","b",null,null,"Crit",20,null,null,"Chest","MyChest"]
[null,"Chestplate of Hubris","Epic","Plate","Pre-Raid Dungeons","Heroic Zul'Aman","Timed Chest","No",353,3366,484,283,0,0,0,204,186,0,0,0,0,0,null,null,"y","b",null,null,"Str",20,null,null,"Chest","MyChest"]
[null,"Reinforced Sapphirium Battleplate","Epic","Plate","Vendor / Badge","Vendor","2200 Valor Points","No",359,3426,512,301,0,0,0,228,188,0,0,0,0,0,null,null,"r","b",null,null,"Str",20,null,null,"Chest","MyChest"]
[null,"Battleplate of Ancient Kings","Epic","Plate","Blackwing Descent","Blackwing Descent","Atramedes","No",359,3426,512,301,0,0,0,0,228,0,188,0,0,0,null,null,"r","y",null,null,"Haste",20,null,null,"Chest","MyChest"]
[null,"Reinforced Sapphirium Battleplate (Heroic)","Epic","Plate","The Bastion of Twilight","Heroic Raid Endboss","Heroic Raid Endboss","No",372,3559,578,345,0,0,0,257,217,0,0,0,0,0,null,null,"r","b",null,null,"Str",20,null,null,"Chest","MyChest"]
[null,"Battleplate of Ancient Kings (Heroic)","Epic","Plate","Blackwing Descent","Blackwing Descent","Atramedes","No",372,3559,578,345,0,0,0,0,257,0,217,0,0,0,null,null,"r","y",null,null,"Haste",20,null,null,"Chest","MyChest"]
[null,"Breastplate of Shifting Visions","Epic","Plate","Firelands","Firelands","Majordomo Staghelm","Yes",378,3622,611,368,0,0,0,0,233,265,0,0,0,0,null,null,"r","b",null,null,"Str",20,null,null,"Chest","MyChest"]
[null,"Immolation Battleplate","Epic","Plate","Firelands","Firelands","2200 Valor Points","Yes",378,3622,611,368,0,0,0,0,235,0,269,0,0,0,null,null,"r","b",null,null,"Str",20,null,null,"Chest","MyChest"]
[null,"Breastplate of Shifting Visions (Heroic)","Epic","Plate","Firelands","Heroic Firelands","Majordomo Staghelm",{"$f":"IF(AND(VLOOKUP(C88,FilterRareLookup,2,FALSE)=\"Yes\",VLOOKUP(E88,FilterLootLookup,2,FALSE)=\"Yes\",J88>=iLevelFilter),\"Yes\",\"No\")","v":"Yes"},391,3762,689,420,0,0,0,0,266,301,0,0,0,0,null,null,"r","b",null,null,"Str",20,null,null,"Chest","MyChest"]
[null,"Immolation Battleplate (Heroic)","Epic","Plate","Firelands","Heroic Firelands","Crystallized Firestone",{"$f":"IF(AND(VLOOKUP(C89,FilterRareLookup,2,FALSE)=\"Yes\",VLOOKUP(E89,FilterLootLookup,2,FALSE)=\"Yes\",I89>=iLevelFilter),\"Yes\",\"No\")","v":"Yes"},391,3762,689,420,0,0,0,0,269,0,303,0,0,0,null,null,"r","b",null,null,"Str",20,null,null,"Chest","MyChest"]
[]
[null,"-----PVP-----"]
[null,"Bloodthirsty Gladiator's Scaled Chestpiece","Rare","Plate","PvP","PVP",null,{"$f":"IF(AND(VLOOKUP(C92,FilterRareLookup,2,FALSE)=\"Yes\",VLOOKUP(E92,FilterLootLookup,2,FALSE)=\"Yes\",I92>=iLevelFilter),\"Yes\",\"No\")","v":"No"},352,3357,480,{"$f":"280 + IF(PvPBonus>1,(70/PvPBonus),0) + IF(PvPBonus>3,(90/PvPBonus),0)","v":280},0,0,0,173,0,0,0,0,0,0,0,0,"r","y",null,null,null,null,null,null,"Chest","MyChest"]
[null,"Vicious Gladiator's Scaled Chestpiece","Epic","Plate","PvP","PVP",null,{"$f":"IF(AND(VLOOKUP(C93,FilterRareLookup,2,FALSE)=\"Yes\",VLOOKUP(E93,FilterLootLookup,2,FALSE)=\"Yes\",I93>=iLevelFilter),\"Yes\",\"No\")","v":"Yes"},365,3487,541,{"$f":"321 + IF(PvPBonus>1,(70/PvPBonus),0) + IF(PvPBonus>3,(90/PvPBonus),0)","v":321},0,0,0,201,0,0,0,0,0,0,0,0,"r","y",null,null,null,null,null,null,"Chest","MyChest"]
[]
[null,"----Craft----"]
[null,"Redsteel Breastplate","Rare",null,"Craftable","Craftable","Blacksmithing",{"$f":"IF(AND(VLOOKUP(C96,FilterRareLookup,2,FALSE)=\"Yes\",VLOOKUP(E96,FilterLootLookup,2,FALSE)=\"Yes\",I96>=iLevelFilter),\"Yes\",\"No\")","v":"No"},333,3128,401,268,0,0,0,0,178,178,0,0,0,0,null,null,null,null,null,null,null,null,null,null,"Chest","MyChest"]
[null,"Elementium Deathplate","Epic",null,"Craftable","Craftable","Blacksmithing",{"$f":"IF(AND(VLOOKUP(C97,FilterRareLookup,2,FALSE)=\"Yes\",VLOOKUP(E97,FilterLootLookup,2,FALSE)=\"Yes\",I97>=iLevelFilter),\"Yes\",\"No\")","v":"No"},359,3426,512,321,0,0,0,228,0,208,0,0,0,0,null,null,"y",null,null,null,"Str",8,null,null,"Chest","MyChest"]
[]
[null,"----User Added----"]
[]
[]
[null,"-----Plate-----"]
[null,"Greaves of the Outcast Knight","Rare","Plate","World Drop","World Drop",null,{"$f":"IF(AND(VLOOKUP(C103,FilterRareLookup,2,FALSE)=\"Yes\",VLOOKUP(E103,FilterLootLookup,2,FALSE)=\"Yes\",I103>=iLevelFilter),\"Yes\",\"No\")","v":"No"},300,2393,296,197,0,0,115,141,0,0,0,0,0,0,null,null,null,null,null,null,null,null,null,null,"Legs","MyLegs"]
[null,"Alpheus Legguards","Rare","Plate","World Drop","Zone Drop","Throne of the Tides","No",308,2472,319,212,0,0,124,152,0,0,0,0,0,0,null,null,null,null,null,null,null,null,null,null,"Legs","MyLegs"]
[null,"Sunwatcher's Legplates","Rare","Plate","Quest","Quest","The Scepter of Orsis","No",312,2513,331,220,0,0,115,0,0,166,0,0,0,0,null,null,null,null,null,null,null,null,null,null,"Legs","MyLegs"]
[null,"Legguards of Winnowing Wind","Rare","Plate","Pre-Raid Dungeons","The Vortex Pinnacle","Asaad","No",316,2554,343,229,0,0,0,134,0,164,0,0,0,0,null,null,null,null,null,null,null,null,null,null,"Legs","MyLegs"]
[null,"Legplates of Remnants","Rare","Plate","Quest","Quest","Small Comforts/Smoot's Samophlange","No",318,2575,349,233,0,0,0,151,158,0,0,0,0,0,null,null,null,null,null,null,null,null,null,null,"Legs","MyLegs"]
[null,"Lava-Melted Legplates","Rare","Plate","Quest","Quest","A Fiery Reunion","No",318,2575,349,233,0,0,175,0,0,0,122,0,0,0,null,null,null,null,null,null,null,null,null,null,"Legs","MyLegs"]
[null,"Fungus-Stained Legplates","Rare","Plate","Quest","Quest","Wrath of the Fungalmancer","No",318,2575,349,233,0,0,0,0,175,122,0,0,0,0,null,null,null,null,null,null,null,null,null,null,"Legs","MyLegs"]
[null,"Offline Greaves","Rare","Plate","Quest","Quest","Penetrating Their Defenses","No",333,2737,401,268,0,0,0,191,0,0,157,0,0,0,null,null,null,null,null,null,null,null,null,null,"Legs","MyLegs"]
[null,"Legguards of Winnowing Wind (Heroic)","Rare","Plate","Pre-Raid Dungeons","Heroic The Vortex Pinnacle","Asaad","No",346,2886,454,262,0,0,0,167,0,185,0,0,0,0,null,null,"r","b",null,null,"Mastery",20,null,null,"Legs","MyLegs"]
[null,"Greaves of Gallantry","Rare","Plate","Vendor / Badge","Vendor","2200 Justice Pointts","No",346,2886,454,262,0,0,0,182,182,0,0,0,0,0,null,null,"y","b",null,null,"Str",20,null,null,"Legs","MyLegs"]
[null,"Jungle Striders","Epic","Plate","Pre-Raid Dungeons","Heroic Zul'Aman","Nalorakk","No",353,2946,484,283,0,0,0,0,199,0,190,0,0,0,null,null,"r","y",null,null,"Haste",20,null,null,"Legs","MyLegs"]
[null,"Terrastra's Legguards","Epic","Plate","The Bastion of Twilight","The Bastion of Twilight","Elementium Monstrosity","No",359,2998,512,301,0,0,188,0,228,0,0,0,0,0,null,null,"y","y",null,null,"Haste",20,null,null,"Legs","MyLegs"]
[null,"Reinforced Sapphirium Legplates","Epic","Plate","Vendor / Badge","Vendor","2200 Valor Points","No",359,2998,512,301,0,0,188,0,0,228,0,0,0,0,null,null,"y","y",null,null,"Haste",20,null,null,"Legs","MyLegs"]
[null,"Corefire Legplates","Epic","Plate","World Drop","World Drop","Heroic Dungeons","No",359,2998,512,301,0,0,165,0,241,0,0,0,0,0,null,null,"y","y",null,null,"Haste",20,null,null,"Legs","MyLegs"]
[null,"Terrastra's Legguards (Heroic)","Epic","Plate","The Bastion of Twilight","Heroic The Bastion of Twilight","Elementium Monstrosity","No",372,3114,578,345,0,0,217,0,257,0,0,0,0,0,null,null,"y","y",null,null,"Haste",20,null,null,"Legs","MyLegs"]
[null,"Reinforced Sapphirium Legplates (Heroic)","Epic","Plate","The Bastion of Twilight","Heroic Raid Endboss","Heroic Raid Endboss","No",372,3114,578,345,0,0,217,0,0,257,0,0,0,0,null,null,"y","y",null,null,"Haste",20,null,null,"Legs","MyLegs"]
[null,"Lavawork Legplates","Epic","Plate","Firelands","Firelands","Alysrazor","Yes",378,3169,611,368,0,0,284,0,0,212,0,0,0,0,null,null,"r","y",null,null,"Mastery",20,null,null,"Legs","MyLegs"]
[null,"Immolation Legplates","Epic","Plate","Firelands","Firelands","2200 Valor Points","Yes",378,3169,611,368,0,0,0,227,0,274,0,0,0,0,null,null,"r","y",null,null,"Str",20,null,null,"Legs","MyLegs"]
[null,"Lavawork Legplates (Heroic)","Epic","Plate","Firelands","Heroic Firelands","Alysrazor","Yes",391,3292,689,420,0,0,320,0,0,244,0,0,0,0,null,null,"r","y",null,null,"Mastery",20,null,null,"Legs","MyLegs"]
[null,"Immolation Legplates (Heroic)","Epic","Plate","Firelands","Heroic Firelands","Crystallized Firestone","Yes",391,3292,689,420,0,0,0,261,0,309,0,0,0,0,null,null,"r","y",null,null,"Str",20,null,null,"Legs","MyLegs"]
[]
[null,"-----PVP-----"]
[null,"Bloodthirsty Gladiator's Scaled Legguards","Rare","Plate","PvP","PVP",null,{"$f":"IF(AND(VLOOKUP(C125,FilterRareLookup,2,FALSE)=\"Yes\",VLOOKUP(E125,FilterLootLookup,2,FALSE)=\"Yes\",I125>=iLevelFilter),\"Yes\",\"No\")","v":"No"},352,2937,480,{"$f":"280 + IF(PvPBonus>1,(70/PvPBonus),0) + IF(PvPBonus>3,(90/PvPBonus),0)","v":280},0,0,0,0,173,0,0,0,0,0,0,0,"r","b",null,null,null,null,null,null,"Legs","MyLegs"]
[null,"Vicious Gladiator's Scaled Legguards","Epic","Plate","PvP","PVP",null,{"$f":"IF(AND(VLOOKUP(C126,FilterRareLookup,2,FALSE)=\"Yes\",VLOOKUP(E126,FilterLootLookup,2,FALSE)=\"Yes\",I126>=iLevelFilter),\"Yes\",\"No\")","v":"Yes"},365,3051,541,{"$f":"321 + IF(PvPBonus>1,(70/PvPBonus),0) + IF(PvPBonus>3,(90/PvPBonus),0)","v":321},0,0,0,0,201,0,0,0,0,0,0,0,"r","b",null,null,null,null,null,null,"Legs","MyLegs"]
[]
[null,"----Craft----"]
[null,"Redsteel Legguards","Rare","Plate","Craftable","Craftable","Blacksmithing",{"$f":"IF(AND(VLOOKUP(C129,FilterRareLookup,2,FALSE)=\"Yes\",VLOOKUP(E129,FilterLootLookup,2,FALSE)=\"Yes\",I129>=iLevelFilter),\"Yes\",\"No\")","v":"No"},325,2649,373,249,0,0,0,166,0,166,0,0,0,0,null,null,null,null,null,null,null,null,null,null,"Legs","MyLegs"]
[]
[null,"----User Added----"]
[]
[]
[]
[null,"-----Plate-----"]
[null,"Catapult Loader's Gloves","Rare","Plate","Quest","Quest","Close Escort",{"$f":"IF(AND(VLOOKUP(C136,FilterRareLookup,2,FALSE)=\"Yes\",VLOOKUP(E136,FilterLootLookup,2,FALSE)=\"Yes\",I136>=iLevelFilter),\"Yes\",\"No\")","v":"No"},305,1744,230,153,0,0,116,78,0,0,0,0,0,0,null,null,null,null,null,null,null,null,null,null,"Gloves","MyGloves"]
[null,"Gauntlets of Delicate Aim","Rare","Plate","Quest","Quest","Battlezone","No",312,1795,245,164,0,0,0,0,112,104,0,0,0,0,null,null,null,null,null,null,null,null,null,null,"Gloves","MyGloves"]
[null,"Hematite Plate Gloves","Rare","Plate","Pre-Raid Dungeons","The Stonecore","Slabhide","No",316,1824,255,170,0,0,0,99,121,0,0,0,0,0,null,null,null,null,null,null,null,null,null,null,"Gloves","MyGloves"]
[null,"Klem's Rusted Gauntlets","Rare","Plate","Quest","Quest","Distract Them for Me","No",318,1839,260,173,0,0,0,0,0,115,115,0,0,0,null,null,null,null,null,null,null,null,null,null,"Gloves","MyGloves"]
[null,"Coregrip Gauntlets","Rare","Plate","Quest","Quest","Any Portal in a Storm","No",318,1839,260,173,0,0,0,120,107,0,0,0,0,0,null,null,null,null,null,null,null,null,null,null,"Gloves","MyGloves"]
[null,"Endwyn's Flickering Gauntlets","Rare","Plate","World Drop","World Drop",null,"No",325,1892,277,185,0,0,0,108,132,0,0,0,0,0,null,null,null,null,null,null,null,null,null,null,"Gloves","MyGloves"]
[null,"Reaping Gauntlets","Rare","Plate","Vendor / Badge","Vendor","1650 Justice Points","No",346,2061,337,205,0,0,0,111,0,161,0,0,0,0,null,null,"b",null,null,null,"Str",10,null,null,"Gloves","MyGloves"]
[null,"Hematite Plate Gloves (Heroic)","Rare","Plate","Pre-Raid Dungeons","Heroic The Stonecore","Slabhide","No",346,2061,337,205,0,0,0,131,141,0,0,0,0,0,null,null,"r",null,null,null,"Haste",10,null,null,"Gloves","MyGloves"]
[null,"Gryphon Talon Gauntlets","Rare","Plate","Vendor / Badge","Vendor","Wildhammer/Dragonmaw","No",346,2061,337,205,0,0,0,150,130,0,0,0,0,0,null,null,"y",null,null,null,"Crit",10,null,null,"Gloves","MyGloves"]
[null,"Gear-Marked Gauntlets (Heroic)","Rare","Plate","Pre-Raid Dungeons","Heroic The Deadmines","Helix Gearbreaker","No",346,2061,337,205,0,0,0,0,150,130,0,0,0,0,null,null,"r",null,null,null,"Haste",10,null,null,"Gloves","MyGloves"]
[null,"Plunderer's Gauntlets","Epic","Plate","Pre-Raid Dungeons","Heroic Zul'Gurub","Edge of Madness","No",353,2104,360,220,0,0,0,0,137,0,158,0,0,0,null,null,"b",null,null,null,"Str",10,null,null,"Gloves","MyGloves"]
[null,"Reinforced Sapphirium Gauntlets","Epic","Plate","Vendor / Badge","Vendor","1650 Valor Points","No",359,2141,380,233,0,0,0,0,169,149,0,0,0,0,null,null,"b",null,null,null,"Str",10,null,null,"Gloves","MyGloves"]
[null,"Plated Fists of Provocation","Epic","Plate","Blackwing Descent","Blackwing Descent","Chimaeron","No",359,2141,380,233,0,0,0,169,149,0,0,0,0,0,null,null,"y",null,null,null,"Crit",10,null,null,"Gloves","MyGloves"]
[null,"Gravitational Pull","Epic","Plate","The Bastion of Twilight","Bastion of Twilight","Elementium Monstrosity","No",359,2141,380,233,0,0,0,0,0,243,108,0,0,0,null,null,"y",null,null,null,"Mastery",10,null,null,"Gloves","MyGloves"]
[null,"Reinforced Sapphirium Gauntlets (Heroic)","Epic","Plate","The Bastion of Twilight","Heroic Raid Endboss","Heroic Raid Endboss","No",372,2224,429,266,0,0,0,0,191,171,0,0,0,0,null,null,"b",null,null,null,"Str",10,null,null,"Gloves","MyGloves"]
[null,"Plated Fists of Provocation (Heroic)","Epic","Plate","Blackwing Descent","Heroic Blackwing Descent","Chimaeron","No",372,2224,429,266,0,0,0,191,171,0,0,0,0,0,null,null,"y",null,null,null,"Crit",10,null,null,"Gloves","MyGloves"]
[null,"Gravitational Pull (Heroic)","Epic","Plate","The Bastion of Twilight","Heroic The Bastion of Twilight","Elementium Monstrosity","No",372,2224,429,266,0,0,0,0,0,276,125,0,0,0,null,null,"y",null,null,null,"Mastery",10,null,null,"Gloves","MyGloves"]
[null,"Fireskin Gauntlets","Epic","Plate","Firelands","Firelands","Lord Rhyolith","Yes",378,2264,454,282,0,0,211,0,0,167,0,0,0,0,null,null,"r",null,null,null,"Hit",10,null,null,"Gloves","MyGloves"]
[null,"Immolation Gauntlets","Epic","Plate","Firelands","Firelands","1650 Valor Points","Yes",378,2264,454,282,0,0,178,0,0,182,0,0,0,0,null,null,"b",null,null,null,"Str",10,null,null,"Gloves","MyGloves"]
[null,"Fireskin Gauntlets (Heroic)","Epic","Plate","Firelands","Heroic Firelands","Lord Rhyolith","Yes",391,2351,513,322,0,0,238,0,0,191,0,0,0,0,null,null,"r",null,null,null,"Hit",10,null,null,"Gloves","MyGloves"]
[null,"Immolation Gauntlets (Heroic)","Epic","Plate","Firelands","Heroic Firelands","Crystallized Firestone","Yes",391,2351,513,322,0,0,204,0,0,209,0,0,0,0,null,null,"b",null,null,null,"Str",10,null,null,"Gloves","MyGloves"]
[]
[null,"-----PVP-----"]
[null,"Bloodthirsty Gladiator's Scaled Gauntlets","Rare","Plate","PvP","PVP",null,{"$f":"IF(AND(VLOOKUP(C159,FilterRareLookup,2,FALSE)=\"Yes\",VLOOKUP(E159,FilterLootLookup,2,FALSE)=\"Yes\",I159>=iLevelFilter),\"Yes\",\"No\")","v":"No"},352,2098,357,{"$f":"218 + IF(PvPBonus>1,(70/PvPBonus),0) + IF(PvPBonus>3,(90/PvPBonus),0)","v":218},0,0,138,0,0,0,0,0,0,0,null,null,"b",null,null,null,"Str",10,null,null,"Gloves","MyGloves"]
[null,"Vicious Gladiator's Scaled Gauntlets","Epic","Plate","PvP","PVP",null,"Yes",365,2179,402,{"$f":"248 + IF(PvPBonus>1,(70/PvPBonus),0) + IF(PvPBonus>3,(90/PvPBonus),0)","v":248},0,0,159,0,0,0,0,0,0,0,null,null,"b",null,null,null,"Str",10,null,null,"Gloves","MyGloves"]
[null,"Ruthless Gladiator's Scaled Gauntlets","Epic","Plate","PvP","PVP",null,{"$f":"IF(AND(VLOOKUP(C161,FilterRareLookup,2,FALSE)=\"Yes\",VLOOKUP(E161,FilterLootLookup,2,FALSE)=\"Yes\",I161>=iLevelFilter),\"Yes\",\"No\")","v":"Yes"},384,2304,480,300,0,0,194,0,0,0,0,0,0,0,null,null,"b",null,null,null,"Str",10,null,null,"Gloves","MyGloves"]
[]
[null,"----Craft----"]
[null,"Redsteel Gauntlets","Rare","Plate","Craftable","Craftable","Blacksmithing",{"$f":"IF(AND(VLOOKUP(C164,FilterRareLookup,2,FALSE)=\"Yes\",VLOOKUP(E164,FilterLootLookup,2,FALSE)=\"Yes\",I164>=iLevelFilter),\"Yes\",\"No\")","v":"No"},289,1634,198,132,0,0,0,0,88,88,0,0,0,0,null,null,null,null,null,null,null,null,null,null,"Gloves","MyGloves"]
[null,"Fists of Fury","Epic","Plate","Craftable","Craftable","Blacksmithing",{"$f":"IF(AND(VLOOKUP(C165,FilterRareLookup,2,FALSE)=\"Yes\",VLOOKUP(E165,FilterLootLookup,2,FALSE)=\"Yes\",I165>=iLevelFilter),\"Yes\",\"No\")","v":"Yes"},378,2264,454,282,9,9,187,197,0,0,0,0,0,0,null,null,"r",null,null,null,"Str",10,null,null,"Gloves","MyGloves"]
[]
[null,"----User Added----"]
[]
[]
[]
[null,"-----Plate-----"]
[null,"Submariner's Weighted Treads","Rare","Plate","Quest","Quest","Defending the Rift",{"$f":"IF(AND(VLOOKUP(C172,FilterRareLookup,2,FALSE)=\"Yes\",VLOOKUP(E172,FilterLootLookup,2,FALSE)=\"Yes\",I172>=iLevelFilter),\"Yes\",\"No\")","v":"No"},288,1791,196,131,0,0,85,89,0,0,0,0,0,0,null,null,null,null,null,null,null,null,null,null,"Feet","MyFeet"]
[null,"Nemesis Crushers","Rare","Plate","Quest","Quest","Finish Nemesis","No",288,1791,196,131,0,0,96,0,0,72,0,0,0,0,null,null,null,null,null,null,null,null,null,null,"Feet","MyFeet"]
[null,"Deepstone Treads","Rare","Plate","Quest","Quest","The Earth Claims All","No",289,1798,198,132,0,0,0,0,0,88,88,0,0,0,null,null,null,null,null,null,null,null,null,null,"Feet","MyFeet"]
[null,"Qebnet Greaves","Rare","Plate","Quest","Quest","The Bandit Warlord","No",312,1974,245,164,0,0,118,93,0,0,0,0,0,0,null,null,null,null,null,null,null,null,null,null,"Feet","MyFeet"]
[null,"Troubled Steps","Rare","Plate","World Drop","World Drop",null,"No",316,2007,255,170,0,0,99,121,0,0,0,0,0,0,null,null,null,null,null,null,null,null,null,null,"Feet","MyFeet"]
[null,"Statue Climbers","Rare","Plate","Quest","Quest","Do the Honors","No",325,2082,277,185,0,0,0,0,120,0,125,0,0,0,null,null,null,null,null,null,null,null,null,null,"Feet","MyFeet"]
[null,"Treads of Terror","Rare","Plate","Quest","Quest","Skullcrusher the Mountain","No",333,2151,298,199,0,0,129,135,0,0,0,0,0,0,null,null,null,null,null,null,null,null,null,null,"Feet","MyFeet"]
[null,"Greaves of Wu the Elder","Rare","Plate","World Drop","Instance Drop","Lost City of the Tol'vir","No",333,2151,298,199,0,0,116,142,0,0,0,0,0,0,null,null,null,null,null,null,null,null,null,null,"Feet","MyFeet"]
[null,"Waywatcher's Boots","Rare","Plate","Vendor / Badge","Vendor","Guardians of Hyjal","No",346,2268,337,205,0,0,0,150,130,0,0,0,0,0,null,null,"y",null,null," ","Str",10,null,null,"Feet","MyFeet"]
[null,"Greaves of Wu the Elder (Heroic)","Rare","Plate","World Drop","Instance Drop","Heroic Lost City of the Tol'vir","No",346,2268,337,205,0,0,131,141,0,0,0,0,0,0,null,null,"b",null,null,null,"Crit",10,null,null,"Feet","MyFeet"]
[null,"Skullcrusher Warboots","Epic","Plate","Pre-Raid Dungeons","Heroic Zul'Aman","Timed Chest 2","No",353,2314,360,220,0,0,148,0,0,150,0,0,0,0,null,null,"y",null,null,null,"Str",10,null,null,"Feet","MyFeet"]
[null,"Woe Breeder's Boots","Epic","Plate","Vendor / Badge","Vendor","1650 Valor Points","No",359,2355,380,233,0,0,0,169,149,0,0,0,0,0,null,null,"y",null,null,null,"Crit",10,null,null,"Feet","MyFeet"]
[null,"Treads of Savage Beatings","Epic","Plate","World Drop","Instance Drop","Blackwing Descent","No",359,2355,380,233,0,0,0,169,0,149,0,0,0,0,null,null,"y",null,null,null,"Crit",10,null,null,"Feet","MyFeet"]
[null,"Massacre Treads","Epic","Plate","Blackwing Descent","Blackwing Descent","Chimaeron","No",359,2355,380,233,0,0,0,0,0,169,149,0,0,0,null,null,"b",null,null,null,"Str",10,null,null,"Feet","MyFeet"]
[null,"Massacre Treads (Heroic)","Epic","Plate","Blackwing Descent","Heroic Blackwing Descent","Chimaeron","No",372,2447,429,266,0,0,0,0,0,191,171,0,0,0,null,null,"b",null,null,null,"Str",10,null,null,"Feet","MyFeet"]
[null,"Arachnaflame Treads","Epic","Plate","Firelands","Firelands","Beth'tilac","Yes",378,2490,454,282,0,0,0,202,182,0,0,0,0,0,null,null,"r",null,null,null,"Str",10,null,null,"Feet","MyFeet"]
[null,"Arachnaflame Treads (Heroic)","Epic","Plate","Firelands","Heroic Firelands","Beth'tilac","Yes",391,2586,513,322,0,0,0,228,208,0,0,0,0,0,null,null,"r",null,null,null,"Str",10,null,null,"Feet","MyFeet"]
[]
[null,"-----PVP-----"]
[]
[null,"----Craft----"]
[null,"Redsteel Boots","Rare","Plate","Craftable","Craftable","Blacksmithing",{"$f":"IF(AND(VLOOKUP(C193,FilterRareLookup,2,FALSE)=\"Yes\",VLOOKUP(E193,FilterLootLookup,2,FALSE)=\"Yes\",I193>=iLevelFilter),\"Yes\",\"No\")","v":"No"},316,2007,255,170,0,0,0,113,0,113,0,0,0,0,null,null,null,null,null,null,null,null,null,null,"Feet","MyFeet"]
[null,"Warboots of Mighty Lords","Epic","Plate","Craftable","Craftable","Blacksmithing",{"$f":"IF(AND(VLOOKUP(C194,FilterRareLookup,2,FALSE)=\"Yes\",VLOOKUP(E194,FilterLootLookup,2,FALSE)=\"Yes\",I194>=iLevelFilter),\"Yes\",\"No\")","v":"Yes"},378,2490,454,282,0,0,187,197,0,0,0,0,0,0,null,null,"r",null,null,null,"Str",10,null,null,"Feet","MyFeet"]
[]
[null,"----User Added----"]
[]
[]
[]
[null,"-----Plate-----"]
[null,"Earthswell Belt","Rare","Plate","Quest","Quest","Sealing the Way",{"$f":"IF(AND(VLOOKUP(C201,FilterRareLookup,2,FALSE)=\"Yes\",VLOOKUP(E201,FilterLootLookup,2,FALSE)=\"Yes\",I201>=iLevelFilter),\"Yes\",\"No\")","v":"No"},289,1471,198,132,0,0,0,100,0,67,0,0,0,0,null,null,null,null,null,null,null,null,null,null,"Belt","MyBelt"]
[null,"Girdle of Heated Deeds","Rare","Plate","World Drop","World Drop",null,"No",300,1538,219,126,0,0,0,77,0,97,0,0,0,0,null,null,"r",null,null,null,"Str",10,null,null,"Belt","MyBelt"]
[null,"Belt of a Thousand Deaths","Rare","Plate","Quest","Quest","Rescue the Earthspeaker!","No",308,1589,237,158,0,0,0,105,0,105,0,0,0,0,null,null,null,null,null,null,null,null,null,null,"Belt","MyBelt"]
[null,"Guardian-Killer Waistplate","Rare","Plate","Quest","Quest","I'll Do It By Hand","No",312,1615,245,164,0,0,0,115,0,0,98,0,0,0,null,null,null,null,null,null,null,null,null,null,"Belt","MyBelt"]
[null,"Stoutwaist Girdle","Rare","Plate","Quest","Quest","The Loyalty of Clan Mullan/Twilight Skies","No",318,1655,260,173,0,0,98,0,0,125,0,0,0,0,null,null,null,null,null,null,null,null,null,null,"Belt","MyBelt"]
[null,"Gryphon-Seeker Waistplate","Rare","Plate","Quest","Quest","Finding Beak/Parting Packages","No",318,1655,260,173,0,0,0,0,125,98,0,0,0,0,null,null,null,null,null,null,null,null,null,null,"Belt","MyBelt"]
[null,"Belt of the Forgemaster","Rare","Plate","Pre-Raid Dungeons","Grim Batol","Forgemaster Throngus","No",333,1760,298,199,0,0,0,133,133,0,0,0,0,0,null,null,null,null,null,null,null,null,null,null,"Belt","MyBelt"]
[null,"Garr's Girdle of Memories","Rare","Plate","World Boss","World Boss","Deprecated","No",346,1855,337,225,0,0,0,150,0,150,0,0,0,0,null,null,null,null,null,null,null,null,null,null,"Belt","MyBelt"]
[null,"Belt of the Forgemaster (Heroic)","Rare","Plate","Pre-Raid Dungeons","Heroic Grim Batol","Forgemaster Throngus","No",346,1855,337,205,0,0,0,130,150,0,0,0,0,0,null,null,"y",null,null,null,"Haste",10,null,null,"Belt","MyBelt"]
[null,"Beech Green Belt","Rare","Plate","Vendor / Badge","Vendor","1650 Justice Points","No",346,1855,337,205,0,0,0,130,0,150,0,0,0,0,null,null,"y",null,null,null,"Mastery",10,null,null,"Belt","MyBelt"]
[null,"Belt of the Ferocious Wolf","Epic","Plate","Vendor / Badge","Vendor","Guardians of Hyjal Exalted","No",359,1927,380,233,0,0,0,149,0,169,0,0,0,0,null,null,"b",null,null,null,"Str",10,null,null,"Belt","MyBelt"]
[null,"Belt of Absolute Zero","Epic","Plate","Blackwing Descent","Blackwing Descent","Maloriak","No",359,1927,380,233,0,0,149,169,0,0,0,0,0,0,null,null,"r",null,null,null,"Hit",10,null,null,"Belt","MyBelt"]
[null,"Garr's Reinforced Girdle of Memories","Epic","Plate","World Boss","World Boss","Garr - Mount Hyjal","No",359,1927,380,253,0,0,0,169,0,169,0,0,0,0,null,null,null,null,null,null,null,null,null,null,"Belt","MyBelt"]
[null,"Rickety Belt","Epic","Plate","Vendor / Badge","Vendor","Damek Bloombeard - Additional Armaments","Yes",365,1961,402,248,0,0,0,0,188,0,139,0,0,0,null,null,"r",null,null,null,"Crit",10,null,null,"Belt","MyBelt"]
[null,"Belt of Absolute Zero (Heroic)","Epic","Plate","Blackwing Descent","Heroic Blackwing Descent","Maloriak","No",372,1927,429,266,0,0,171,191,0,0,0,0,0,0,null,null,"r",null,null,null,"Hit",10,null,null,"Belt","MyBelt"]
[null,"Cinch of the Flaming Ember","Epic","Plate","Vendor / Badge","Vendor","Avengers of Hyjal","Yes",378,2037,454,282,0,0,133,230,0,0,0,0,0,0,null,null,"b",null,null,null,"Str",10,null,null,"Belt","MyBelt"]
[null,"Cinch of the Flaming Ember (Heroic)","Epic","Plate","Vendor / Badge","Vendor","Not Presently Available","Yes",391,2116,513,322,0,0,153,260,0,0,0,0,0,0,null,null,"b",null,null,null,"Str",10,null,null,"Belt","MyBelt"]
[]
[null,"-----PVP-----"]
[]
[null,"----Craft----"]
[null,"Redsteel Belt","Rare","Plate","Craftable","Craftable","Blacksmithing",{"$f":"IF(AND(VLOOKUP(C222,FilterRareLookup,2,FALSE)=\"Yes\",VLOOKUP(E222,FilterLootLookup,2,FALSE)=\"Yes\",I222>=iLevelFilter),\"Yes\",\"No\")","v":"No"},316,1642,255,170,0,0,0,0,0,113,113,0,0,0,null,null,null,null,null,null,null,null,null,null,"Belt","MyBelt"]
[null,"Elementium Girdle of Pain","Epic","Plate","Craftable","Craftable","Blacksmithing",{"$f":"IF(AND(VLOOKUP(C223,FilterRareLookup,2,FALSE)=\"Yes\",VLOOKUP(E223,FilterLootLookup,2,FALSE)=\"Yes\",I223>=iLevelFilter),\"Yes\",\"No\")","v":"No"},359,1927,380,233,0,0,169,0,149,0,0,0,0,0,null,null,"y",null,null,null,"Str",10,null,null,"Belt","MyBelt"]
[]
[null,"----User Added----"]
[]
[]
[]
[null,"-----Plate-----"]
[null,"Bracers of Bloody Business","Rare","Plate","World Drop","World Drop","World Drop",{"$f":"IF(AND(VLOOKUP(C230,FilterRareLookup,2,FALSE)=\"Yes\",VLOOKUP(E230,FilterLootLookup,2,FALSE)=\"Yes\",I230>=iLevelFilter),\"Yes\",\"No\")","v":"No"},292,1158,153,102,0,0,0,68,0,0,68,0,0,0,null,null,null,null,null,null,null,null,null,null,"Bracer","MyBracer"]
[null,"Petrified Stone Bracers","Rare","Plate","Quest","Quest","Rock Bottom","No",305,1221,173,115,0,0,0,73,0,0,79,0,0,0,null,null,null,null,null,null,null,null,null,null,"Bracer","MyBracer"]
[null,"Bracers of Cooled Anger","Rare","Plate","Pre-Raid Dungeons","Blackrock Caverns","Karsh Steelbender","No",308,1236,177,118,0,0,0,79,0,0,79,0,0,0,null,null,null,null,null,null,null,null,null,null,"Bracer","MyBracer"]
[null,"Weaponseeker Bracers","Rare","Plate","Quest","Quest","Ancient Weapons","No",312,1256,184,123,0,0,0,64,92,0,0,0,0,0,null,null,null,null,null,null,null,null,null,null,"Bracer","MyBracer"]
[null,"Scavenger Bracers","Rare","Plate","Quest","Quest","Missing Parts/Unfamiliar Waters","No",318,1287,195,130,0,0,71,0,95,0,0,0,0,0,null,null,null,null,null,null,null,null,null,null,"Bracer","MyBracer"]
[null,"Bracers of Gleaming Shards","Rare","Plate","Quest","Quest","A Little on the Side","No",318,1287,195,130,0,0,0,87,0,0,87,0,0,0,null,null,null,null,null,null,null,null,null,null,"Bracer","MyBracer"]
[null,"Alpha Bracers","Rare","Plate","Pre-Raid Dungeons","Halls of Origination","Anraphet","No",333,1369,224,129,0,0,80,0,0,100,0,0,0,0,null,null,"y",null,null,null,"Mastery",10,null,null,"Bracer","MyBracer"]
[null,"Terborus's Rotating Bands","Rare","Plate","World Drop","Deepholm","Terborus","No",346,1443,252,148,0,0,92,0,0,112,0,0,0,0,null,null,"y",null,null,null,"Mastery",10,null,null,"Bracer","MyBracer"]
[null,"Bracers of Cooled Anger (Heroic)","Rare","Plate","Pre-Raid Dungeons","Heroic Blackrock Caverns","Karsh Steelbender","No",346,1443,252,168,0,0,0,112,0,0,112,0,0,0,null,null,null,null,null,null,null,null,null,null,"Bracer","MyBracer"]
[null,"Alpha Bracers (Heroic)","Rare","Plate","Pre-Raid Dungeons","Heroic Halls of Origination","Anraphet","No",346,1443,252,148,0,0,92,0,0,112,0,0,0,0,null,null,"y",null,null,null,"Mastery",10,null,null,"Bracer","MyBracer"]
[null,"Deathcharged Wristguards","Epic","Plate","Pre-Raid Dungeons","Heroic Zul'Gurub","Bloodlord Mandokir","No",353,1473,270,180,0,0,0,111,0,0,125,0,0,0,null,null,null,null,null,null,null,null,null,null,"Bracer","MyBracer"]
[null,"Electron Inductor Coils","Epic","Plate","Blackwing Descent","Blackwing Descent","Omnotron Defense","No",359,1499,286,190,0,0,127,0,127,0,0,0,0,0,null,null,null,null,null,null,null,null,null,null,"Bracer","MyBracer"]
[null,"Electron Inductor Coils (Heroic)","Epic","Plate","Blackwing Descent","Heroic Blackwing Descent","Heroic Omnotron Defense","No",372,1557,322,215,0,0,143,0,143,0,0,0,0,0,null,null,null,null,null,null,null,null,null,null,"Bracer","MyBracer"]
[null,"Earthcrack Bracers","Epic","Plate","Firelands","Firelands","Lord Rhyolith","Yes",378,1584,341,227,0,0,0,158,140,0,0,0,0,0,null,null,null,null,null,null,null,null,null,null,"Bracer","MyBracer"]
[null,"Gigantiform Bracers","Epic","Plate","Vendor / Badge","Vendor","1250 Valor Points","Yes",378,1584,341,227,0,0,115,0,0,173,0,0,0,0,null,null,null,null,null,null,null,null,null,null,"Bracer","MyBracer"]
[null,"Bracers of the Mat'redor","Epic","Plate","The Bastion of Twilight","Heroic The Bastion of Twilight","Heroic Sinestra","No",379,1589,344,229,0,0,0,153,113,0,0,0,0,0,null,null,"y",null,null,null,"Str",10,null,null,"Bracer","MyBracer"]
[null,"Earthcrack Bracers (Heroic)","Epic","Plate","Firelands","Heroic Firelands","Lord Rhyolith","Yes",391,1646,384,256,0,0,0,178,158,0,0,0,0,0,null,null,null,null,null,null,null,null,null,null,"Bracer","MyBracer"]
[null,"Gigantiform Bracers (Heroic)","Epic","Plate","Vendor / Badge","Vendor","Crystallized Firestone","Yes",391,1646,384,256,0,0,130,0,0,195,0,0,0,0,null,null,null,null,null,null,null,null,null,null,"Bracer","MyBracer"]
[]
[null,"-----PVP-----"]
[]
[null,"----Craft----"]
[null,"Redsteel Bracers","Rare","Plate","Craftable","Craftable","Blacksmithing",{"$f":"IF(AND(VLOOKUP(C252,FilterRareLookup,2,FALSE)=\"Yes\",VLOOKUP(E252,FilterLootLookup,2,FALSE)=\"Yes\",I252>=iLevelFilter),\"Yes\",\"No\")","v":"No"},289,1144,148,99,0,0,0,66,66,0,0,0,0,0,null,null,null,null,null,null,null,null,null,null,"Bracer","MyBracer"]
[]
[null,"----User Added----"]
[]
[]
[]
[null,"-----Cloaks-----"]
[null,"Hyjal Savior's Drape","Rare","NonArmour","Quest","Quest","The Firelord",{"$f":"IF(AND(VLOOKUP(C259,FilterRareLookup,2,FALSE)=\"Yes\",VLOOKUP(E259,FilterLootLookup,2,FALSE)=\"Yes\",I259>=iLevelFilter),\"Yes\",\"No\")","v":"No"},288,547,148,98,0,0,0,71,0,0,56,0,0,0,null,null,null,null,null,null,null,null,null,null,"Back","MyBack"]
[null,"Cloak of Fungal Growth","Rare","NonArmour","Quest","Quest","Gone Soft","No",305,557,173,115,0,0,0,60,0,87,0,0,0,0,null,null,null,null,null,null,null,null,null,null,"Back","MyBack"]
[null,"Eagle Ray Cloak","Rare","NonArmour","Pre-Raid Dungeons","Throne of the Tides","Commander Ulthok","No",308,558,177,118,0,0,0,0,79,79,0,0,0,0,null,null,null,null,null,null,null,null,null,null,"Back","MyBack"]
[null,"Burned Gatherings","Rare","NonArmour","Pre-Raid Dungeons","Blackrock Caverns","Karsh Steelbender","No",308,558,177,85,0,0,69,0,0,118,0,0,0,0,null,null,null,null,null,null,null,null,null,null,"Back","MyBack"]
[null,"Skin of Stone","Rare","NonArmour","World Drop","Zone Drop","The Stonecore","No",316,563,191,127,0,0,0,85,0,85,0,0,0,0,null,null,null,null,null,null,null,null,null,null,"Back","MyBack"]
[null,"Crystal Shimmer Cloak","Rare","NonArmour","Quest","Quest","Wayward Child","No",316,563,191,127,0,0,85,0,85,0,0,0,0,0,null,null,null,null,null,null,null,null,null,null,"Back","MyBack"]
[null,"Cloak of Rich Anger","Rare","NonArmour","World Drop","World Drop","World Drop","No",325,568,207,138,0,0,0,0,92,92,0,0,0,0,null,null,null,null,null,null,null,null,null,null,"Back","MyBack"]
[null,"Shroud of the Dead","Rare","NonArmour","Vendor / Badge","Vendor","Ramkahen Honored","No",333,572,224,149,0,0,0,100,0,100,0,0,0,0,null,null,null,null,null,null,null,null,null,null,"Back","MyBack"]
[null,"Geordan's Cloak","Rare","NonArmour","Pre-Raid Dungeons","Lost City of the Tol'vir","Siamat","No",333,572,224,149,0,0,87,107,0,0,0,0,0,0,null,null,null,null,null,null,null,null,null,null,"Back","MyBack"]
[null,"Cloak of the Red Flight","Rare","NonArmour","Quest","Quest","Battle of Life and Death","No",333,572,224,149,0,0,110,83,0,0,0,0,0,0,null,null,null,null,null,null,null,null,null,null,"Back","MyBack"]
[null,"Shadow of the Past (Heroic)","Rare","NonArmour","Pre-Raid Dungeons","Heroic The Deadmines","Glubtok","No",346,580,252,168,0,0,0,112,112,0,0,0,0,0,null,null,null,null,null,null,null,null,null,null,"Back","MyBack"]
[null,"Geordan's Cloak (Heroic)","Rare","NonArmour","Pre-Raid Dungeons","Heroic Lost City of the Tol'vir","Siamat","No",346,580,252,168,0,0,98,120,0,0,0,0,0,0,null,null,null,null,null,null,null,null,null,null,"Back","MyBack"]
[null,"Eagle Ray Cloak (Heroic)","Rare","NonArmour","Pre-Raid Dungeons","Heroic Throne of the Tides","Commander Ulthok","No",346,580,252,168,0,0,0,0,112,112,0,0,0,0,null,null,null,null,null,null,null,null,null,null,"Back","MyBack"]
[null,"Burned Gatherings (Heroic)","Rare","NonArmour","Pre-Raid Dungeons","Heroic Blackrock Caverns","Karsh Steelbender","No",346,580,252,120,0,0,98,0,0,168,0,0,0,0,null,null,null,null,null,null,null,null,null,null,"Back","MyBack"]
[null,"Hex Lord's Bloody Cloak","Epic","NonArmour","Pre-Raid Dungeons","Heroic Zul'Aman","Hex Lord Malacrass","No",353,604,270,180,0,0,null,0,117,122,0,0,0,0,null,null,null,null,null,null,null,null,null,null,"Back","MyBack"]
[null,"Glittering Epidermis","Epic","NonArmour","The Bastion of Twilight","The Bastion of Twilight","Elementium Monstrosity","No",359,625,286,190,0,0,0,127,127,0,0,0,0,0,null,null,null,null,null,null,null,null,null,null,"Back","MyBack"]
[null,"Floating Web","Epic","NonArmour","Vendor / Badge","Vendor","1250 Valor Points","No",359,625,286,190,0,0,0,0,0,127,127,0,0,0,null,null,null,null,null,null,null,null,null,null,"Back","MyBack"]
[null,"Drape of Inimitable Fate","Epic","NonArmour","World Drop","World Drop",null,"No",359,625,286,190,0,0,0,127,127,0,0,0,0,0,null,null,null,null,null,null,null,null,null,null,"Back","MyBack"]
[null,"Mantle of Fury","Epic","NonArmour","Quest","Quest","Elemental Bonds: The Vow","No",365,647,301,201,0,0,0,134,134,0,0,0,0,0,null,null,null,null,null,null,null,null,null,null,"Back","MyBack"]
[null,"Glittering Epidermis (Heroic)","Epic","NonArmour","The Bastion of Twilight","Heroic The Bastion of Twilight","Elementium Monstrosity","No",372,673,322,215,0,0,0,143,143,0,0,0,0,0,null,null,null,null,null,null,null,null,null,null,"Back","MyBack"]
[null,"Bladed Flamewrath Cover","Epic","NonArmour","Vendor / Badge","Vendor","Avengers of Hyjal","Yes",378,695,341,227,0,0,0,0,173,0,115,0,0,0,null,null,null,null,null,null,null,null,null,null,"Back","MyBack"]
[null,"Bladed Flamewrath Cover (Heroic)","Epic","NonArmour","Vendor / Badge","Vendor","Not Presently Available","Yes",391,745,384,256,0,0,0,0,195,0,130,0,0,0,null,null,null,null,null,null,null,null,null,null,"Back","MyBack"]
[]
[null,"-----PVP-----"]
[]
[null,"----Craft----"]
[]
[null,"----User Added----"]
[]
[]
[]
[null,"-----Necks-----"]
[null,"Emerald Dragonet Choker","Rare","NonArmour","Quest","Quest","Visions of the Past: Risefrom the Deep",{"$f":"IF(AND(VLOOKUP(C291,FilterRareLookup,2,FALSE)=\"Yes\",VLOOKUP(E291,FilterLootLookup,2,FALSE)=\"Yes\",I291>=iLevelFilter),\"Yes\",\"No\")","v":"No"},288,0,148,98,0,0,0,0,73,0,53,0,0,0,null,null,null,null,null,null,null,null,null,null,"Neck","MyNeck"]
[null,"Amulet of the Howling Watch","Rare","NonArmour","World Drop","World Drop","World Drop","No",300,0,165,110,0,0,0,0,82,0,59,0,0,0,null,null,null,null,null,null,null,null,null,null,"Neck","MyNeck"]
[null,"Eye of Heaven","Rare","NonArmour","World Drop","World Drop","World Drop","No",308,0,178,118,0,0,0,0,88,0,64,0,0,0,null,null,null,null,null,null,null,null,null,null,"Neck","MyNeck"]
[null,"Wheelman's Choker","Rare","NonArmour","Quest","Quest","Riding Shotgun!","No",312,0,184,123,0,0,86,74,0,0,0,0,0,0,null,null,null,null,null,null,null,null,null,null,"Neck","MyNeck"]
[null,"Red Sky Pendant","Rare","NonArmour","Pre-Raid Dungeons","The Vortex Pinnacle","Grand Vizier Ertan","No",316,0,191,127,0,0,0,85,0,85,0,0,0,0,null,null,null,null,null,null,null,null,null,null,"Neck","MyNeck"]
[null,"Nightmare Choker","Rare","NonArmour","Quest","Quest","Nightmare","No",318,0,195,130,0,0,0,76,0,0,93,0,0,0,null,null,null,null,null,null,null,null,null,null,"Neck","MyNeck"]
[null,"Amulet of Reconstruction","Rare","NonArmour","Quest","Quest","The World Pillar Fragment","No",318,0,195,130,0,0,0,82,89,0,0,0,0,0,null,null,null,null,null,null,null,null,null,null,"Neck","MyNeck"]
[null,"Necklace of the Dead City","Rare","NonArmour","Quest","Quest","The Fall of Neferset City","No",325,0,207,138,0,0,0,0,101,77,0,0,0,0,null,null,null,null,null,null,null,null,null,null,"Neck","MyNeck"]
[null,"Seedling Pod","Rare","NonArmour","Pre-Raid Dungeons","Halls of Origination","Ammunae","No",333,0,224,149,0,0,100,0,100,0,0,0,0,0,null,null,null,null,null,null,null,null,null,null,"Neck","MyNeck"]
[null,"Seedling Pod (Heroic)","Rare","NonArmour","Pre-Raid Dungeons","Heroic Halls of Origination","Ammunae","No",346,0,252,168,0,0,112,0,112,0,0,0,0,0,null,null,null,null,null,null,null,null,null,null,"Neck","MyNeck"]
[null,"Red Sky Pendant (Heroic)","Rare","NonArmour","Pre-Raid Dungeons","Heroic The Vortex Pinnacle","Grand Vizier Ertan","No",346,0,252,168,0,0,0,112,0,112,0,0,0,0,null,null,null,null,null,null,null,null,null,null,"Neck","MyNeck"]
[null,"Pendant of Quiet Breath","Rare","NonArmour","Vendor / Badge","Vendor","1250 Justice Points","No",346,0,252,168,0,0,0,112,0,0,112,0,0,0,null,null,null,null,null,null,null,null,null,null,"Neck","MyNeck"]
[null,"Choker of the Pure Heart","Rare","NonArmour","World Boss","Heroic Shadowfang Keep","Apothecary Hummel (Love is in the Air)","No",346,0,252,168,0,0,116,107,0,0,0,0,0,0,null,null,null,null,null,null,null,null,null,null,"Neck","MyNeck"]
[null,"Baroness Silverlaine's Locket","Rare","NonArmour","Pre-Raid Dungeons","Heroic Shadowfang Keep","Baron Silverlaine","No",346,0,252,168,0,0,0,0,112,112,0,0,0,0,null,null,null,null,null,null,null,null,null,null,"Neck","MyNeck"]
[null,"Rage of Ages","Epic","NonArmour","Blackwing Descent","Blackwing Descent","Nefarian","No",359,0,286,190,0,0,127,0,0,127,0,0,0,0,null,null,null,null,null,null,null,null,null,null,"Neck","MyNeck"]
[null,"Gift of Nadun","Epic","NonArmour","Vendor / Badge","Vendor","Ramkahen Exalted","No",359,0,286,190,0,0,0,127,127,0,0,0,0,0,null,null,null,null,null,null,null,null,null,null,"Neck","MyNeck"]
[null,"Buc-Zakai Choker","Epic","NonArmour","World Drop","Zone Drop","L85 Instance","No",359,0,286,190,0,0,0,0,127,127,0,0,0,0,null,null,null,null,null,null,null,null,null,null,"Neck","MyNeck"]
[null,"Fireheart Necklace","Epic","NonArmour","Vendor / Badge","Vendor","Guardians of Hyjal","Yes",365,0,301,201,0,0,0,0,0,131,136,0,0,0,null,null,null,null,null,null,null,null,null,null,"Neck","MyNeck"]
[null,"Rage of Ages (Heroic)","Epic","NonArmour","Blackwing Descent","Heroic Blackwing Descent","Nefarian","No",372,0,322,215,0,0,143,0,0,143,0,0,0,0,null,null,null,null,null,null,null,null,null,null,"Neck","MyNeck"]
[null,"Necklace of Fetishes","Epic","NonArmour","Firelands","Firelands","Shannox","Yes",378,0,341,227,0,0,126,167,0,0,0,0,0,0,null,null,null,null,null,null,null,null,null,null,"Neck","MyNeck"]
[null,"Stoneheart Choker","Epic","NonArmour","Vendor / Badge","Vendor","1250 Valor Points","Yes",378,0,341,227,0,0,0,160,0,0,137,0,0,0,null,null,null,null,null,null,null,null,null,null,"Neck","MyNeck"]
[null,"Necklace of Fetishes (Heroic)","Epic","NonArmour","Firelands","Firelands","Shannox","Yes",391,0,384,256,0,0,142,188,0,0,0,0,0,0,null,null,null,null,null,null,null,null,null,null,"Neck","MyNeck"]
[null,"Stoneheart Choker (Heroic)","Epic","NonArmour","Vendor / Badge","Vendor","Crystallized Firestone","Yes",391,0,384,256,0,0,0,181,0,0,154,0,0,0,null,null,null,null,null,null,null,null,null,null,"Neck","MyNeck"]
[]
[null,"-----PVP-----"]
[]
[null,"----Craft----"]
[null,"Bloodthirsty Ruby Choker","Epic","Plate","Craftable","Craftable","Jewelcrafting",{"$f":"IF(AND(VLOOKUP(C318,FilterRareLookup,2,FALSE)=\"Yes\",VLOOKUP(E318,FilterLootLookup,2,FALSE)=\"Yes\",I318>=iLevelFilter),\"Yes\",\"No\")","v":"No"},358,0,282,188,0,0,0,0,0,0,126,0,0,0,null,null,null,null,null,null,null,null,null,null,"Neck","MyNeck"]
[]
[null,"----User Added----"]
[]
[]
[]
[null,"-----Rings-----"]
[null,"Prismatic Periwinkle Band","Rare","NonArmour","Quest","Quest","Lady La-La's Medallion",{"$f":"IF(AND(VLOOKUP(C325,FilterRareLookup,2,FALSE)=\"Yes\",VLOOKUP(E325,FilterLootLookup,2,FALSE)=\"Yes\",I325>=iLevelFilter),\"Yes\",\"No\")","v":"No"},288,0,148,98,0,0,0,58,0,70,0,0,0,0,null,null,null,null,null,null,null,null,null,null,"Ring","MyRing"]
[null,"Therazane's Seal","Rare","NonArmour","Quest","Quest","Audience with the Stonemother","No",305,0,173,115,0,0,0,79,0,0,73,0,0,0,null,null,null,null,null,null,null,null,null,null,"Ring","MyRing"]
[null,"Signet of Transformation","Rare","NonArmour","Pre-Raid Dungeons","Blackrock Caverns","Corla, Herald of Twilight","No",308,0,177,118,0,0,0,0,79,79,0,0,0,0,null,null,null,null,null,null,null,null,null,null,"Ring","MyRing"]
[null,"Skyshard Ring","Rare","NonArmour","Pre-Raid Dungeons","The Vortex Pinnacle","Altairus","No",316,0,191,127,0,0,0,91,0,0,74,0,0,0,null,null,null,null,null,null,null,null,null,null,"Ring","MyRing"]
[null,"Band of the Virtuous","Rare","NonArmour","World Drop","World Drop",null,"No",316,0,191,127,0,0,0,74,0,91,0,0,0,0,null,null,null,null,null,null,null,null,null,null,"Ring","MyRing"]
[null,"Band of the Dead End","Rare","NonArmour","Quest","Quest","A Long Way from Home","No",316,0,191,127,0,0,74,0,0,91,0,0,0,0,null,null,null,null,null,null,null,null,null,null,"Ring","MyRing"]
[null,"Dark-Eye Ring","Rare","NonArmour","Quest","Quest","Eye Spy","No",318,0,195,130,0,0,0,72,0,95,0,0,0,0,null,null,null,null,null,null,null,null,null,null,"Ring","MyRing"]
[null,"Umbriss Band","Rare","NonArmour","Pre-Raid Dungeons","Grim Batol","General Umbriss","No",333,0,224,114,0,0,76,0,0,149,0,0,0,0,null,null,null,null,null,null,null,null,null,null,"Ring","MyRing"]
[null,"Ring of the Darkest Day","Rare","NonArmour","Pre-Raid Dungeons","Lost City of the Tol'vir","High Prophet Barim","No",333,0,224,114,0,0,0,87,0,107,0,0,0,0,null,null,null,null,null,null,null,null,null,null,"Ring","MyRing"]
[null,"Nova Band","Rare","NonArmour","Pre-Raid Dungeons","Halls of Origination","Isiset","No",333,0,224,114,0,0,100,100,0,0,0,0,0,0,null,null,null,null,null,null,null,null,null,null,"Ring","MyRing"]
[null,"Galrond's Band","Rare","NonArmour","Vendor / Badge","Vendor","Guardians of Hyjal Honored","No",333,0,224,114,0,0,0,100,0,100,0,0,0,0,null,null,null,null,null,null,null,null,null,null,"Ring","MyRing"]
[null,"Circle of Bone","Rare","NonArmour","Pre-Raid Dungeons","Grim Batol","Erudax","No",333,0,224,149,0,0,100,0,100,0,0,0,0,0,null,null,null,null,null,null,null,null,null,null,"Ring","MyRing"]
[null,"Umbriss Band (Heroic)","Rare","NonArmour","Pre-Raid Dungeons","Heroic Grim Batol","General Umbriss","No",346,0,252,128,0,0,85,0,0,168,0,0,0,0,null,null,null,null,null,null,null,null,null,null,"Ring","MyRing"]
[null,"Skyshard Ring (Heroic)","Rare","NonArmour","Pre-Raid Dungeons","Heroic The Vortex Pinnacle","Altairus","No",346,0,252,168,0,0,120,0,0,0,98,0,0,0,null,null,null,null,null,null,null,null,null,null,"Ring","MyRing"]
[null,"Signet of Transformation (Heroic)","Rare","NonArmour","Pre-Raid Dungeons","Heroic Blackrock Caverns","Corla, Herald of Twilight","No",346,0,252,168,0,0,0,0,112,112,0,0,0,0,null,null,null,null,null,null,null,null,null,null,"Ring","MyRing"]
[null,"Ring of the Darkest Day (Heroic)","Rare","NonArmour","Pre-Raid Dungeons","Heroic Lost City of the Tol'vir","High Prophet Barim","No",346,0,252,168,0,0,0,98,0,120,0,0,0,0,null,null,null,null,null,null,null,null,null,null,"Ring","MyRing"]
[null,"Red Rock Band","Rare","NonArmour","Vendor / Badge","Vendor","Ramkahen Revered","No",346,0,252,120,0,0,0,0,0,168,98,0,0,0,null,null,null,null,null,null,null,null,null,null,"Ring","MyRing"]
[null,"Nova Band (Heroic)","Rare","NonArmour","Pre-Raid Dungeons","Heroic Halls of Origination","Isiset","No",346,0,252,168,0,0,112,112,0,0,0,0,0,0,null,null,null,null,null,null,null,null,null,null,"Ring","MyRing"]
[null,"Gorsik's Band of Shattering","Rare","NonArmour","Vendor / Badge","Vendor","Therazane Revered","No",346,0,252,168,0,0,0,112,112,0,0,0,0,0,null,null,null,null,null,null,null,null,null,null,"Ring","MyRing"]
[null,"Circle of Bone (Heroic)","Rare","NonArmour","Pre-Raid Dungeons","Heroic Grim Batol","Erudax","No",346,0,252,168,0,0,112,0,112,0,0,0,0,0,null,null,null,null,null,null,null,null,null,null,"Ring","MyRing"]
[null,"Band of the Gurbashi Berserker","Epic","NonArmour","Pre-Raid Dungeons","Heroic Zul'Gurub","Zone Drop","No",353,0,270,180,0,0,94,0,0,0,135,0,0,0,null,null,null,null,null,null,null,null,null,null,"Ring","MyRing"]
[null,"Ring of the Numberless Brood","Epic","NonArmour","Pre-Raid Dungeons","Heroic Zul'Aman","Jan'alai","No",353,0,270,180,0,0,0,0,114,123,0,0,0,0,null,null,null,null,null,null,null,null,null,null,"Ring","MyRing"]
[null,"Ring of Rivalry","Epic","NonArmour","The Bastion of Twilight","The Bastion of Twilight","Valiona","No",359,0,286,190,0,0,0,0,127,0,127,0,0,0,null,null,null,null,null,null,null,null,null,null,"Ring","MyRing"]
[null,"Blauvelt's Family Crest","Epic","NonArmour","World Drop","World Drop","L85 Dungeon","No",359,0,286,190,0,0,0,0,127,127,0,0,0,0,null,null,null,null,null,null,null,null,null,null,"Ring","MyRing"]
[null,"Band of Bees","Epic","NonArmour","Vendor / Badge","Vendor","1250 Valor Points","No",359,0,286,190,0,0,0,0,127,127,0,0,0,0,null,null,null,null,null,null,null,null,null,null,"Ring","MyRing"]
[null,"Meteorite Ring","Epic","NonArmour","Vendor / Badge","Vendor","Damek Bloombeard - Additional Armaments","Yes",365,0,301,201,0,0,0,151,105,0,0,0,0,0,null,null,null,null,null,null,null,null,null,null,"Ring","MyRing"]
[null,"Moon Blessed Band","Epic","NonArmour","Vendor / Badge","Vendor","Ayla Shadowstorm - Filling the Moonwell","Yes",365,0,301,201,0,0,114,146,0,0,0,0,0,0,null,null,null,null,null,null,null,null,null,null,"Ring","MyRing"]
[null,"Ring of Rivalry (Heroic)","Epic","NonArmour","The Bastion of Twilight","The Bastion of Twilight","Valiona","No",372,0,322,215,0,0,0,0,143,0,143,0,0,0,null,null,null,null,null,null,null,null,null,null,"Ring","MyRing"]
[null,"Alysrazor's Band","Epic","NonArmour","Firelands","Firelands","Alysrazor","Yes",378,0,341,227,0,0,0,0,107,0,150,0,0,0,null,null,"r",null,null,null,"Str",10,null,null,"Ring","MyRing"]
[null,"Serrated Brimstone Signet","Epic","NonArmour","Vendor / Badge","Vendor","1250 Valor Points","Yes",378,0,341,227,0,0,0,156,144,0,0,0,0,0,null,null,null,null,null,null,null,null,null,null,"Ring","MyRing"]
[null,"Dargonax's Signet","Epic","NonArmour","The Bastion of Twilight","Heroic The Bastion of Twilight","Heroic Sinestra","No",379,0,344,229,0,0,0,113,0,153,0,0,0,0,null,null,"y",null,null,null,"Str",10,null,null,"Ring","MyRing"]
[null,"Alysrazor's Band (Heroic)","Epic","NonArmour","Firelands","Heroic Firelands","Alysrazor","Yes",391,0,384,256,0,0,0,0,124,0,171,0,0,0,null,null,"r",null,null,null,"Str",10,null,null,"Ring","MyRing"]
[null,"Serrated Brimstone Signet (Heroic)","Epic","NonArmour","Vendor / Badge","Vendor","Crystallized Firestone","Yes",391,0,384,256,0,0,0,176,162,0,0,0,0,0,null,null,null,null,null,null,null,null,null,null,"Ring","MyRing"]
[null,"Obsidian Signet of the Avengers","Epic","NonArmour","Vendor / Badge","Vendor","Avengers of Hyjal","Yes",391,0,384,236,0,0,110,195,0,0,0,0,0,0,null,null,"r",null,null,null,"Str",10,null,null,"Ring","MyRing"]
[]
[null,"-----PVP-----"]
[]
[null,"----Craft----"]
[null,"Bloodthirsty Ruby Signet","Epic","Plate","Craftable","Craftable","Jewelcrafting",{"$f":"IF(AND(VLOOKUP(C363,FilterRareLookup,2,FALSE)=\"Yes\",VLOOKUP(E363,FilterLootLookup,2,FALSE)=\"Yes\",I363>=iLevelFilter),\"Yes\",\"No\")","v":"No"},358,0,282,188,0,0,0,126,0,0,0,0,0,0,null,null,null,null,null,null,null,null,null,null,"Ring","MyRing"]
[]
[null,"----User Added----"]
[]
[]
[]
[null,"-----Trinkets-----"]
[null,"Oremantle's Favor","Rare","NonArmour","Quest","Quest","Rescue the Stonefather… and Flint",{"$f":"IF(AND(VLOOKUP(C370,FilterRareLookup,2,FALSE)=\"Yes\",VLOOKUP(E370,FilterLootLookup,2,FALSE)=\"Yes\",I370>=iLevelFilter),\"Yes\",\"No\")","v":"No"},294,0,0,194,0,0,0,0,0,0,0,0,0,0,null,null,null,null,null,null,"Crit",{"$f":"IF(Estimations=\"Off\",0,((20*((Length/120) - (TrinketReset / 2))/Length)*970))","v":161.66666666666666},null,null,"Trinket","MyTrinket"]
[null,"Magnetite Mirror","Rare","NonArmour","Pre-Raid Dungeons","The Stonecore","High Priestess Azil","No",316,0,0,0,0,0,0,0,0,215,0,0,0,0,null,null,null,null,null,null,"Str",{"$f":"IF(Estimations=\"Off\",0,((15*((Length/90) - (TrinketReset / 2))/Length)*1075))","v":179.16666666666666},null,null,"Trinket","MyTrinket"]
[null,"Tank-Commander Insignia","Rare","NonArmour","Quest","Quest","Onc More Into the Fire/Night Terrors","No",318,0,0,219,0,0,0,0,0,0,0,0,0,0,null,null,null,null,null,null,"Haste",{"$f":"IF(Estimations=\"Off\",0,(1314*(20*((Length/105) - (TrinketReset / 3))/Length)))","v":250.28571428571428},null,null,"Trinket","MyTrinket"]
[null,"Harrison's Insignia of Panache","Rare","NonArmour","Quest","Quest","Firing Squad","No",325,0,0,234,0,0,0,0,0,0,0,0,0,0,null,null,null,null,null,null,"Mastery",{"$f":"IF(Estimations=\"Off\",0,(918*(20*((Length/105) - (TrinketReset / 3))/Length)))","v":174.85714285714286},null,null,"Trinket","MyTrinket"]
[null,"Soul's Anguish","Rare","NonArmour","World Drop","World Drop",null,"No",333,0,0,0,0,0,252,0,0,0,0,0,0,0,null,null,null,null,null,null,"Str",{"$f":"IF(Estimations=\"Off\",0,((15*((Length/90) - (TrinketReset / 2))/Length)*765))","v":127.5},null,null,"Trinket","MyTrinket"]
[null,"Right Eye of Rajh","Rare","NonArmour","Pre-Raid Dungeons","Halls of Origination","Rajh","No",333,0,0,0,0,0,252,0,0,0,0,0,0,0,null,null,null,null,null,null,"Str",{"$f":"IF(Estimations=\"Off\",0,(1512*(10*((Length/(50 + (Length / SUM('DPS Calc'!G7:H7,'DPS Calc'!G23:H23,'DPS Calc'!G52:H52,'DPS Calc'!K49:L49,'DPS Calc'!O8:P8)))) - (TrinketReset / 3))/Length)))","v":272.21454144965162},null,null,"Trinket","MyTrinket"]
[null,"Mark of Khardros","Rare","NonArmour","Pre-Raid Dungeons","Grim Batol","Erudax","No",333,0,252,0,0,0,0,0,0,0,0,0,0,0,null,null,null,null,null,null,"Mastery",{"$f":"IF(Estimations=\"Off\",0,((15*((Length/90) - (TrinketReset / 2))/Length)*1260))","v":210},null,null,"Trinket","MyTrinket"]
[null,"Heart of Solace","Rare","NonArmour","Pre-Raid Dungeons","Heroic Lost City of the Tol'vir","Augh","No",346,0,0,0,0,0,0,0,252,0,0,0,0,0,null,null,null,null,null,null,"Str",{"$f":"IF(Estimations=\"Off\",0,(1512*(20*((Length/105) - (TrinketReset / 3))/Length)))","v":288},null,null,"Trinket","MyTrinket"]
[null,"Right Eye of Rajh (Heroic)","Rare","NonArmour","Pre-Raid Dungeons","Heroic Halls of Origination","Rajh","No",346,0,0,0,0,0,285,0,0,0,0,0,0,0,null,null,null,null,null,null,"Str",{"$f":"IF(Estimations=\"Off\",0,(1710*(10*((Length/(50 + (Length / SUM('DPS Calc'!G7:H7,'DPS Calc'!G23:H23,'DPS Calc'!G52:H52,'DPS Calc'!K49:L49,'DPS Calc'!O8:P8)))) - (TrinketReset / 3))/Length)))","v":307.86168378234407},null,null,"Trinket","MyTrinket"]
[null,"Might of the Ocean (Heroic)","Rare","NonArmour","Pre-Raid Dungeons","Heroic Throne of the Tides","Neptulon's Cache","No",346,0,0,0,0,0,285,0,0,0,0,0,0,0,null,null,null,null,null,null,"Str",{"$f":"IF(Estimations=\"Off\",0,((15*((Length/90) - (TrinketReset / 2))/Length)*1425))","v":237.5},null,null,"Trinket","MyTrinket"]
[null,"Mark of Khardros (Heroic)","Rare","NonArmour","Pre-Raid Dungeons","Heroic Grim Batol","Erudax","No",346,0,285,0,0,0,0,0,0,0,0,0,0,0,null,null,null,null,null,null,"Mastery",{"$f":"IF(Estimations=\"Off\",0,((15*((Length/90) - (TrinketReset / 2))/Length)*1425))","v":237.5},null,null,"Trinket","MyTrinket"]
[null,"Magnetite Mirror (Heroic)","Rare","NonArmour","Pre-Raid Dungeons","Heroic The Stonecore","High Priestess Azil","No",346,0,0,0,0,0,0,0,0,0,285,0,0,0,null,null,null,null,null,null,"Str",{"$f":"IF(Estimations=\"Off\",0,((15*((Length/90) - (TrinketReset / 2))/Length)*1425))","v":237.5},null,null,"Trinket","MyTrinket"]
[null,"Heart of Solace (Heroic)","Rare","NonArmour","Pre-Raid Dungeons","Heroic Lost City of the Tol'vir","Augh","No",346,0,0,0,0,0,0,0,285,0,0,0,0,0,null,null,null,null,null,null,"Str",{"$f":"IF(Estimations=\"Off\",0,(1710*(20*((Length/105) - (TrinketReset / 3))/Length)))","v":325.71428571428572},null,null,"Trinket","MyTrinket"]
[null,"License to Slay","Epic","NonArmour","Vendor / Badge","Valor Vendor","1650 Valor Points","No",359,0,0,0,0,0,321,0,0,0,0,0,0,0,null,null,null,null,null,null,"Str",{"$f":"IF(Estimations=\"Off\",0,((190 * (15 * (TrinketReset + 1))) + (380 * (Length - (15 * (TrinketReset + 1)))))/Length)","v":373.66666666666669},null,null,"Trinket","MyTrinket"]
[null,"Heart of Rage","Epic","NonArmour","Blackwing Descent","Blackwing Descent","Chimaeron","No",359,0,0,0,0,0,0,0,0,0,321,0,0,0,null,null,null,null,null,null,"Str",{"$f":"IF(Estimations=\"Off\",0,(1926*(20*((Length/105) - (TrinketReset / 3))/Length)))","v":366.85714285714283},null,null,"Trinket","MyTrinket"]
[null,"Impatience of Youth","Epic","NonArmour","Vendor / Badge","Vendor","Tol Barad Vendor","No",359,0,0,0,0,0,0,0,0,321,0,0,0,0,null,null,null,null,null,null,"Str",{"$f":"IF(Estimations=\"Off\",0,((20*((Length/120) - (TrinketReset / 2))/Length)*1605))","v":267.5},null,null,"Trinket","MyTrinket"]
[null,"Fury of Angerforge","Epic","NonArmour","Blackwing Descent","Zone Drop","Trash","No",359,0,0,0,0,0,0,321,0,0,0,0,0,0,null,null,null,null,null,null,"Str",{"$f":"IF(Estimations=\"Off\",0,((20*((Length/120) - (TrinketReset / 2))/Length)*1926))","v":321},null,null,"Trinket","MyTrinket"]
[null,"Crushing Weight","Epic","NonArmour","The Bastion of Twilight","The Bastion of Twilight","Elementium Monstrosity","No",359,0,0,321,0,0,0,0,0,0,0,0,0,0,null,null," ",null,null,null,"Haste",{"$f":"IF(Estimations=\"Off\",0,(1926*(15*((Length/80) - (TrinketReset / 3))/Length)))","v":361.125},null,null,"Trinket","MyTrinket"]
[null,"Dwyer's Caber","Epic","NonArmour","Vendor / Badge","Vendor","Varlan Highbough - Calling the Ancients","Yes",365,0,0,340,0,0,0,0,0,0,null,0,0,0,null,null,null,null,null,null,"Crit",{"$f":"IF(Estimations=\"Off\",0,((20*((Length/55) - (TrinketReset / 2))/Length)*1020))","v":370.90909090909088},null,null,"Trinket","MyTrinket"]
[null,"Heart of Rage (Heroic)","Epic","NonArmour","Blackwing Descent","Heroic Blackwing Descent","Chimaeron","No",372,0,0,0,0,0,0,0,0,0,363,0,0,0,null,null,null,null,null,null,"Str",{"$f":"IF(Estimations=\"Off\",0,(2178*(20*((Length/105) - (TrinketReset / 3))/Length)))","v":414.85714285714283},null,null,"Trinket","MyTrinket"]
[null,"Crushing Weight  (Heroic)","Epic","NonArmour","The Bastion of Twilight","Heroic The Bastion of Twilight","Elementium Monstrosity","No",372,0,0,363,0,0,0,0,0,0,0,0,0,0,null,null," ",null,null,null,"Haste",{"$f":"IF(Estimations=\"Off\",0,(2178*(15*((Length/80) - (TrinketReset / 3))/Length)))","v":408.375},null,null,"Trinket","MyTrinket"]
[null,"Apparatus of Khaz'goroth","Epic","NonArmour","Firelands","Firelands","Trash","Yes",378,0,0,383,0,0,0,0,0,0,0,0,0,0,null,null,null,null,null,null,{"$f":"IF(AND(Character!I134>Character!J134,Character!I134>Character!K134),\"Crit\",IF(AND(Character!J134>Character!I134,Character!J134>Character!K134),\"Haste\",\"Mastery\"))","v":"Haste"},{"$f":"IF(Estimations=\"Off\",0,((15*((Length/120) - (TrinketReset / 2))/Length)*2540))","v":317.5},null,null,"Trinket","MyTrinket"]
[null,"Essence of the Eternal Flame","Epic","NonArmour","Vendor / Badge","Vendor","Avengers of Hyjal","Yes",378,0,0,0,0,0,0,0,0,383,0,0,0,0,null,null,null,null,null,null,"Str",{"$f":"IF(Estimations=\"Off\",0,((15*((Length/60) - (TrinketReset / 2))/Length)*1277))","v":319.25},null,null,"Trinket","MyTrinket"]
[null,"Vessel of Acceleration","Epic","NonArmour","Firelands","Firelands","Ragnaros",{"$f":"IF(AND(VLOOKUP(C393,FilterRareLookup,2,FALSE)=\"Yes\",VLOOKUP(E393,FilterLootLookup,2,FALSE)=\"Yes\",I393>=iLevelFilter),\"Yes\",\"No\")","v":"Yes"},384,0,0,406,0,0,0,0,0,0,0,0,0,0,null,null,null,null,null,null,"Crit",{"$f":"IF(Estimations=\"Off\",0,((205 * (20 * (TrinketReset + 1))) + (410 * (Length - (20 * (TrinketReset + 1)))))/Length)","v":400.88888888888891},null,null,"Trinket","MyTrinket"]
[null,"Apparatus of Khaz'goroth (Heroic)","Epic","NonArmour","Firelands","Heroic Firelands","Crystallized Firestone",{"$f":"IF(AND(VLOOKUP(C394,FilterRareLookup,2,FALSE)=\"Yes\",VLOOKUP(E394,FilterLootLookup,2,FALSE)=\"Yes\",I394>=iLevelFilter),\"Yes\",\"No\")","v":"Yes"},391,0,0,433,0,0,0,0,0,0,0,0,0,0,null,null,null,null,null,null,{"$f":"IF(AND(Character!I134>Character!J134,Character!I134>Character!K134),\"Crit\",IF(AND(Character!J134>Character!I134,Character!J134>Character!K134),\"Haste\",\"Mastery\"))","v":"Haste"},{"$f":"IF(Estimations=\"Off\",0,((15*((Length/120) - (TrinketReset / 2))/Length)*2875))","v":359.375},null,null,"Trinket","MyTrinket"]
[null,"Essence of the Eternal Flame (Heroic)","Epic","NonArmour","Vendor / Badge","Vendor","Not Presently Available",{"$f":"IF(AND(VLOOKUP(C395,FilterRareLookup,2,FALSE)=\"Yes\",VLOOKUP(E395,FilterLootLookup,2,FALSE)=\"Yes\",I396>=iLevelFilter),\"Yes\",\"No\")","v":"Yes"},391,0,0,0,0,0,0,0,0,433,0,0,0,0,null,null,null,null,null,null,"Str",{"$f":"IF(Estimations=\"Off\",0,((15*((Length/60) - (TrinketReset / 2))/Length)*1441))","v":360.25},null,null,"Trinket","MyTrinket"]
[null,"Vessel of Acceleration (Heroic)","Epic","NonArmour","Firelands","Heroic Firelands","Ragnaros",{"$f":"IF(AND(VLOOKUP(C396,FilterRareLookup,2,FALSE)=\"Yes\",VLOOKUP(E396,FilterLootLookup,2,FALSE)=\"Yes\",I397>=iLevelFilter),\"Yes\",\"No\")","v":"No"},397,0,0,458,0,0,0,0,0,0,0,0,0,0,null,null,null,null,null,null,"Crit",{"$f":"IF(Estimations=\"Off\",0,((230 * (20 * (TrinketReset + 1))) + (460 * (Length - (20 * (TrinketReset + 1)))))/Length)","v":449.77777777777777},null,null,"Trinket","MyTrinket"]
[]
[null,"-----PVP-----"]
[null,"Vicious Gladiator's Badge of Victory","Epic","NonArmour","PvP","PvP",null,{"$f":"IF(AND(VLOOKUP(C399,FilterRareLookup,2,FALSE)=\"Yes\",VLOOKUP(E399,FilterLootLookup,2,FALSE)=\"Yes\",I399>=iLevelFilter),\"Yes\",\"No\")","v":"Yes"},365,0,0,0,0,0,0,0,0,0,0,0,0,0,0,0,null,null,null,null,"Str",{"$f":"IF(Estimations=\"Off\",0,((20*((Length/120) - (TrinketReset / 2))/Length)*1605))","v":267.5},null,null,"Trinket","MyTrinket"]
[null,"Vicious Gladiator's Insignia of Victory","Epic","NonArmour","PvP","PvP",null,{"$f":"IF(AND(VLOOKUP(C400,FilterRareLookup,2,FALSE)=\"Yes\",VLOOKUP(E400,FilterLootLookup,2,FALSE)=\"Yes\",I400>=iLevelFilter),\"Yes\",\"No\")","v":"Yes"},365,0,0,0,0,0,0,0,0,0,0,0,0,0,null,null,null,null,null,null,"Str",{"$f":"IF(Estimations=\"Off\",0,(963*(20*((Length/105) - (TrinketReset / 3))/Length)))","v":183.42857142857142},null,null,"Trinket","MyTrinket"]
[]
[null,"----Craft----"]
[null,"Figurine: King of Boars","Epic","NonArmour","Craftable","Craftable","Jewelcrafting",{"$f":"IF(AND(VLOOKUP(C403,FilterRareLookup,2,FALSE)=\"Yes\",VLOOKUP(E403,FilterLootLookup,2,FALSE)=\"Yes\",I403>=iLevelFilter),\"Yes\",\"No\")","v":"No"},346,0,0,0,0,null,0,0,0,285,0,0,0,0,null,null,null,null,null,null,"Str",{"$f":"IF(Estimations=\"Off\",0,((20*((Length/120) - (TrinketReset / 2))/Length)*1425))","v":237.5},null,null,"Trinket","MyTrinket"]
[null,"Darkmoon Card: Hurricane","Epic","NonArmour","Craftable","Craftable","Darkmoon Hurricane Deck",{"$f":"IF(AND(VLOOKUP(C404,FilterRareLookup,2,FALSE)=\"Yes\",VLOOKUP(E404,FilterLootLookup,2,FALSE)=\"Yes\",I404>=iLevelFilter),\"Yes\",\"No\")","v":"No"},359,0,0,321,0,0,0,0,0,0,0,0,0,0,null,null,null,null,null,null,"DPS",{"$f":"((((Weaponspeed / 60) * (SUM('DPS Calc'!G7:H9,'DPS Calc'!G23:H24,'DPS Calc'!G52:H53,'DPS Calc'!K49:L50,'DPS Calc'!O8:P9)))) * ((AVERAGE(3750,6250) * Communion * TwoHWeapSpec * (1 - CritTotal%)) + ((AVERAGE(3750,6250) * Communion * TwoHWeapSpec * 2) * CritTotal%)) * ((1 * 5/6) + (1.2 * 1/6)))/Length","v":404.1701888986434},null,null,"Trinket","MyTrinket"]
[null,"Volatile Alchemist Stone","Epic","NonArmour","Craftable","Craftable","Alchemy",{"$f":"IF(AND(VLOOKUP(C405,FilterRareLookup,2,FALSE)=\"Yes\",VLOOKUP(E405,FilterLootLookup,2,FALSE)=\"Yes\",I405>=iLevelFilter),\"Yes\",\"No\")","v":"No"},359,0,0,301,0,0,0,0,0,194,0,0,0,0,null,null,"r",null,null,null,"Str",10,null,null,"Trinket","MyTrinket"]
[]
[null,"----User Added----"]
[]
[]
[null,"-----Weapons-----"]
[null,"Generic Weapon",null,null,null,null,null,"No",1,0,0,0,0,0,0,0,0,0,0,0,0,0,null,null,null,null,null,null,null,null,3.8,400,"Weapon","MyWeapon","Polearm"]
[null,"Rage-Possessed Greatsword","Rare","NonArmour","World Drop","World Drop",null,{"$f":"IF(AND(VLOOKUP(C412,FilterRareLookup,2,FALSE)=\"Yes\",VLOOKUP(E412,FilterLootLookup,2,FALSE)=\"Yes\",I412>=iLevelFilter),\"Yes\",\"No\")","v":"No"},292,0,275,183,0,0,0,0,122,122,0,0,0,0,null,null,null,null,null,null,null,null,3.8,333.9,"Weapon","MyWeapon","Sword"]
[null,"Termination Axe","Rare","NonArmour","World Drop","World Drop",null,"No",308,0,319,212,0,0,0,152,124,0,0,0,0,0,null,null,null,null,null,null,null,null,3.6,387.6,"Weapon","MyWeapon","Axe"]
[null,"Ramkahen Cermonial Hammer","Rare","NonArmour","Quest","Quest","Punish the Trespassers","No",312,0,331,220,0,0,0,151,140,0,0,0,0,0,null,null,null,null,null,null,null,null,3.3,402.3,"Weapon","MyWeapon","Mace"]
[null,"Armagedillo's Tail","Rare","NonArmour","World Drop","Uldum","Armagedillo","No",312,0,331,220,0,0,0,151,140,0,0,0,0,0,null,null,null,null,null,null,null,null,3.3,402.3,"Weapon","MyWeapon","Mace"]
[null,"Sword of the Bottomless Pit","Rare","NonArmour","Pre-Raid Dungeons","The Stonecore","Ozruk","No",316,0,343,229,0,0,0,0,153,153,0,0,0,0,null,null,null,null,null,null,null,null,3.8,417.6,"Weapon","MyWeapon","Sword"]
[null,"Axe of Earthly Sundering","Rare","NonArmour","Quest","Quest","The Hero Returns","No",318,0,349,233,0,0,0,160,0,148,0,0,0,0,null,null,null,null,null,null,null,null,3.3,425.4,"Weapon","MyWeapon","Axe"]
[null,"Wild Hammer","Rare","NonArmour","Pre-Raid Dungeons","Grim Batol","Erudax","No",333,0,401,268,0,0,0,0,178,178,0,0,0,0,null,null,null,null,null,null,null,null,3.6,489.2,"Weapon","MyWeapon","Mace"]
[null,"Sorrow's End","Rare","NonArmour","World Drop","World Drop",null,"No",333,0,401,268,0,0,0,0,178,178,0,0,0,0,null,null,null,null,null,null,null,null,3.6,489.2,"Weapon","MyWeapon","Mace"]
[null,"Oversized Oblique Ogre Obliterator","Rare","NonArmour","Quest","Quest","Cruicible of Carnage: The Twilight Terror!","No",333,0,402,268,0,0,0,170,184,0,0,0,0,0,null,null,null,null,null,null,null,null,3.3,489.2,"Weapon","MyWeapon","Sword"]
[null,"Wild Hammer (Heroic)","Rare","NonArmour","Pre-Raid Dungeons","Heroic Grim Batol","Erudax","No",346,0,454,302,0,0,0,0,202,202,0,0,0,0,null,null,null,null,null,null,null,null,3.6,552.20000000000005,"Weapon","MyWeapon","Mace"]
[null,"Whitefin Axe (Heroic)","Rare","NonArmour","Pre-Raid Dungeons","Heroic Throne of the Tides","Neptulon's Cache","No",346,0,454,302,0,0,0,216,177,0,0,0,0,0,null,null,null,null,null,null,null,null,3.6,552.20000000000005,"Weapon","MyWeapon","Axe"]
[null,"Sword of the Bottomless Pit (Heroic)","Rare","NonArmour","Pre-Raid Dungeons","Heroic The Stonecore","Ozruk","No",346,0,454,302,0,0,0,0,202,202,0,0,0,0,null,null,null,null,null,null,null,null,3.8,552.20000000000005,"Weapon","MyWeapon","Sword"]
[null,"Foe Reaper (Heroic)","Rare","NonArmour","Pre-Raid Dungeons","Heroic Deadmines","Foe Reaper 5000","No",346,0,454,302,0,0,202,0,0,0,202,0,0,0,null,null,null,null,null,null,null,null,3.6,552.20000000000005,"Weapon","MyWeapon","Mace"]
[null,"Blade of the Fearless","Rare","NonArmour","Vendor / Badge","Vendor","Tol Barad Rep","No",346,0,454,302,0,0,0,202,0,0,202,0,0,0,null,null,null,null,null,null,null,null,3.8,552.20000000000005,"Weapon","MyWeapon","Sword"]
[null,"Arced War Axe (Heroic)","Rare","NonArmour","Pre-Raid Dungeons","Heroic Shadowfang Keep","Commander Springvale","No",346,0,454,302,0,0,0,202,0,0,202,0,0,0,null,null,null,null,null,null,null,null,3.5,552.20000000000005,"Weapon","MyWeapon","Axe"]
[null,"Jeklik's Smasher","Epic","NonArmour","Pre-Raid Dungeons","Heroic Zul'Gurub","Jin'do the Godbreaker","No",353,0,484,323,0,0,0,205,0,222,0,0,0,0,null,null,null,null,null,null,null,null,3.6,589.4,"Weapon","MyWeapon","Mace"]
[null,"Reforged Trollbane","Epic","NonArmour","Pre-Raid Dungeons","Heroic Zul'Aman","Timed Chest 2 or 3","No",353,0,484,323,0,0,189,0,0,231,0,0,0,0,null,null,null,null,null,null,null,null,3.6,589.4,"Weapon","MyWeapon","Axe"]
[null,"Zin'rokh, Destroyer of Worlds","Epic","NonArmour","Craftable","Craftable","Archaeology","No",359,0,512,341,0,0,216,238,0,0,0,0,0,0,null,null,null,null,null,null,null,null,3.8,623.29999999999995,"Weapon","MyWeapon","Sword"]
[null,"Shalug'doom, the Axe of Unmaking","Epic","NonArmour","The Bastion of Twilight","The Bastion of Twilight","Cho'gall","No",359,0,512,341,0,0,0,228,0,0,228,0,0,0,null,null,null,null,null,null,null,null,3.6,623.29999999999995,"Weapon","MyWeapon","Axe"]
[null,"Reclaimed Ashkandi, Greatsword of the Brotherhood","Epic","NonArmour","Blackwing Descent","Blackwing Descent","Nefarian","No",359,0,512,341,0,0,228,228,0,0,0,0,0,0,null,null,null,null,null,null,null,null,3.8,623.29999999999995,"Weapon","MyWeapon","Sword"]
[null,"Akirus the Worm-Breaker","Epic","NonArmour","Blackwing Descent","Blackwing Descent","Magmaw","No",359,0,512,341,0,0,0,0,0,228,228,0,0,0,null,null,null,null,null,null,null,null,3.6,623.29999999999995,"Weapon","MyWeapon","Mace"]
[null,"Shalug'doom, the Axe of Unmaking (Heroic)","Epic","NonArmour","The Bastion of Twilight","Heroic The Bastion of Twilight","Cho'gall","No",372,0,578,385,0,0,0,257,0,0,257,0,0,0,null,null,null,null,null,null,null,null,3.6,703.6,"Weapon","MyWeapon","Axe"]
[null,"Reclaimed Ashkandi, Greatsword of the Brotherhood (Heroic)","Epic","NonArmour","Blackwing Descent","Heroic Blackwing Descent","Nefarian","No",372,0,578,385,0,0,257,257,0,0,0,0,0,0,null,null,null,null,null,null,null,null,3.8,703.6,"Weapon","MyWeapon","Sword"]
[null,"Akirus the Worm-Breaker (Heroic)","Epic","NonArmour","Blackwing Descent","Heroic Blackwing Descent","Magmaw","No",372,0,578,385,0,0,0,0,0,257,257,0,0,0,null,null,null,null,null,null,null,null,3.6,703.6,"Weapon","MyWeapon","Mace"]
[null,"Skullstealer Greataxe","Epic","NonArmour","Firelands","Firelands","Shannox","Yes",378,0,611,408,0,0,0,0,276,265,0,0,0,0,null,null,null,null,null,null,null,null,3.6,744.1,"Weapon","MyWeapon","Axe"]
[null,"Zoid's Firelit Greatsword","Epic","NonArmour","Firelands","Firelands","Random Boss",{"$f":"IF(AND(VLOOKUP(C437,FilterRareLookup,2,FALSE)=\"Yes\",VLOOKUP(E437,FilterLootLookup,2,FALSE)=\"Yes\",I437>=iLevelFilter),\"Yes\",\"No\")","v":"Yes"},378,0,611,408,0,0,0,284,232,0,0,0,0,0,null,null,"b",null,null,null,"Str",10,3.6,744.1,"Weapon","MyWeapon","Sword"]
[null,"Sulfuras- The Extinguished Hand","Epic","NonArmour","Firelands","Firelands","Ragnaros",{"$f":"IF(AND(VLOOKUP(C438,FilterRareLookup,2,FALSE)=\"Yes\",VLOOKUP(E438,FilterLootLookup,2,FALSE)=\"Yes\",I438>=iLevelFilter),\"Yes\",\"No\")","v":"Yes"},384,0,646,391,0,0,0,294,0,229,0,0,0,0,null,null,"r","r",null,null,"Str",20,3.8,786.8,"Weapon","MyWeapon","Mace"]
[null,"Skullstealer Greataxe (Heroic)","Epic","NonArmour","Firelands","Heroic Firelands","Shannox",{"$f":"IF(AND(VLOOKUP(C439,FilterRareLookup,2,FALSE)=\"Yes\",VLOOKUP(E439,FilterLootLookup,2,FALSE)=\"Yes\",I439>=iLevelFilter),\"Yes\",\"No\")","v":"Yes"},391,0,689,460,0,0,0,0,311,299,0,0,0,0,null,null,null,null,null,null,null,null,3.6,839.9,"Weapon","MyWeapon","Axe"]
[null,"Zoid's Firelit Greatsword (Heroic)","Epic","NonArmour","Firelands","Heroic Firelands","Random Boss",{"$f":"IF(AND(VLOOKUP(C440,FilterRareLookup,2,FALSE)=\"Yes\",VLOOKUP(E440,FilterLootLookup,2,FALSE)=\"Yes\",I440>=iLevelFilter),\"Yes\",\"No\")","v":"Yes"},391,0,689,460,0,0,0,320,264,0,0,0,0,0,null,null,"b",null,null,null,"Str",10,3.6,839.9,"Weapon","MyWeapon","Sword"]
[null,"Sulfuras- The Extinguished Hand (Heroic)","Epic","NonArmour","Firelands","Heroic Firelands","Ragnaros",{"$f":"IF(AND(VLOOKUP(C441,FilterRareLookup,2,FALSE)=\"Yes\",VLOOKUP(E441,FilterLootLookup,2,FALSE)=\"Yes\",I441>=iLevelFilter),\"Yes\",\"No\")","v":"Yes"},397,0,730,446,0,0,0,333,null,262,0,0,0,0,null,null,"r","r",null,null,"Str",20,3.8,888.2,"Weapon","MyWeapon","Mace"]
[]
[null,"-----PVP-----"]
[null,"Ruthless Gladiator Bonegrinder","Epic","NonArmour","PvP","PvP","PvP",{"$f":"IF(AND(VLOOKUP(C444,FilterRareLookup,2,FALSE)=\"Yes\",VLOOKUP(E444,FilterLootLookup,2,FALSE)=\"Yes\",I444>=iLevelFilter),\"Yes\",\"No\")","v":"Yes"},378,0,611,408,0,0,0,272,0,0,0,0,0,0,null,null,null,null,null,null,null,null,3.6,744.1,"Weapon","MyWeapon","Mace"]
[]
[null,"----Craft----"]
[null,"Obsidium Executioner","Rare","NonArmour","Craftable","Craftable","Blacksmithing",{"$f":"IF(AND(VLOOKUP(C447,FilterRareLookup,2,FALSE)=\"Yes\",VLOOKUP(E447,FilterLootLookup,2,FALSE)=\"Yes\",I447>=iLevelFilter),\"Yes\",\"No\")","v":"No"},316,0,343,229,0,0,0,153,0,153,0,0,0,0,null,null,null,null,null,null,null,null,3.5,417.6,"Weapon","MyWeapon","Sword"]
[null,"Forged Elementium Mindcrusher","Rare","NonArmour","Craftable","Craftable","Blacksmithing",{"$f":"IF(AND(VLOOKUP(C448,FilterRareLookup,2,FALSE)=\"Yes\",VLOOKUP(E448,FilterLootLookup,2,FALSE)=\"Yes\",I448>=iLevelFilter),\"Yes\",\"No\")","v":"No"},346,0,454,302,0,0,0,202,0,0,202,0,0,0,null,null,null,null,null,null,null,null,2.6,552.20000000000005,"Weapon","MyWeapon","Mace"]
[null,"Masterwork Elementium Deathblade","Epic","Plate","Craftable","Craftable","Blacksmithing",{"$f":"IF(AND(VLOOKUP(C449,FilterRareLookup,2,FALSE)=\"Yes\",VLOOKUP(E449,FilterLootLookup,2,FALSE)=\"Yes\",I449>=iLevelFilter),\"Yes\",\"No\")","v":"Yes"},365,0,541,361,0,0,0,0,241,241,0,0,0,0,null,null,null,null,null,null,null,null,3.5,659.2,"Weapon","MyWeapon","Sword"]
[]
[null,"----User Added----"]
[]
[]
[]
[null,"-----Librams-----"]
[null,"Conch of the Thundering Waves","Rare","NonArmour","Pre-Raid Dungeons","Throne of the Tides","Mindbender Ghur'sha",{"$f":"IF(AND(VLOOKUP(C456,FilterRareLookup,2,FALSE)=\"Yes\",VLOOKUP(E456,FilterLootLookup,2,FALSE)=\"Yes\",I456>=iLevelFilter),\"Yes\",\"No\")","v":"No"},308,0,100,67,0,0,46,42,0,0,0,0,0,0,null,null,"r",null,null,null,null,null,null,null,"Libram","MyLibram"]
[null,"Etched Horn","Rare","NonArmour","Craftable","Craftable","Inscription","No",316,0,108,72,0,0,0,0,0,48,48,0,0,0,null,null,"r",null,null,null,null,null,null,null,"Libram","MyLibram"]
[null,"Ashes of Youth","Rare","NonArmour","World Drop","World Drop",null,"No",316,0,108,72,0,0,0,0,0,55,36,0,0,0,null,null,"r",null,null,null,null,null,null,null,"Libram","MyLibram"]
[null,"Shore-Cleaning Standard","Rare","NonArmour","Quest","Quest","Landgrab","No",318,0,110,73,0,0,0,0,0,54,40,0,0,0,null,null,"r",null,null,null,null,null,null,null,"Libram","MyLibram"]
[null,"Conch of the Thundering Waves (Heroic)","Rare","NonArmour","Pre-Raid Dungeons","Throne of the Tides (Heroic)","Mindbender Ghur'sha","No",346,0,143,95,0,0,65,60,0,0,0,0,0,0,null,null,"r",null,null,null,null,null,null,null,"Libram","MyLibram"]
[null,"Notched Jawbone","Rare","NonArmour","Craftable","Craftable","Inscription","No",346,0,143,95,0,0,63,0,0,63,0,0,0,0,null,null,"r",null,null,null,null,null,null,null,"Libram","MyLibram"]
[null,"Record of the Brotherhood's End (Heroic)","Rare","NonArmour","Pre-Raid Dungeons","Deadmines (Heroic)","Vanessa VanCleef","No",346,0,143,95,0,0,0,0,63,63,0,0,0,0,null,null,"r",null,null,null,null,null,null,null,"Libram","MyLibram"]
[null,"Relic of Aggramar","Epic","NonArmour","Vendor / Badge","Valorous Quartermaster","700 Valor Points",{"$f":"IF(AND(VLOOKUP(C463,FilterRareLookup,2,FALSE)=\"Yes\",VLOOKUP(E463,FilterLootLookup,2,FALSE)=\"Yes\",I463>=iLevelFilter),\"Yes\",\"No\")","v":"No"},359,0,161,107,0,0,0,72,0,0,72,0,0,0,null,null,"r",null,null,null,null,null,null,null,"Libram","MyLibram"]
[null,"Relic of Lo'gosh","Epic","NonArmour","Vendor / Badge","Vendor","Varlan Highbough - Calling the Ancients","Yes",365,0,170,114,0,0,61,84,0,0,0,0,0,0,null,null,"r",null,null,null,null,null,null,null,"Libram","MyLibram"]
[null,"Relic of the Elemental Lords","Epic","NonArmour","Vendor / Badge","Vendor","700 Valor Points","Yes",378,0,192,128,0,0,0,83,86,0,0,0,0,0,null,null,"r",null,null,null,null,null,null,null,"Libram","MyLibram"]
[null,"Relic of the Elemental Lords (Heroic)","Epic","NonArmour","Vendor / Badge","Heroic Firelands","Crystallized Firestone",{"$f":"IF(AND(VLOOKUP(C466,FilterRareLookup,2,FALSE)=\"Yes\",VLOOKUP(E466,FilterLootLookup,2,FALSE)=\"Yes\",I466>=iLevelFilter),\"Yes\",\"No\")","v":"Yes"},391,0,217,145,0,0,0,94,98,0,0,0,0,0,null,null,"r",null,null,null,null,null,null,null,"Libram","MyLibram"]
[]
[null,"----User Added----"]
[]
[]
[null,"Arcanum of the Wildhammer",null,null,null,null,null,null,null,null,0,60,0,0,0,0,0,35,0,0,0,0,0,0,null,null,null,null,null,null,null,null,null,null,"+60 Strength and +35 Mastery Rating","Arcanum of the Wildhammer"]
[null,"Arcanum of Torment",null,null,null,null,null,null,null,null,0,0,50,0,0,20,0,0,0,0,0,0,null,null,null,null,null,null,null,null,null,null,null,null,"+50 Attack Power and +20 Critical Strike Rating","Arcanum of Torment"]
[null,"Glyph of Ferocity",null,null,null,null,null,null,null,null,0,0,34,0,16,0,0,0,0,0,0,0,0,0,null,null,null,null,null,null,null,null,null,null,"+34 Attack Power and +16 Hit Rating","Glyph of Ferocity"]
[null,"None",null,null,null,null,null,null,null,null,0,0,0,0,0,0,0,0,0,0,0,0,0,0,null,null,null,null,null,null,null,null,null,null,"None","None"]
[null,"Lionsmane Inscription",null,null,null,null,null,null,null,null,0,130,0,0,0,25,0,0,0,0,0,0,null,null,null,null,null,null,null,null,null,null,null,null,"+130 Strength and +25 Crit Rating","Lionsmane Inscription"]
[null,"Greater Inscription of Jagged Stone",null,null,null,null,null,null,null,null,0,50,0,0,0,25,0,0,0,0,0,0,null,null,null,null,null,null,null,null,null,null,null,null,"+50 Strength and +25 Crit Rating","Greater Inscription of Jagged Stone"]
[null,"Lesser Inscription of Jagged Stone",null,null,null,null,null,null,null,null,0,30,0,0,0,20,0,0,0,0,0,0,null,null,null,null,null,null,null,null,null,null,null,null,"+30 Strength and +20 Critical Strike Rating","Lesser Inscription of Jagged Stone"]
[null,"Master's Inscrip-Axe (Inscribing Only)",null,null,null,null,null,null,null,null,0,0,{"$f":"IF(OR(Profession1=\"Inscription\",Profession2=\"Inscription\"),120,0)","v":0},0,0,{"$f":"IF(OR(Profession1=\"Inscription\",Profession2=\"Inscription\"),15,0)","v":0},0,0,0,0,0,0,0,0,null,null,null,null,null,null,null,null,null,null,"+120 Attack Power and +15 Critical Strike Rating","Master's Inscrip-Axe (Inscribing Only)"]
[null,"Greater Inscription of the Axe",null,null,null,null,null,null,null,null,0,0,40,0,0,15,0,0,0,0,0,0,0,0,null,null,null,null,null,null,null,null,null,null,"+40 Attack Power and +15 Crit Rating","Greater Inscription of the Axe"]
[null,"Lesser Inscription of the Axe",null,null,null,null,null,null,null,null,0,0,30,0,0,10,0,0,0,0,0,0,0,0,null,null,null,null,null,null,null,null,null,null,"+30 Attack Power and +10 Crit Rating","Lesser Inscription of the Axe"]
[null,"None",null,null,null,null,null,null,null,null,0,0,0,0,0,0,0,0,0,0,0,0,0,0,null,null,null,null,null,null,null,null,null,null,"None","None"]
[null,"Peerless Stats",null,null,null,null,null,null,null,null,20,20,0,20,0,0,0,0,0,20,0,0,null,null,null,null,null,null,null,null,null,null,null,null,"+20 All Stats","Peerless Stats"]
[null,"Mighty Stats",null,null,null,null,null,null,null,null,15,15,0,15,0,0,0,0,0,15,0,0,null,null,null,null,null,null,null,null,null,null,null,null,"+15 All Stats","Mighty Stats"]
[null,"Powerful Stats",null,null,null,null,null,null,null,null,10,10,0,10,0,0,0,0,0,10,0,0,0,0,null,null,null,null,null,null,null,null,null,null,"+10 All Stats","Powerful Stats"]
[null,"Super Stats",null,null,null,null,null,null,null,null,8,8,0,8,0,0,0,0,0,8,0,0,0,0,null,null,null,null,null,null,null,null,null,null,"+8 All Stats","Super Stats"]
[null,"None",null,null,null,null,null,null,null,null,0,0,0,0,0,0,0,0,0,0,0,0,0,0,null,null,null,null,null,null,null,null,null,null,"None","None"]
[null,"Dragonscale Leg Armor",null,null,null,null,null,null,null,null,0,0,190,0,0,55,0,0,0,0,0,0,null,null,null,null,null,null,null,null,null,null,null,null,"+190 Attack Power and +55 Critical Strike Rating","Dragonscale Leg Armor"]
[null,"Scorched Leg Armor",null,null,null,null,null,null,null,null,0,0,110,0,0,45,0,0,0,0,0,0,null,null,null,null,null,null,null,null,null,null,null,null,"+110 Attack Power and +45 Critical Strike Rating","Scorched Leg Armor"]
[null,"Icescale Leg Armor/Nerubian Leg Reinf.",null,null,null,null,null,null,null,null,0,0,75,0,0,22,0,0,0,0,0,0,0,0,null,null,null,null,null,null,null,null,null,null,"+75 Attack Power and +22 Critical Strike Rating","Icescale Leg Armor/Nerubian Leg Reinf."]
[null,"Nerubian Leg Armor",null,null,null,null,null,null,null,null,0,0,55,0,0,15,0,0,0,0,0,0,0,0,null,null,null,null,null,null,null,null,null,null,"+55 Attack Power and +15 Critical Strike Rating","Nerubian Leg Armor"]
[null,"None",null,null,null,null,null,null,null,null,0,0,0,0,0,0,0,0,0,0,0,0,0,0,null,null,null,null,null,null,null,null,null,null,"None","None"]
[null,"Mastery",null,null,null,null,null,null,null,null,0,0,0,0,0,0,0,50,0,0,0,0,null,null,null,null,null,null,null,null,null,null,null,null,"+50 Mastery Rating","Mastery"]
[null,"Precision (Boots)",null,null,null,null,null,null,null,null,0,0,0,0,50,0,0,0,0,0,0,0,null,null,null,null,null,null,null,null,null,null,null,null,"+50 Hit Rating","Precision (Boots)"]
[null,"Haste",null,null,null,null,null,null,null,null,0,0,0,0,0,0,50,0,0,0,0,0,null,null,null,null,null,null,null,null,null,null,null,null,"+50 Haste Rating","Haste"]
[null,"Icewalker",null,null,null,null,null,null,null,null,0,0,0,0,12,12,0,0,0,0,0,0,0,0,null,null,null,null,null,null,null,null,null,null,"+12 Hit Rating and +12 Critical Strike Rating","Icewalker"]
[null,"Greater Assault (Boots)",null,null,null,null,null,null,null,null,0,0,32,0,0,0,0,0,0,0,0,0,0,0,null,null,null,null,null,null,null,null,null,null,"+32 Attack Power","Greater Assault (Boots)"]
[null,"None",null,null,null,null,null,null,null,null,0,0,0,0,0,0,0,0,0,0,0,0,0,0,null,null,null,null,null,null,null,null,null,null,"None","None"]
[null,"Greater Mastery",null,null,null,null,null,null,null,null,0,0,0,0,0,0,0,65,0,0,0,0,null,null,null,null,null,null,null,null,null,null,null,null,"+65 Mastery Rating","Greater Mastery"]
[null,"Mighty Strength",null,null,null,null,null,null,null,null,0,50,0,0,0,0,0,0,0,0,0,0,null,null,null,null,null,null,null,null,null,null,null,null,"+50 Strength","Mighty Strength"]
[null,"Greater Expertise",null,null,null,null,null,null,null,null,0,0,0,0,0,0,0,0,50,0,0,0,null,null,null,null,null,null,null,null,null,null,null,null,"+50 Expertise Rating","Greater Expertise"]
[null,"Exceptional Strength",null,null,null,null,null,null,null,null,0,35,0,0,0,0,0,0,0,0,0,0,null,null,null,null,null,null,null,null,null,null,null,null,"+35 Strength","Exceptional Strength"]
[null,"Haste (Gloves)",null,null,null,null,null,null,null,null,0,0,0,0,0,0,50,0,0,0,0,0,null,null,null,null,null,null,null,null,null,null,null,null,"+50 Haste Rating","Haste (Gloves)"]
[null,"Crusher",null,null,null,null,null,null,null,null,0,0,44,0,0,0,0,0,0,0,0,0,0,0,null,null,null,null,null,null,null,null,null,null,"+44 Attack Power","Crusher"]
[null,"Greater Assault (Gloves)",null,null,null,null,null,null,null,null,0,0,35,0,0,0,0,0,0,0,0,0,0,0,null,null,null,null,null,null,null,null,null,null,"+35 Attack Power","Greater Assault (Gloves)"]
[null,"Precision",null,null,null,null,null,null,null,null,0,0,0,0,20,0,0,0,0,0,0,0,0,0,null,null,null,null,null,null,null,null,null,null,"+20 Hit Rating","Precision"]
[null,"None",null,null,null,null,null,null,null,null,0,0,0,0,0,0,0,0,0,0,0,0,0,0,null,null,null,null,null,null,null,null,null,null,"None","None"]
[null,"Draconic Embossment - Strength",null,null,null,null,null,null,null,null,0,130,0,0,0,0,0,0,0,0,0,0,null,null,null,null,null,null,null,null,null,null,null,null,"+130 Strength","Draconic Embossment - Strength"]
[null,"Major Strength",null,null,null,null,null,null,null,null,0,50,0,0,0,0,0,0,0,0,0,0,null,null,null,null,null,null,null,null,null,null,null,null,"+50 Strength","Major Strenght"]
[null,"Greater Critical Strike",null,null,null,null,null,null,null,null,0,0,0,0,0,65,0,0,0,0,0,0,null,null,null,null,null,null,null,null,null,null,null,null,"+65 Critical Strike Rating","Greater Critical Strike"]
[null,"Greater Speed",null,null,null,null,null,null,null,null,0,0,0,0,0,0,65,0,0,0,0,0,null,null,null,null,null,null,null,null,null,null,null,null,"+65 Haste Rating","Greater Speed"]
[null,"Greater Expertise (Bracer)",null,null,null,null,null,null,null,null,0,0,0,0,0,0,0,0,50,0,0,0,null,null,null,null,null,null,null,null,null,null,null,null,"+50 Expertise Rating","Greater Expertise (Bracer)"]
[null,"Precision (Bracer)",null,null,null,null,null,null,null,null,0,0,0,0,50,0,0,0,0,0,0,0,null,null,null,null,null,null,null,null,null,null,null,null,"+50 Hit Rating","Precision"]
[null,"Critical Strike",null,null,null,null,null,null,null,null,0,0,0,0,0,50,0,0,0,0,0,0,null,null,null,null,null,null,null,null,null,null,null,null,"+50 Critical Strike Rating","Critical Strike"]
[null,"Greater Assault (Bracer)",null,null,null,null,null,null,null,null,0,0,50,0,0,0,0,0,0,0,0,0,0,0,null,null,null,null,null,null,null,null,null,null,"+50 Attack Power","Greater Assault (Bracer)"]
[null,"Striking",null,null,null,null,null,null,null,null,0,0,38,0,0,0,0,0,0,0,0,0,0,0,null,null,null,null,null,null,null,null,null,null,"+38 Attack Power","Striking"]
[null,"Expertise",null,null,null,null,null,null,null,null,0,0,0,0,0,0,0,0,15,0,0,0,0,0,null,null,null,null,null,null,null,null,null,null,"+15 Expertise Rating","Expertise"]
[null,"Greater Stats",null,null,null,null,null,null,null,null,6,6,0,0,0,0,0,0,6,0,0,0,0,0,null,null,null,null,null,null,null,null,null,null,"+6 All Stats","Greater Stats"]
[null,"Stats",null,null,null,null,null,null,null,null,4,4,0,4,0,0,0,0,0,4,0,0,0,0,null,null,null,null,null,null,null,null,null,null,"+4 All Stats","Stats"]
[null,"Fur Lining - AP (Leatherworkers Only)",null,null,null,null,null,null,null,null,0,0,{"$f":"IF(OR(Profession1=\"Leatherworking\",Profession2=\"Leatherworking\"),130,0)","v":0},0,0,0,0,0,0,0,0,0,0,0,null,null,null,null,null,null,null,null,null,null,"+130 Attack Power","Fur Lining - AP (Leatherworkers Only)"]
[null,"None",null,null,null,null,null,null,null,null,0,0,0,0,0,0,0,0,0,0,0,0,0,0,null,null,null,null,null,null,null,null,null,null,"None","None"]
[null,"Greater Critical Strike",null,null,null,null,null,null,null,null,0,0,0,0,0,65,0,0,0,0,0,0,null,null,null,null,null,null,null,null,null,null,null,null,"+65 Critical Strike Rating","Greater Critical Strike"]
[null,"Critical Strike",null,null,null,null,null,null,null,null,0,0,0,0,0,50,0,0,0,0,0,0,null,null,null,null,null,null,null,null,null,null,null,null,"+50 Critical Strike Rating","Critical Strike"]
[null,"Swordguard Embroidery (Tailor Only)",null,null,null,null,null,null,null,null,0,0,{"$f":"IF(OR(Profession1=\"Tailoring\",Profession2=\"Tailoring\"),IF(Estimations=\"Off\",0,(1000*(15*((Length/60) - (TrinketReset / 3))/Length))),0)","v":0},0,0,0,0,0,0,0,0,0,0,0]
[null,"Greater Speed",null,null,null,null,null,null,null,null,0,0,0,0,0,0,23,0,0,0,0,0,0,0,null,null,null,null,null,null,null,null,null,null,"+23 Haste Rating","Greater Speed"]
[null,"Speed",null,null,null,null,null,null,null,null,0,0,0,0,0,0,15,0,0,0,0,0,0,0,null,null,null,null,null,null,null,null,null,null,"+15 Haste Rating","Speed"]
[null,"None",null,null,null,null,null,null,null,null,0,0,0,0,0,0,0,0,0,0,0,0,0,0,null,null,null,null,null,null,null,null,null,null,"None","None"]
[null,"Strength (Enchanting Only)",null,null,null,null,null,null,null,null,0,40,0,0,0,0,0,0,0,0,0,0,null,null,null,null,null,null,null,null,null,null,null,null,"+40 Strength","Strength (Enchanting Only)"]
[null,"Assault (Enchanting Only)",null,null,null,null,null,null,null,null,0,0,{"$f":"IF(OR(Profession1=\"Enchanting\",Profession2=\"Enchanting\"),40,0)","v":0},0,0,0,0,0,0,0,0,0,0,0,null,null,null,null,null,null,null,null,null,null,"+40 Attack Power","Assault (Enchanting Only)"]
[null,"Stats (Enchanting Only)",null,null,null,null,null,null,null,null,{"$f":"IF(OR(Profession1=\"Enchanting\",Profession2=\"Enchanting\"),4,0)","v":0},{"$f":"IF(OR(Profession1=\"Enchanting\",Profession2=\"Enchanting\"),4,0)","v":0},0,{"$f":"IF(OR(Profession1=\"Enchanting\",Profession2=\"Enchanting\"),4,0)","v":0},0,0,0,0,0,{"$f":"IF(OR(Profession1=\"Enchanting\",Profession2=\"Enchanting\"),4,0)","v":0},0,0,0,0,null,null,null,null,null,null,null,null,null,null,"+4 All Stats","Stats (Enchanting Only)"]
[null,"None",null,null,null,null,null,null,null,null,0,0,0,0,0,0,0,0,0,0,0,0,0,0,null,null,null,null,null,null,null,null,null,null,"None","None"]
[null,"Avalanche",null,null,null,null,null,null,null,null,0,0,0,0,0,0,0,0,0,0,0,0,null,null,null,null,null,null,"DPS",{"$f":"(((Weaponspeed / 60) * 5 * (SUM('DPS Calc'!G7:H9,'DPS Calc'!G23:H24,'DPS Calc'!G52:H53,'DPS Calc'!K49:L50,'DPS Calc'!O60:P61))/Length) + ((0.2 / 10) * (SUM('DPS Calc'!O60:P61,'DPS Calc'!O36:P37,'DPS Calc'!K37:L38)/Length))) * (AVERAGE(463,537) * (1 - SpellCritChance)) + ((AVERAGE(463,537) * 1.5) * SpellCritChance)","v":214.10266749325302},null,null,null,null,"Avalanche","Avalanche"]
[null,"Hurricane",null,null,null,null,null,null,null,null,0,0,0,0,0,0,{"$f":"IF(Estimations=\"Off\",0,(450 * ((1 - (1 - Weaponspeed / 60) ^ (12 * (SUM('DPS Calc'!G7:H9,'DPS Calc'!G23:H24,'DPS Calc'!G52:H53,'DPS Calc'!K49:L50)) / Length)))) + (450*(12*((Length/50))/Length)))","v":320.28021411374453},0,0,0,0,0,null,null,null,null,null,null,null,null,null,null,null,null,"Hurricane","Hurricane"]
[null,"Landslide",null,null,null,null,null,null,null,null,0,0,{"$f":"IF(Estimations=\"Off\",0,1000 * (1 - (1 - Weaponspeed / 60) ^ (12 * (SUM('DPS Calc'!G7:H9,'DPS Calc'!G23:H24,'DPS Calc'!G52:H53,'DPS Calc'!K49:L50)) / Length)))","v":471.73380914165455},0,0,0,0,0,0,0,0,0,null,null,null,null,null,null,null,null,null,null,null,null,"Landslide","Landslide"]
[null,"Berserking",null,null,null,null,null,null,null,null,0,0,{"$f":"IF(Estimations=\"Off\",0,400 * (1 - (1 - Weaponspeed / 60) ^ (15 * (SUM('DPS Calc'!G7:H9,'DPS Calc'!G23:H24,'DPS Calc'!G52:H53,'DPS Calc'!K49:L50)) / Length)))","v":219.85342395070268},0,0,0,0,0,0,0,0,0,0,0,null,null,null,null,null,null,null,null,null,null,"Berserking","Berserking"]
[null,"Accuracy",null,null,null,null,null,null,null,null,0,0,0,0,25,25,0,0,0,0,0,0,0,0,null,null,null,null,null,null,null,null,null,null,"+25 Hit Rating and +25 Critical Strike Rating","Accuracy"]
[null,"Massacre",null,null,null,null,null,null,null,null,0,0,110,0,0,0,0,0,0,0,0,0,0,0,null,null,null,null,null,null,null,null,null,null,"+110 Attack Power","Massacre"]
[null,"None",null,null,null,null,null,null,null,null,0,0,0,0,0,0,0,0,0,0,0,0,0,0,null,null,null,null,null,null,null,null,null,null,"None","None"]
[null,null,null,null,null,null,null,null,null,null,null,null,null,null,null,null,null,null,null,null,null,null,0,0]
[]
[null,"-----Engineering/Tailoring Perks-----"]
[]
[null,"None",null,null,null,null,null,null,null,null,0,0,0,0,0,0,0,0,0,0,0,0,0,0]
[null,"Synapse Springs (Engineers Only)",null,null,null,null,null,null,null,null,0,{"$f":"IF(OR(Profession1=\"Engineering\",Profession2=\"Engineering\"),IF(Estimations=\"Off\",0,((10*((Length/60) - (TrinketReset / 2))/Length)*480)),0)","v":0},0,0,0,0,0,0,0,0,0,0]
[null,"Hand-Mounted Pyro-Rocket (Engineers Only)",null,null,null,null,null,null,null,null,0,0,0,0,0,0,0,0,0,0,0,0,0,0,null,null,null,null,{"$f":"IF(OR(Profession1=\"Engineering\",Profession2=\"Engineering\"),\"DPS\",\"\")","v":""},{"$f":"IF(OR(Profession1=\"Engineering\",Profession2=\"Engineering\"),IF(Estimations=\"Off\",0,(((CritTotal% * (1.5 * AVERAGE(1049,1282))) + ((1-CritTotal%) * AVERAGE(1049,1282))) * (1 + ICCBuff) *(Length/45)/Length)),0)","v":0}]
[null,"HyperSpeed Accel. (Engineers Only)",null,null,null,null,null,null,null,null,0,0,0,0,0,0,{"$f":"IF(OR(Profession1=\"Engineering\",Profession2=\"Engineering\"),(240*12/60),0)","v":0},0,0,0,0,0,0,0]
[null,"----User Added----"]
[]
[]
[null,"None",null,null,null,null,null,null,null,null,null,null,null,null,null,null,null,null,null,null,null,null,null,null,null,null,null,null,null,null,null,null,null,null,"None","None"]
[]
[null,"-----Red Gems-----"]
[null,"Precise Carnelian (30 WE)",null,null,null,null,null,null,null,null,0,0,0,0,0,0,0,0,30,0,0,0,0,0,"r",null,null,null,null,null,null,null,null,null,"Precise Carnelian","Precise Carnelian (30 WE)"]
[null,"Bold Carnelian (30 Str)",null,null,null,null,null,null,null,null,0,30,0,0,0,0,0,0,0,0,0,0,0,0,"r",null,null,null,null,null,null,null,null,null,"Bold Carnelian","Bold Carnelian (30 Str)"]
[null,"Perfect Precise Carnelian (35 WE)",null,null,null,null,null,null,null,null,0,0,0,0,0,0,0,0,35,0,0,0,0,0,"r",null,null,null,null,null,null,null,null,null,"Perfect Precise Carnelian","Perfect Precise Carnelian (35 WE)"]
[null,"Perfect Bold Carnelian (35 Str)",null,null,null,null,null,null,null,null,0,35,0,0,0,0,0,0,0,0,0,0,0,0,"r",null,null,null,null,null,null,null,null,null,"Perfect Bold Carnelian","Perfect Bold Carnelian (35 Str)"]
[null,"Precise Inferno Ruby (40 WE)","Rare",null,null,null,null,null,null,null,0,0,0,0,0,0,0,0,40,0,0,0,0,0,"r",null,null,null,null,null,null,null,null,null,"Precise Inferno Ruby","Precise Inferno Ruby (40 WE)"]
[null,"Bold Inferno Ruby (40 Str)","Rare",null,null,null,null,null,null,null,0,40,0,0,0,0,0,0,0,0,0,0,0,0,"r",null,null,null,null,null,null,null,null,null,"Bold Inferno Ruby","Bold Inferno Ruby (40 Str)"]
[]
[null,"-----Green Gems-----"]
[null,"Lightning Jasper (15 Haste/15 Hit)",null,null,null,null,null,null,null,null,0,0,0,0,15,0,15,0,0,0,0,0,0,0,"y","b",null,null,null,null,null,null,null,null,"Lightning Jasper","Lightning Jasper (15 Haste/15 Hit)"]
[null,"Piercing Jasper (15 Crit/15 Hit)",null,null,null,null,null,null,null,null,0,0,0,0,15,15,0,0,0,0,0,0,0,0,"y","b",null,null,null,null,null,null,null,null,"Piercing Jasper","Piercing Jasper (15 Crit/15 Hit)"]
[null,"Sensei's Jasper (15 Mastery/15 Hit)",null,null,null,null,null,null,null,null,0,0,0,0,15,0,0,15,0,0,0,0,0,0,"y","b",null,null,null,null,null,null,null,null,"Sensei's Jasper","Sensei's Jasper (15 Mastery/15 Hit)"]
[null,"Perfect Lightning Jasper (18 Haste/17 Hit)",null,null,null,null,null,null,null,null,0,0,0,0,17,0,18,0,0,0,0,0,0,0,"y","b",null,null,null,null,null,null,null,null,"Perfect Lightning Jasper","Perfect Lightning Jasper (18 Haste/17 Hit)"]
[null,"Perfect Piercing Jasper (18 Crit/17 Hit)",null,null,null,null,null,null,null,null,0,0,0,0,17,18,0,0,0,0,0,0,0,0,"y","b",null,null,null,null,null,null,null,null,"Perfect Piercing Jasper","Perfect Piercing Jasper (18 Crit/17 Hit)"]
[null,"Perfect Sensei's Jasper (18 Mastery/17 Hit)",null,null,null,null,null,null,null,null,0,0,0,0,17,0,0,18,0,0,0,0,0,0,"y","b",null,null,null,null,null,null,null,null,"Perfect Sensei's Jasper","Perfect Sensei's Jasper (18 Mastery/17 Hit)"]
[null,"Lightning Dream Emerald (20 Haste/20 Hit)","Rare",null,null,null,null,null,null,null,0,0,0,0,20,0,20,0,0,0,0,0,0,0,"y","b",null,null,null,null,null,null,null,null,"Lightning Dream Emerald","Lightning Dream Emerald (20 Haste/20 Hit)"]
[null,"Piercing Dream Emerald (20 Crit/20 Hit)","Rare",null,null,null,null,null,null,null,0,0,0,0,20,20,0,0,0,0,0,0,0,0,"y","b",null,null,null,null,null,null,null,null,"Piercing Dream Emerald","Piercing Dream Emerald (20 Crit/20 Hit)"]
[null,"Sensei's Dream Emerald (20 Mastery/20 Hit)","Rare",null,null,null,null,null,null,null,0,0,0,0,20,0,0,20,0,0,0,0,0,0,"y","b",null,null,null,null,null,null,null,null,"Sensei's Dream Emerald","Sensei's Dream Emerald (20 Mastery/20 Hit)"]
[]
[null,"-----Orange Gems-----"]
[null,"Fierce Hessonite (15 Str/15 Haste)",null,null,null,null,null,null,null,null,0,15,0,0,0,0,15,0,0,0,0,0,0,0,"r","y",null,null,null,null,null,null,null,null,"Fierce Hessonite","Fierce Hessonite (15 Str/15 Haste)"]
[null,"Inscribed Hessonite (15 Str/15 Crit)",null,null,null,null,null,null,null,null,0,15,0,0,0,15,0,0,0,0,0,0,0,0,"r","y",null,null,null,null,null,null,null,null,"Inscribed Hessonite","Inscribed Hessonite (15 Str/15 Crit)"]
[null,"Keen Hessonite (15 WE/15 Mastery)",null,null,null,null,null,null,null,null,0,0,0,0,0,0,0,15,15,0,0,0,0,0,"r","y",null,null,null,null,null,null,null,null,"Keen Hessonite","Keen Hessonite (15 WE/15 Mastery)"]
[null,"Skillful Hessonite (15 Str/15 Mastery)",null,null,null,null,null,null,null,null,0,15,0,0,0,0,0,15,0,0,0,0,0,0,"r","y",null,null,null,null,null,null,null,null,"Skillful Hessonite","Skillful Hessonite (15 Str/15 Mastery)"]
[null,"Perfect Fierce Hessonite (18 Str/17 Haste)",null,null,null,null,null,null,null,null,0,18,0,0,0,0,17,0,0,0,0,0,0,0,"r","y",null,null,null,null,null,null,null,null,"Perfect Fierce Hessonite","Perfect Fierce Hessonite (18 Str/17 Haste)"]
[null,"Perfect Inscribed Hessonite (18 Str/17 Crit)",null,null,null,null,null,null,null,null,0,18,0,0,0,17,0,0,0,0,0,0,0,0,"r","y",null,null,null,null,null,null,null,null,"Perfect Inscribed Hessonite","Perfect Inscribed Hessonite (18 Str/17 Crit)"]
[null,"Perfect Keen Hessonite (18 WE/17 Mastery)",null,null,null,null,null,null,null,null,0,0,0,0,0,0,0,17,18,0,0,0,0,0,"r","y",null,null,null,null,null,null,null,null,"Perfect Keen Hessonite","Perfect Keen Hessonite (18 WE/17 Mastery)"]
[null,"Perfect Skillful Hessonite (18 Str/17 Mastery)",null,null,null,null,null,null,null,null,0,18,0,0,0,0,0,17,0,0,0,0,0,0,"r","y",null,null,null,null,null,null,null,null,"Perfect Skillful Hessonite","Perfect Skillful Hessonite (18 Str/17 Mastery)"]
[null,"Fierce Ember Topaz (20 Str/20 Haste)","Rare",null,null,null,null,null,null,null,0,20,0,0,0,0,20,0,0,0,0,0,0,0,"r","y",null,null,null,null,null,null,null,null,"Perfect Fierce Ember Topaz","Perfect Fierce Ember Topaz (20 Str/20 Haste)"]
[null,"Inscribed Ember Topaz (20 Str/20 Crit)","Rare",null,null,null,null,null,null,null,0,20,0,0,0,20,0,0,0,0,0,0,0,0,"r","y",null,null,null,null,null,null,null,null,"Perfect Inscribed Ember Topaz","Perfect Inscribed Ember Topaz (20 Str/20 Crit)"]
[null,"Keen Ember Topaz (20 WE/20 Mastery)","Rare",null,null,null,null,null,null,null,0,0,0,0,0,0,0,20,20,0,0,0,0,0,"r","y",null,null,null,null,null,null,null,null,"Perfect Keen Ember Topaz","Perfect Keen Ember Topaz (20 WE/20 Mastery)"]
[null,"Skillful Ember Topaz (20 Str/20 Mastery)","Rare",null,null,null,null,null,null,null,0,20,0,0,0,0,0,20,0,0,0,0,0,0,"r","y",null,null,null,null,null,null,null,null,"Perfect Skillful Ember Topaz","Perfect Skillful Ember Topaz (20 Str/20 Mastery)"]
[]
[null,"-----Purple Gems-----"]
[null,"Accurate Nightstone (15 WE/15 Hit)",null,null,null,null,null,null,null,null,0,0,0,0,15,0,0,0,15,0,0,0,0,0,"r","b",null,null,null,null,null,null,null,null,"Accurate Nightstone","Accurate Nightstone (15 WE/15 Hit)"]
[null,"Etched Nightstone (15 Str/15 Hit)",null,null,null,null,null,null,null,null,0,15,0,0,15,0,0,0,0,0,0,0,0,0,"r","b",null,null,null,null,null,null,null,null,"Etched Nightstone","Etched Nightstone (15 Str/15 Hit)"]
[null,"Soverign Nightstone (15 Str/15 Sta)",null,null,null,null,null,null,null,null,15,15,0,0,0,0,0,0,0,0,0,0,0,0,"r","b",null,null,null,null,null,null,null,null,"Soverign Nightstone","Soverign Nightstone (15 Str/15 Sta)"]
[null,"Perfect Accurate Nightstone (18 WE/17 Hit)",null,null,null,null,null,null,null,null,0,0,0,0,17,0,0,0,18,0,0,0,0,0,"r","b",null,null,null,null,null,null,null,null,"Perfect Accurate Nightstone","Perfect Accurate Nightstone (18 WE/17 Hit)"]
[null,"Perfect Etched Nightstone (18 Str/18 Hit)",null,null,null,null,null,null,null,null,0,18,0,0,17,0,0,0,0,0,0,0,0,0,"r","b",null,null,null,null,null,null,null,null,"Perfect Etched Nightstone","Perfect Etched Nightstone (18 Str/18 Hit)"]
[null,"Perfect Soverign Nightstone (18 Str/18 Sta)",null,null,null,null,null,null,null,null,17,18,0,0,0,0,0,0,0,0,0,0,0,0,"r","b",null,null,null,null,null,null,null,null,"Perfect Soverign Nightstone","Perfect Soverign Nightstone (18 Str/18 Sta)"]
[null,"Accurate Demonseye (20 WE/20 Hit)","Rare",null,null,null,null,null,null,null,0,0,0,0,20,0,0,0,20,0,0,0,0,0,"r","b",null,null,null,null,null,null,null,null,"Accurate Demonseye","Accurate Demonseye (20 WE/20 Hit)"]
[null,"Etched Demonseye (20 Str/20 Hit)","Rare",null,null,null,null,null,null,null,0,20,0,0,20,0,0,0,0,0,0,0,0,0,"r","b",null,null,null,null,null,null,null,null,"Etched Demonseye","Etched Demonseye (20 Str/20 Hit)"]
[null,"Soverign Demonseye (20 Str/20 Sta)","Rare",null,null,null,null,null,null,null,20,20,0,0,0,0,0,0,0,0,0,0,0,0,"r","b",null,null,null,null,null,null,null,null,"Soverign Demonseye","Soverign Demonseye (20 Str/20 Sta)"]
[]
[null,"-----Blue Gems-----"]
[null,"Rigid Zephyrite (30 Hit)",null,null,null,null,null,null,null,null,0,0,0,0,30,0,0,0,0,0,0,0,null,null,"b",null,null,null,null,null,null,null,null,null,"Rigid Zephyrite","Rigid Zephyrite (30 Hit)"]
[null,"Solid Zephyrite (30 Sta)",null,null,null,null,null,null,null,null,30,0,0,0,0,0,0,0,0,0,0,0,null,null,"b",null,null,null,null,null,null,null,null,null,"Solid Zephyrite","Solid Zephyrite (30 Sta)"]
[null,"Perfect Rigid Zephyrite (35 Hit)",null,null,null,null,null,null,null,null,0,0,0,0,35,0,0,0,0,0,0,0,null,null,"b",null,null,null,null,null,null,null,null,null,"Perfect Rigid Zephyrite","Perfect Rigid Zephyrite (35 Hit)"]
[null,"Perfect Solid Zephyrite (35 Sta)",null,null,null,null,null,null,null,null,35,0,0,0,0,0,0,0,0,0,0,0,null,null,"b",null,null,null,null,null,null,null,null,null,"Perfect Solid Zephyrite","Perfect Solid Zephyrite (35 Sta)"]
[null,"Rigid Ocean Sapphire (40 Hit)","Rare",null,null,null,null,null,null,null,0,0,0,0,40,0,0,0,0,0,0,0,null,null,"b",null,null,null,null,null,null,null,null,null,"Rigid Ocean Sapphire","Rigid Ocean Sapphire (40 Hit)"]
[null,"Solid Ocean Sapphire (40 Sta)","Rare",null,null,null,null,null,null,null,40,0,0,0,0,0,0,0,0,0,0,0,null,null,"b",null,null,null,null,null,null,null,null,null,"Solid Ocean Sapphire","Solid Ocean Sapphire (40 Sta)"]
[]
[null,"-----Prismatic-----"]
[]
[null,"-----JC Only Gems-----"]
[null,"Bold Chimera's Eye (67 Str)","Epic",null,null,null,null,null,null,null,0,67,0,0,0,0,0,0,0,0,0,0,null,null,"r",null,null,null,null,null,null,null,null,null,"Bold Chimera's Eye","Bold Chimera's Eye (67 Str)"]
[]
[null,"-----Cogs - Engineering Only-----"]
[null,"Fractured Cogwheel (208 Mastery)","Rare",null,null,null,null,null,null,null,0,0,0,0,0,0,0,208,0,0,0,0,null,null,"c",null,null,null,null,null,null,null,null,null,"Fractured Cogwheel","Fractured Cogwheel (208 Mastery)"]
[null,"Precise Cogwheel (208 WE)","Rare",null,null,null,null,null,null,null,0,0,0,0,0,0,0,0,208,0,0,0,null,null,"c",null,null,null,null,null,null,null,null,null,"Precise Cogwheel","Precise Cogwheel (208 WE)"]
[null,"Quick Cogwheel (208 Haste)","Rare",null,null,null,null,null,null,null,0,0,0,0,0,0,208,0,0,0,0,0,null,null,"c",null,null,null,null,null,null,null,null,null,"Quick Cogwheel","Quick Cogwheel (208 Haste)"]
[null,"Rigid Cogwheel (208 Hit)","Rare",null,null,null,null,null,null,null,0,0,0,0,208,0,0,0,0,0,0,0,null,null,"c",null,null,null,null,null,null,null,null,null,"Rigid Cogwheel","Rigid Cogwheel (208 Hit)"]
[null,"Smooth Cogwheel (208 Crit)","Rare",null,null,null,null,null,null,null,0,0,0,0,0,208,0,0,0,0,0,0,null,null,"c",null,null,null,null,null,null,null,null,null,"Smooth Cogwheel","Smooth Cogwheel (208 Crit)"]
[]
[]
[null,"-----Meta Gems-----"]
[]
[null,"None",null,null,null,null,null,null,null,null,0,0,0,0,0,0,0,0,0,0,0,0,0,0]
[null,"54 Str & 3% Increased Crit Dmg",null,null,null,null,null,null,null,null,0,54,0,0,0,0,0,0,0,0,0,0,null,null,"m",null,null,null,null,"Crit",null,null,null,null,"Reverberating Shadowspirit Diamond","54 Str & 3% Increased Crit Dmg"]
[null,"54 Crit & 3% Increased Crit Dmg",null,null,null,null,null,null,null,null,0,0,0,0,0,21,0,0,0,0,0,0,0,0,"m",null,null,null,null,"Crit",null,null,null,null,"Chaotic Skyflare Diamond","21 crit & 3% Increased Crit Dmg"]
[null,"Chance to Increase Melee Speed",null,null,null,null,null,null,null,null,0,0,0,0,0,0,{"$f":"480 * 6 / 120","v":24},0,0,0,0,0,0,0,"m",null,null,null,null,null,null,null,null,null,"Thundering Skyflare Diamond","Chance to Increase Melee Speed"]
[null,"54 Crit & 1% Spell Reflect",null,null,null,null,null,null,null,null,0,0,0,0,0,54,0,0,0,0,0,0,null,null,"m",null,null,null,null,null,null,null,null,null,"Destructive Shadowspirit Diamond","54 crit & 1% Spell Reflect"]
[]
[]
[null,"None"]
[null,"Reforge: Hit to Crit"]
[null,"Reforge: Hit to Haste"]
[null,"Reforge: Hit to Mastery"]
[null,"Reforge: Hit to Expertise"]
[null,"Reforge: Crit to Hit"]
[null,"Reforge: Crit to Haste"]
[null,"Reforge: Crit to Mastery"]
[null,"Reforge: Crit to Expertise"]
[null,"Reforge: Haste to Hit"]
[null,"Reforge: Haste to Crit"]
[null,"Reforge: Haste to Mastery"]
[null,"Reforge: Haste to Expertise"]
[null,"Reforge: Mastery to Hit"]
[null,"Reforge: Mastery to Crit"]
[null,"Reforge: Mastery to Haste"]
[null,"Reforge: Mastery to Expertise"]
[null,"Reforge: Expertise to Hit"]
[null,"Reforge: Expertise to Crit"]
[null,"Reforge: Expertise to Haste"]
[null,"Reforge: Expertise to Mastery"]
[]
[null,"Immolation Helmet",{"$f":"IF(MyHead=B647,1,0)","v":0}]
[null,"Immolation Helmet (Heroic)",{"$f":"IF(MyHead=B648,1,0)","v":0}]
[null,"Immolation Pauldrons",{"$f":"IF(MyShoulder=B649,1,0)","v":0}]
[null,"Immolation Pauldrons (Heroic)",{"$f":"IF(MyShoulder=B650,1,0)","v":0}]
[null,"Immolation Battleplate",{"$f":"IF(MyChest=B651,1,0)","v":1}]
[null,"Immolation Battleplate (Heroic)",{"$f":"IF(MyChest=B652,1,0)","v":0}]
[null,"Immolation Legplates",{"$f":"IF(MyLegs=B653,1,0)","v":1}]
[null,"Immolation Legplates (Heroic)",{"$f":"IF(MyLegs=B654,1,0)","v":0}]
[null,"Immolation Gauntlets",{"$f":"IF(MyGloves=B655,1,0)","v":0}]
[null,"Immolation Gauntlets (Heroic)",{"$f":"IF(MyGloves=B656,1,0)","v":0}]
[null,"T11 Set Bonus",{"$f":"SUM(C647:C656)","v":2}]
[]
[null,"Reinforced Sapphirium Helmet",{"$f":"IF(MyHead=B659,1,0)","v":1}]
[null,"Reinforced Sapphirium Helmet (Heroic)",{"$f":"IF(MyHead=B660,1,0)","v":0}]
[null,"Reinforced Sapphirium Pauldrons",{"$f":"IF(MyShoulder=B661,1,0)","v":1}]
[null,"Reinforced Sapphirium Pauldrons (Heroic)",{"$f":"IF(MyShoulder=B662,1,0)","v":0}]
[null,"Reinforced Sapphirium Battleplate",{"$f":"IF(MyChest=B663,1,0)","v":0}]
[null,"Reinforced Sapphirium Battleplate (Heroic)",{"$f":"IF(MyChest=B664,1,0)","v":0}]
[null,"Reinforced Sapphirium Legplates",{"$f":"IF(MyLegs=B665,1,0)","v":0}]
[null,"Reinforced Sapphirium Legplates (Heroic)",{"$f":"IF(MyLegs=B666,1,0)","v":0}]
[null,"Reinforced Sapphirium Gauntlets",{"$f":"IF(MyGloves=B667,1,0)","v":0}]
[null,"Reinforced Sapphirium Gauntlets (Heroic)",{"$f":"IF(MyGloves=B668,1,0)","v":0}]
[null,"T11 Set Bonus",{"$f":"SUM(C659:C668)","v":2}]
[]
[null,"Bloodthirsty Gladiator's Scaled Helm",{"$f":"IF(MyHead=B671,1,0)","v":0}]
[null,"Vicious Gladiator's Scaled Helm",{"$f":"IF(MyHead=B672,1,0)","v":0}]
[null,"Bloodthirsty Gladiator's Scaled Shoulders",{"$f":"IF(MyShoulder=B673,1,0)","v":0}]
[null,"Vicious Gladiator's Scaled Shoulders",{"$f":"IF(MyShoulder=B674,1,0)","v":0}]
[null,"Bloodthirsty Gladiator's Scaled Chestpiece",{"$f":"IF(MyChest=B675,1,0)","v":0}]
[null,"Vicious Gladiator's Scaled Chestpiece",{"$f":"IF(MyChest=B676,1,0)","v":0}]
[null,"Bloodthirsty Gladiator's Scaled Legguards",{"$f":"IF(MyLegs=B677,1,0)","v":0}]
[null,"Vicious Gladiator's Scaled Legguards",{"$f":"IF(MyLegs=B678,1,0)","v":0}]
[null,"Bloodthirsty Gladiator's Scaled Gauntlets",{"$f":"IF(MyGloves=B679,1,0)","v":0}]
[null,"Vicious Gladiator's Scaled Gauntlets",{"$f":"IF(MyGloves=B680,1,0)","v":0}]
[null,"PvP Set Bonus",{"$f":"SUM(C671:C680)","v":0}]
[]
[null,"Bloodthirsty Gladiator's Scaled Gauntlets",{"$f":"IF(MyGloves=B683,1,0)","v":0}]
[null,"Vicious Gladiator's Scaled Gauntlets",0]
[null,"Ruthless Gladiator's Scaled Gauntlets",0]
[null,"PvP Glove Bonus?  1 = Yes",{"$f":"SUM(C683:C685)","v":0}]

{"sheet":"Sheet2","index":8,"n_rows":38,"n_cols":4,"rows_kept":38,"cut":false,"hidden":true,"merged":[]}
["Selected Gear"]
["All",null,"Mygear"]
[{"$f":"MyHead","v":"Reinforced Sapphirium Helmet"},null,"Myhead"]
[{"$f":"MyShoulder","v":"Reinforced Sapphirium Pauldrons"},null,"myshoulder"]
[{"$f":"MyChest","v":"Immolation Battleplate"},null,"mychest"]
[{"$f":"MyLegs","v":"Immolation Legplates"},null,"mylegs"]
[{"$f":"MyGloves","v":"Fireskin Gauntlets"},null,"mygloves"]
[{"$f":"MyFeet","v":"Arachnaflame Treads"},null,"myfeet"]
[{"$f":"MyBelt","v":"Cinch of the Flaming Ember"},null,"mybelt"]
[{"$f":"MyBracer","v":"Earthcrack Bracers"},null,"mybracer"]
[{"$f":"MyBack","v":"Bladed Flamewrath Cover"},null,"myback"]
[{"$f":"MyNeck","v":"Gift of Nadun"},null,"myneck"]
[{"$f":"MyTrinket1","v":"Essence of the Eternal Flame"},null,"mytrinket1"]
[{"$f":"MyTrinket2","v":"Darkmoon Card: Hurricane"},null,"mytrinket2"]
[{"$f":"MyRing1","v":"Serrated Brimstone Signet"},null,"myring1"]
[{"$f":"MyRing2","v":"Alysrazor's Band"},null,"myring2"]
[{"$f":"MyLibram","v":"Relic of the Elemental Lords"},null,"mylibram"]
[{"$f":"MyWeapon","v":"Zoid's Firelit Greatsword"},null,"myweapon"]
["AnalysisRange:",null,{"$f":"VLOOKUP('Item Calc'!B3,A2:C18,3,FALSE)","v":"Mygear"}]
[]
[]
["Insert Item Lookup"]
["Helm","UserHelm","Head","MyHead"]
["Shoulder","UserShoulder","Shoulder","MyShoulder"]
["Chest","UserChest","Chest","MyChest"]
["Legs","UserLegs","Legs","MyLegs"]
["Gloves","UserGloves","Gloves","MyGloves"]
["Boots","UserBoots","Feet","MyFeet"]
["Belt","UserBelt","Belt","MyBelt"]
["Bracers","UserBracer","Bracer","MyBracer"]
["Cloak","UserCloak","Back","MyBack"]
["Neck","UserNeck","Neck","MyNeck"]
["Ring","UserRing","Ring","MyRing"]
["Trinket","UserTrinket","Trinket","MyTrinket"]
["Weapon","UserWeapon","Weapon","MyWeapon"]
["Libram","UserLibram","Libram","MyLibram"]
["Gem","UserGem","Gem","MyGem"]
["Meta Gem","UserMeta","MetaGem","MyMetaGem"]

{"sheet":"Race Type","index":9,"n_rows":6,"n_cols":18,"rows_kept":6,"cut":false,"hidden":true,"merged":[]}
["Information","Stam","Int","Str","AP","Agi","Hit","Crit","Haste","Mastery","WE","SpD","Dam (S)","SpH","SpC","Mp5","Health","Mana"]
["Base Information (Dwarf)",157,105,169,{"$f":"235 + (D2 * 2)","v":573},93,null,0.65,null,null,{"$f":"IF(ISNONTEXT(MyWeapon),0,IF(VLOOKUP(MyWeapon,Gear!B411:AI453,34,FALSE)=\"Mace\",3,0))","v":0},{"$f":"ROUNDDOWN((C2-10),0)","v":95},null,null,3.33,1171,44675,23142]
["Base Information (Human)",156,106,164,{"$f":"235 + (D3 * 2)","v":563},97,null,0.65,null,null,{"$f":"IF(ISNONTEXT(MyWeapon),0,IF(VLOOKUP(MyWeapon,Gear!B411:AI453,34,FALSE)=\"Mace\",3,IF(VLOOKUP(MyWeapon,Gear!B411:AI453,34,FALSE)=\"Sword\",3,0)))","v":3},{"$f":"ROUNDDOWN((C3-10),0)","v":96},null,null,3.33,1171,44665,23142]
["Base Information (Blood Elf)",156,109,161,{"$f":"235 + (D4 * 2)","v":557},99,null,0.65,null,null,null,99,null,null,3.33,{"$f":"1171 + 483/24","v":1191.125},44665,23142]
["Base Information (Draenei)",156,106,165,{"$f":"235 + (D5 * 2)","v":565},94,1,0.65,null,null,null,96,null,1,3.33,1171,44665,23142]
["Base Information (Tauren)",null,102,177,{"$f":"235 + (D6 * 2)","v":589},93,null,0.65,null,null,null,92,null,null,3.33,1171,null,23142]

{"sheet":"DPS Calc","index":10,"n_rows":81,"n_cols":21,"rows_kept":81,"cut":false,"hidden":false,"merged":[[69,14,69,15],[31,14,31,15],[55,14,55,15],[48,6,48,7],[41,10,41,11],[3,14,3,15],[17,14,17,15],[3,6,3,7],[19,6,19,7],[34,6,34,7],[17,1,17,2],[46,1,46,2],[10,10,10,11],[45,10,45,11],[73,1,73,3],[56,1,57,2],[56,3,57,3],[43,1,43,3]]}
["DPS CALCULATIONS"]
[]
[null,"Weapon",null,null,null,"White","Normal","AW",null,"SoR","Normal","AW",null,"Hammer of Wrath","Normal","AW",null,"Coefficients",80,"Attack Power","Spelldamage"]
[null,"Speed",{"$f":"Weaponspeed","v":3.6},null,null,"Cooldown",{"$f":"ROUND(HastedWeaponspeed,2)","v":2.58},null,null,{"$f":"CONCATENATE(\"Procs in \",Length,\" seconds\")","v":"Procs in 450 seconds"},{"$f":"IF(CSDPS>(DSDPS  * (ExtraTargets+1)),SUM(G23:G24),SUM(G38:G39)) + ((SUM(G7:G9) + SUM(G52:G53) + SUM(K14:K15)) * (ExtraTargets+1))","v":308.69544903187358},{"$f":"IF(CSDPS>(DSDPS  * (ExtraTargets+1)),SUM(H23:H24),SUM(H38:H39)) + ((SUM(H7:H9) + SUM(H52:H53) + SUM(L14:L15))  * (ExtraTargets+1))","v":78.062617148422433},null,"Effective Cooldown",{"$f":"IF((SUM(O5:P5)=0),0,(Length / SUM(O5:P5)))","v":23.52195885107103},null,null,"SoR",{"$f":"Weaponspeed","v":3.6},1.0999999999999999E-2,2.1999999999999999E-2]
[null,"Hasted",{"$f":"Weaponspeed/((1 + WindFuryHaste) * (1 + JotPHaste) * (1 + (CurrentHaste / 100)))","v":2.5781977791427799},null,null,{"$f":"CONCATENATE(\"Total Attacks in \",Length,\" seconds\")","v":"Total Attacks in 450 seconds"},{"$f":"Length/HastedWeaponspeed * 5/6","v":145.45043946344683},{"$f":"Length/HastedWeaponspeed * 1/6","v":29.090087892689368},null,"Av Hit",{"$f":"SoRBase * ((SoRAP * CharTotalAP) + (SoRSP * CharSpelldamage))","v":1032.7809823845093},{"$f":"K5 * 1.2","v":1239.3371788614111},null,{"$f":"CONCATENATE(\"Total Attacks in \",Length,\" seconds\")","v":"Total Attacks in 450 seconds"},{"$f":"NumHoW","v":9.3202598737131499},{"$f":"NumAWHoW","v":9.8107998670664767},null,"JoR",1,0.2,0.32]
[null,"Weapon Dps",{"$f":"WeaponDPS","v":744.1},null,null,{"$f":"CONCATENATE(\"Avoidance in \",Length,\" seconds\")","v":"Avoidance in 450 seconds"},{"$f":"Avoidance * G5","v":0},{"$f":"Avoidance * H5","v":0},null,"Av Hit Post Buffs/Miti",{"$f":"K5 * Communion * TotT * TwoHWeapSpec * Inquisition * SealDamage * CoE","v":2069.4356950598972},{"$f":"K6 * 1.2","v":2483.3228340718765},null,{"$f":"CONCATENATE(\"Miss in \",Length,\" seconds\")","v":"Miss in 450 seconds"},{"$f":"O5 * MeleeMiss","v":0},{"$f":"P5 * MeleeMiss","v":0},null,"SoT",{"$f":"0.15 * WeaponDamage","v":1001.5887432235816},0,0]
[null,"Av. Hit",{"$f":"((WeaponDPS * Weaponspeed) + ((CharTotalAP / 14) * Weaponspeed))","v":6677.2582881572107},null,null,{"$f":"CONCATENATE(\"Crits in \",Length,\" seconds\")","v":"Crits in 450 seconds"},{"$f":"MIN((G5 * (CritTotal% - CritReduction)),(NumMelee - G6))","v":14.467247105391321},{"$f":"MIN((H5 * (CritTotal% - CritReduction)),(NumAWMelee - H6))","v":2.8934494210782646},null,"Total Damage",{"$f":"K6 * K4","v":638825.38112910232},{"$f":"L6 * L4","v":193854.67965208826},null,{"$f":"CONCATENATE(\"Full Resists in \",Length,\" seconds\")","v":"Full Resists in 450 seconds"},{"$f":"O5 * FullResist","v":4.6601299368565753E-2},{"$f":"P5 * FullResist","v":4.9053999335332388E-2},null,"Censure (SoT Tick)",0,2.7E-2,1.4E-2]
[null,"Dps",{"$f":"WeaponDamage / HastedWeaponspeed","v":2589.8937397957575},null,null,{"$f":"CONCATENATE(\"Glancing in \",Length,\" seconds\")","v":"Glancing in 450 seconds"},{"$f":"MIN((GlanceFreq * G5),(NumMelee - G6))","v":34.908105471227238},{"$f":"MIN((GlanceFreq * H5),(NumAWMelee - H6))","v":6.9816210942454484},null,"Dps",null,{"$f":"(K7 + L7)/Length * (1 + ICCBuff)","v":1850.4001350693125},null,{"$f":"CONCATENATE(\"Crits in \",Length,\" seconds\")","v":"Crits in 450 seconds"},{"$f":"MIN((O5 * HoWCrit),(O5 - SUM(O6:O7)))","v":6.7246194278286096},{"$f":"MIN((P5 * HoWCrit),(P5 - SUM(P6:P7)))","v":7.0785467661353803},null,"JoT",1,0.1421,0.22289999999999999]
[null,null,null,null,null,{"$f":"CONCATENATE(\"Hits in \",Length,\" seconds\")","v":"Hits in 450 seconds"},{"$f":"G5 - SUM(G6:G8)","v":96.075086886828274},{"$f":"H5 - SUM(H6:H8)","v":19.215017377365655},null,null,null,null,null,{"$f":"CONCATENATE(\"Hits in \",Length,\" seconds\")","v":"Hits in 450 seconds"},{"$f":"O5 - SUM(O6:O8)","v":2.549039146515975},{"$f":"P5 - SUM(P6:P8)","v":2.6831991015957639},null,"Consecration",810,0.27,0.27]
[null,"Spell GCD",{"$f":"MAX((1.5 / (( 1 + WoAHaste) * (1 + JotPHaste) * (1 + (CurrentHaste / 100)))),1)","v":1.1254037924829599},null,null,"Av Hit",{"$f":"WeaponDamage","v":6677.2582881572107},{"$f":"G10 * 1.2","v":8012.7099457886525},null,"JoR","Normal","AW",null,"Av Hit",{"$f":"HoWBase + (HoWAP * CharTotalAP) + (HoWSP * CharSpelldamage)","v":10695.429888338575},{"$f":"O10 * 1.2","v":12834.51586600629},null,"Exorcism",2741,{"$f":"IF(CharTotalAP>CharSpelldamage,0.344,0)","v":0.34399999999999997},{"$f":"IF(CharTotalAP>CharSpelldamage,0,0.344)","v":0}]
[null,"CS CD",{"$f":"MAX(3,(4.5/(( 1 + WoAHaste) * (1 + JotPHaste) * (1 + (CurrentHaste / 100)))))","v":3.3762113774488793},null,null,"Av Crit",{"$f":"G10 + G10","v":13354.516576314421},16025.419891577305,null,"Effective Cooldown",{"$f":"JudgementCD","v":13.580162161136959},null,null,"Av Crit",{"$f":"O10 + O10","v":21390.859776677149},{"$f":"O11 * 1.2","v":25669.03173201258},null,"Holy Wrath",2402,0,0.61]
[null,"Mastery",{"$f":"(16.8% + (Mastery% * 2.1))","v":0.3414772423025435},null,null,"Av Glance",{"$f":"G10*(100%-GlanceAmt)","v":5007.9437161179085},6009.5324593414898,null,{"$f":"CONCATENATE(\"Total Attacks in \",Length,\" seconds\")","v":"Total Attacks in 450 seconds"},{"$f":"NumJudge","v":27.613808697598369},{"$f":"NumAWJudge","v":5.5227617395196731},null,"Av Hit Post Buffs/Miti",{"$f":"O10 * Communion * TotT * CoE * Inquisition","v":15945.666622143652},{"$f":"O12 * 1.2","v":19134.799946572381},null,"Hammer of Wrath",4015,0.39,0.11700000000000001]
[null,"Inq Uptime",{"$f":"IF(InqRefresh=\"Unused\",0%,(MIN(1,((36 + IF(T11Bonus>3,12,0))/((36 + IF(T11Bonus>3,12,0)) + (G49 / 2) - InqRefresh) - IF(T11Bonus>3,(TVCooldown / Length),((TVCooldown * 2) / Length ))))))","v":0.98428335163405878},null,null,"Av Hit Post Buffs/Miti",{"$f":"G10 * ArmorMitigation * Communion * TotT * TwoHWeapSpec * BloodFrenzy","v":6324.2969255745975},7589.1563106895164,null,{"$f":"CONCATENATE(\"Miss in \",Length,\" seconds\")","v":"Miss in 450 seconds"},{"$f":"K12 * MeleeMiss","v":0},{"$f":"L12 * MeleeMiss","v":0},null,"Av Crit Post Buffs/Miti",{"$f":"(O12 + O12) * CritBonus","v":32848.073241615923},{"$f":"O13 * 1.2","v":39417.687889939109},null,"Retribution Aura",121,0,3.3300000000000003E-2]
[null,null,null,null,null,"Av Crit Post Buffs/Miti",{"$f":"(G13 + G13) * CritBonus","v":13028.051666683672},15633.662000020406,null,{"$f":"CONCATENATE(\"Crits in \",Length,\" seconds\")","v":"Crits in 450 seconds"},{"$f":"MIN((K12 * JCrit),(NumJudge2 - K13))","v":6.0602681603427513},{"$f":"MIN((L12 * JCrit),(NumAWJudge2 - L13))","v":1.21205363206855},null,"Total Damage",{"$f":"(O12 * O9) + (O13 * O8)","v":261536.91992444484},{"$f":"(P12 * P9) + (P13 * P8)","v":330362.42516771995}]
[null,"DPS SoR",{"$f":"AutoattackDPS + SoRDPS + JoRDPS + IF(ExtraTargets>2,(DSDPS * (ExtraTargets + 1)),CSDPS) + TVDPS + ConsDPS + HoWDPS + ExoDPS + HWDPS + SoCDPS + IF(GlyphOfExorcism=\"On\",ExoGlyphDPS,0)","v":22794.750571972243},null,null,"Av Glance",{"$f":"G13*(100%-GlanceAmt)","v":4743.2226941809477},5691.8672330171366,null,{"$f":"CONCATENATE(\"Hits in \",Length,\" seconds\")","v":"Hits in 450 seconds"},{"$f":"K12 - SUM(K13:K14)","v":21.553540537255618},{"$f":"L12 - SUM(L13:L14)","v":4.3107081074511235},null,"Dps",null,{"$f":"(O14 + P14)/Length * (1 + ICCBuff)","v":1315.3318779825886}]
[null,"DPS SoT",{"$f":"AutoattackDPS + SoTDPS + JoTDPS + SoTDoTDPS + IF(ExtraTargets>2,(DSDPS * (ExtraTargets + 1)),CSDPS) + TVDPS + ConsDPS + HoWDPS + ExoDPS + HWDPS + SoCDPS + IF(GlyphOfExorcism=\"On\",ExoGlyphDPS,0)","v":25866.368211073208},null,null,"Total Damage",{"$f":"(G13 * G9) + (G14 * G7) + (G15 * G8)","v":961664.33746838546},{"$f":"(H13 * H9) + (H14 * H7) + (H15 * H8)","v":230799.44099241251},null,"Av Hit",{"$f":"JoRBase + (JoRAP * CharTotalAP) + (JoRSP * CharSpelldamage)","v":4795.8410766810584},{"$f":"K16 * 1.2","v":5755.0092920172701}]
[null,null,null,null,null,"Dps",null,{"$f":"(G16 + H16)/Length * (1 + ICCBuff)","v":2649.9195076906617},null,"Av Crit",{"$f":"K16 + K16","v":9591.6821533621169},{"$f":"K17 * 1.2","v":11510.01858403454},null,"Consecration","Normal","AW"]
[null,"Modifiers",null,null,null,null,null,null,null,"Av Hit Post Buffs/Miti",{"$f":"K16  * Communion * TotT * TwoHWeapSpec * Inquisition * JudgementDamage * CoE","v":8580.0627497827008},{"$f":"K18 * 1.2","v":10296.075299739241},null,"Effective Cooldown",{"$f":"ConsCooldown","v":55.664967759511015}]
[null,null,null,null,null,"CS","Normal","AW",null,"Av Crit Post Buffs/Miti",{"$f":"(K18 + K18) * CritBonus","v":17674.929264552364},{"$f":"K19 * 1.2","v":21209.915117462835},null,{"$f":"CONCATENATE(\"Total Ticks in \",Length,\" seconds\")","v":"Total Ticks in 450 seconds"},{"$f":"NumCons * IF(GlyphOfConsecration=\"On\",12,10)","v":67.367325464035119},{"$f":"NumAWCons * IF(GlyphOfConsecration=\"On\",12,10)","v":13.473465092807022}]
[null,"Avoidance",null,null,null,"Effective Cooldown",{"$f":"CSCooldown","v":3.9422892823279452},null,null,"Total Damage",{"$f":"(K19 * K14) + (K18 * K15)","v":292045.54134791536},{"$f":"(L19 * L14) + (L18 * L15)","v":70090.929923499672},null,{"$f":"CONCATENATE(\"Miss in \",Length,\" seconds\")","v":"Miss in 450 seconds"},{"$f":"O19 * SpellMiss","v":0},{"$f":"P19 * SpellMiss","v":0}]
[null,"Spell Miss",{"$f":"IF(SpellHit%>17%,0%,(17% - SpellHit%))","v":0},null,null,{"$f":"CONCATENATE(\"Total Attacks in \",Length,\" seconds\")","v":"Total Attacks in 450 seconds"},{"$f":"NumCS","v":95.12239542668982},{"$f":"NumAWCS","v":19.024479085337962},null,"Dps",null,{"$f":"(K20 + L20)/Length * (1 + ICCBuff)","v":804.74771393647779},null,{"$f":"CONCATENATE(\"Full Resists in \",Length,\" seconds\")","v":"Full Resists in 450 seconds"},{"$f":"IF(ConsCooldown=0,0,(O19/ConsCooldown) * FullResist)","v":6.0511420535696459E-3},{"$f":"IF(ConsCooldown=0,0,(P19/ConsCooldown) * FullResist)","v":1.2102284107139291E-3}]
[null,"Melee Miss",{"$f":"IF(HitTotal>8,0%,(8% - HitTotal%))","v":0},null,null,{"$f":"CONCATENATE(\"Avoidance in \",Length,\" seconds\")","v":"Avoidance in 450 seconds"},{"$f":"G21 * Avoidance","v":0},{"$f":"H21 * Avoidance","v":0},null,null,null,null,null,{"$f":"CONCATENATE(\"Crits in \",Length,\" seconds\")","v":"Crits in 450 seconds"},{"$f":"MIN((O19 * SpellCritChance),(O19 - SUM(O20:O21)))","v":8.1855053890055434},{"$f":"MIN((P19 * SpellCritChance),(P19 - SUM(P20:P21)))","v":1.6371010778011084}]
[null,"Dodge",{"$f":"(IF(6.5% - (0.25% * CurrentExpertise)<0,0%,(6.5% - (0.25% * CurrentExpertise))))","v":0},null,null,{"$f":"CONCATENATE(\"Crits in \",Length,\" seconds\")","v":"Crits in 450 seconds"},{"$f":"MIN((G21 * CSCrit),(G21 - G22))","v":23.729720895111036},{"$f":"MIN((H21 * CSCrit),(H21 - H22))","v":4.7459441790222066},null,"SoT","Normal","AW",null,{"$f":"CONCATENATE(\"Hits in \",Length,\" seconds\")","v":"Hits in 450 seconds"},{"$f":"O19 - SUM(O20:O22)","v":59.175768932976005},{"$f":"P19 - SUM(P20:P22)","v":11.8351537865952}]
[null,"Parry",{"$f":"MAX(0,IF(FrontOfBoss=\"Never\",0,((FrontOfBoss * (12% - (CurrentExpertise * 0.25%))))))","v":0},null,null,{"$f":"CONCATENATE(\"Hits in \",Length,\" seconds\")","v":"Hits in 450 seconds"},{"$f":"G21 - SUM(G22:G23)","v":71.392674531578791},{"$f":"H21 - SUM(H22:H23)","v":14.278534906315755},null,{"$f":"CONCATENATE(\"Procs in \",Length,\" seconds\")","v":"Procs in 450 seconds"},{"$f":"SUM(G7:G9) + SUM(G23:G24) + SUM(G52:G53) + SUM(K49:K50) + SUM(O36:O37) + SUM(O8:O9)","v":345.09417774338783},{"$f":"SUM(H7:H9) + SUM(H23:H24) + SUM(H52:H53) + SUM(L49:L50) + SUM(P36:P37) + SUM(P8:P9)","v":93.249377043587486},null,"Av Hit",{"$f":"(ConsBase + (ConsAP * CharTotalAP) + (ConsSP * (CharSpelldamage))) / 10","v":643.00558594115455},{"$f":"O24 * 1.2","v":771.60670312938544}]
[null,"Avoidance",{"$f":"SUM(C22:C24)","v":0},null,null,"Av Hit",{"$f":"((C6 * Weaponspeed) + ((CharTotalAP / 14) * 3.3)) * 135%","v":8564.4676315945508},{"$f":"G25 * 1.2","v":10277.361157913461},null,{"$f":"CONCATENATE(\"Avoidance in \",Length,\" seconds\")","v":"Avoidance in 450 seconds"},0,0,null,"Av Crit",{"$f":"O24 + (O24/2)","v":964.50837891173182},{"$f":"O25 * 1.2","v":1157.4100546940781}]
[null,"Hit",{"$f":"100% - Avoidance","v":1},null,null,"Av Crit",{"$f":"G25 + G25","v":17128.935263189102},{"$f":"G26 * 1.2","v":20554.722315826923},null,{"$f":"CONCATENATE(\"Crits in \",Length,\" seconds\")","v":"Crits in 450 seconds"},{"$f":"MIN((K24* (CritTotal% - CritReduction)),(K24 - K25))","v":34.324837810477071},{"$f":"MIN((L24 * (CritTotal% - CritReduction)),(L24 - L25))","v":9.275061561105959},null,"Av Hit Post Buffs/Miti",{"$f":"O24  * Communion * TotT * Inquisition * CoE","v":958.64802225228846},{"$f":"O26 * 1.2","v":1150.3776267027461}]
[null,null,null,null,null,"Av hit Post Buffs/Miti",{"$f":"G25 * ArmorMitigation * Communion * TotT * CSDamage * TwoHWeapSpec * BloodFrenzy","v":10545.272350788791},{"$f":"G27 * 1.2","v":12654.32682094655},null,{"$f":"CONCATENATE(\"Hits in \",Length,\" seconds\")","v":"Hits in 450 seconds"},{"$f":"K24 - SUM(K25:K26)","v":310.76933993291078},{"$f":"L24 - SUM(L25:L26)","v":83.974315482481529},null,"Av Crit Post Buffs/Miti",{"$f":"(O26 + (O26/2)) * CritBonus","v":1481.1111943797855},{"$f":"O27 * 1.2","v":1777.3334332557426}]
[null,"Glancing",null,null,null,"Av Crit Post Buffs/Miti",{"$f":"(G27 + G27) * CritBonus","v":21723.261042624912},{"$f":"G28 * 1.2","v":26067.913251149894},null,"Av Hit",{"$f":"SoTBase","v":1001.5887432235816},{"$f":"K28 * 1.2","v":1201.9064918682977},null,"Total Damage",{"$f":"(O26 * O23) + (O27 * O22)","v":68852.377516168024},{"$f":"(P26 * P23) + (P27 * P22)","v":16524.570603880326}]
[null,"Frequency",0.24,null,null,"Mastery",{"$f":"((G27 * G24) + (G28 * G23)) * MasteryDamageBonus * Inquisition * CoE","v":605880.91623548663},{"$f":"((H27 * H24) + (H28 * H23)) * MasteryDamageBonus * Inquisition * CoE","v":145411.41989651675},null,"Average Crit",{"$f":"K28 + K28","v":2003.1774864471631},{"$f":"K29 * 1.2","v":2403.8129837365955},null,"Dps",null,{"$f":"(O28 + P28)/Length * (1 + ICCBuff)","v":189.72655137788524}]
[null,"Amount",0.25,null,null,"T12 Bonus",{"$f":"IF(T12Bonus>1,(((G27 * G24) + (G28 * G23)) * 0.15),0)","v":190251.31773897735},{"$f":"IF(T12Bonus>1,(((H27 * H24) + (H28 * H23)) * 0.15),0)","v":45660.316257354549},null,"Av Hit Post Buffs/Miti",{"$f":"K28  * Communion * TotT * TwoHWeapSpec * Inquisition * SealDamage * CoE","v":2006.9342216309092},{"$f":"K30 * 1.2","v":2408.3210659570909}]
[null,null,null,null,null,"Total Damage",{"$f":"((G27 * G24) + (G28 * G23)) + G29 + G30","v":2064474.3522343128},{"$f":"((H27 * H24) + (H28 * H23)) + H29 + H30","v":495473.84453623497},null,"Average Crit Post Buffs/Miti",{"$f":"(K30 + K30) * CritBonus","v":4134.2844965596732},{"$f":"K31 * 1.2","v":4961.1413958716075},null,"Exorcism","Normal","AW"]
[null,"Mitigation",null,null,null,"Dps",null,{"$f":"(G31 + H31)/Length * (1 + ICCBuff)","v":5688.7737706012176},null,"Total Damage",{"$f":"(K31 * K26) + (K30 * K27)","v":765602.26815178839},{"$f":"(L31 * L26) + (L30 * L27)","v":248252.00483584727},null,"Effective Cooldown",{"$f":"ExoCooldown","v":13.755724800456994}]
[null,"Boss Armour",11977,null,null,null,null,null,null,"Dps",null,{"$f":"(K32 + L32) / Length * (1 + ICCBuff)","v":2253.0094955280792},null,{"$f":"CONCATENATE(\"Total Attacks in \",Length,\" seconds\")","v":"Total Attacks in 450 seconds"},{"$f":"NumExo","v":27.261377022281057},{"$f":"NumAWExo","v":5.4522754044562118}]
[null,"Reduction",{"$f":"(BossArmour/(26070 + BossArmour))","v":0.31479485899019632},null,null,"Divine Storm","Normal","AW",null,null,null,null,null,{"$f":"CONCATENATE(\"Miss in \",Length,\" seconds\")","v":"Miss in 450 seconds"},{"$f":"O33 * SpellMiss","v":0},{"$f":"P33 * SpellMiss","v":0}]
[null,"Modified Armour",{"$f":"BossArmour * (1 - IF(ArmorDebuff=\"On\",0.12,0))","v":10539.76},null,null,"Cooldown","N/A",null,null,"Censure Ticks (SoT DoT)","Normal","AW",null,{"$f":"CONCATENATE(\"Full Resists in \",Length,\" seconds\")","v":"Full Resists in 450 seconds"},{"$f":"O33 * FullResist","v":0.13630688511140529},{"$f":"P33 * FullResist","v":2.7261377022281059E-2}]
[null,"Reduction",{"$f":"(ModifiedArmour/(26070 + ModifiedArmour))","v":0.28789481274938705},null,null,{"$f":"CONCATENATE(\"Total Attacks in \",Length,\" seconds\")","v":"Total Attacks in 450 seconds"},{"$f":"NumCS","v":95.12239542668982},{"$f":"NumAWCS","v":19.024479085337962},null,{"$f":"CONCATENATE(\"Total Ticks in \",Length,\" seconds\")","v":"Total Ticks in 450 seconds"},{"$f":"Length/(3 / (( 1 + WoAHaste) * (1 + JotPHaste) * (1 + (CurrentHaste / 100)))) * 5/6","v":166.60686702176633},{"$f":"Length/(3 / (( 1 + WoAHaste) * (1 + JotPHaste) * (1 + (CurrentHaste / 100)))) * 1/6","v":33.321373404353267},null,{"$f":"CONCATENATE(\"Crits in \",Length,\" seconds\")","v":"Crits in 450 seconds"},{"$f":"MIN((O33 * SpellCritChance),(O33 - SUM(O34:O35)))","v":3.3124091982354842},{"$f":"MIN((P33 * SpellCritChance),(P33 - SUM(P34:P35)))","v":0.66248183964709684}]
[null,"Dmg Post Mitigation",{"$f":"100% - ArmorReduction","v":0.712105187250613},null,null,{"$f":"CONCATENATE(\"Avoidance in \",Length,\" seconds\")","v":"Avoidance in 450 seconds"},{"$f":"G36 * Avoidance","v":0},{"$f":"H36 * Avoidance","v":0},null,{"$f":"CONCATENATE(\"Crits in \",Length,\" seconds\")","v":"Crits in 450 seconds"},{"$f":"K36 * (CritTotal% - CritReduction)","v":16.571573957084603},{"$f":"L36 * (CritTotal% - CritReduction)","v":3.3143147914169204},null,{"$f":"CONCATENATE(\"Hits in \",Length,\" seconds\")","v":"Hits in 450 seconds"},{"$f":"O33 - SUM(O34:O36)","v":23.812660938934165},{"$f":"P33 - SUM(P34:P36)","v":4.7625321877868343}]
[null,"Full Resist",5.0000000000000001E-3,null,null,{"$f":"CONCATENATE(\"Crits in \",Length,\" seconds\")","v":"Crits in 450 seconds"},{"$f":"MIN((G36 * (CritTotal% - CritReduction)),(G36 - G37))","v":9.4613615811075622},{"$f":"MIN((H36 * (CritTotal% - CritReduction)),(H36 - H37))","v":1.8922723162215123},null,{"$f":"CONCATENATE(\"Hits in \",Length,\" seconds\")","v":"Hits in 450 seconds"},{"$f":"K36 - K37","v":150.03529306468172},{"$f":"L36 - L37","v":30.007058612936348},null,"Av Hit",{"$f":"ExoBase + (ExoAP * CharTotalAP) + (ExoSP * CharSpelldamage)","v":8090.1021543792012},{"$f":"O38 * 1.2","v":9708.1225852550415}]
[null,null,null,null,null,{"$f":"CONCATENATE(\"Hits in \",Length,\" seconds\")","v":"Hits in 450 seconds"},{"$f":"G36 - SUM(G37:G38)","v":85.661033845582253},{"$f":"H36 - SUM(H37:H38)","v":17.132206769116451},null,{"$f":"CONCATENATE(\"DoT Tick (every \",ROUND(((3 / (( 1 + WoAHaste) * (1 + JotPHaste) * (1 + (CurrentHaste / 100))))),2),\" sec)\")","v":"DoT Tick (every 2.25 sec)"},{"$f":"(((SoTDoTAP * CharTotalAP) + (SoTDoTSP * CharSpelldamage)) * 5) * (SealDamage + (IoFTalent * 10%)) * Communion * TotT  * Inquisition * CoE","v":5224.440083395878},{"$f":"K39 * 1.2","v":6269.328100075053},null,"Av Crit",{"$f":"O38 + (O38/2)","v":12135.153231568802},{"$f":"O39 * 1.2","v":14562.183877882562}]
[null,"Critical Chance Reduction",null,null,null,"Av Hit",{"$f":"((C6 * Weaponspeed) + ((CharTotalAP / 14) * Weaponspeed))","v":6677.2582881572107},{"$f":"G40 * 1.2","v":8012.7099457886525},null,"DoT Crit",{"$f":"(K39 + K39)  * CritBonus","v":10762.34657179551},{"$f":"K40 * 1.2","v":12914.815886154611},null,"Av Hit Post Buffs/Miti",{"$f":"O38  * Communion * TotT * ExoDamage * Inquisition * CoE","v":26535.12398539815},{"$f":"O40 * 1.2","v":31842.14878247778}]
[null,"Melee",4.8000000000000001E-2,null,null,"Av Crit",{"$f":"G40 + G40","v":13354.516576314421},{"$f":"G41 * 1.2","v":16025.419891577305},null,"Total Damage",{"$f":"(K39 * K38) + (K40 * K37)","v":962199.42117745592},{"$f":"(L39 * L38) + (L40 * L37)","v":230927.86108258943},null,"Av Crit Post Buffs/Miti",{"$f":"(O40 + (O40/2)) * CritBonus","v":40996.76655744014},{"$f":"O41 * 1.2","v":49196.119868928166}]
[null,"Spell",2.1000000000000001E-2,null,null,"Av Hit Post Buffs/Miti",{"$f":"G40  * ArmorMitigation * Communion * TotT * TwoHWeapSpec * BloodFrenzy","v":6324.2969255745975},{"$f":"G42 * 1.2","v":7589.1563106895164},null,"SoT stack up-time",{"$f":"(Length - ((TrinketReset + 1) * 5))/Length","v":0.98888888888888893},null,null,"Total Damage",{"$f":"(O40 * O37) + (O41 * O36)","v":767669.97707964329},{"$f":"(P40 * P37) + (P41 * P36)","v":184240.79449911442}]
[null,null,null,null,null,"Av Crit Post Buffs/Miti",{"$f":"(G42 + G42) * CritBonus","v":13028.051666683672},{"$f":"G43 * 1.2","v":15633.662000020406},null,"Dps",null,{"$f":"SUM(K41:L41) * K42 /Length * (1 + ICCBuff)","v":2621.9340276825692},null,"Dps",null,{"$f":"(O42 + P42)/Length * (1 + ICCBuff)","v":2115.3572701750172}]
[null,"Damage Buffs",null,null,null,"Mastery",{"$f":"((G43 * G38) + (G42 * G39)) * MasteryDamageBonus * Inquisition * CoE","v":317671.55585304624},{"$f":"((H43 * H38) + (H42 * H39)) * MasteryDamageBonus * Inquisition * CoE","v":76241.173404731089}]
[null,null,null,null,null,"Total Damage",{"$f":"((G43 * G38) + (G42 * G39)) + G44","v":982680.47636004887},{"$f":"((H43 * H38) + (H42 * H39)) + H44","v":235843.3143264117},null,"JoT","Normal","AW",null,"Glyph of Exorcism","Normal","AW"]
[null,"All Damage",null,null,null,"Dps (per Target)",null,{"$f":"(G45 + H45)/Length * (1 + ICCBuff)","v":2707.8306459699124},null,"Effective Cooldown",{"$f":"JudgementCD","v":13.580162161136959},null,null,{"$f":"CONCATENATE(\"Crits in \",Length,\" seconds\")","v":"Crits in 450 seconds"},{"$f":"(SUM(O36:O37) * (1 - (0.2 * 0.2))) * SpellCritChance","v":3.1640132661545342},{"$f":"(SUM(P36:P37) * (1 - (0.2 * 0.2))) * SpellCritChance","v":0.63280265323090701}]
[null,"Communion",null,{"$f":"100% * IF(CommunionTalent>0,105%,IF(PercentDamageBuff=\"On\",103%,100%))","v":1.05},null,null,null,null,null,{"$f":"CONCATENATE(\"Total Attacks in \",Length,\" seconds\")","v":"Total Attacks in 450 seconds"},{"$f":"NumJudge","v":27.613808697598369},{"$f":"NumAWJudge","v":5.5227617395196731},null,{"$f":"CONCATENATE(\"Hits in \",Length,\" seconds\")","v":"Hits in 450 seconds"},{"$f":"(SUM(O36:O37) * (1 - (0.2 * 0.2))) - O46","v":22.876054065528329},{"$f":"(SUM(P36:P37) * (1 - (0.2 * 0.2))) - P46","v":4.5752108131056666}]
[null,"Tricks of the Trade",null,{"$f":"100%  + IF(AND(Estimations=\"On\",TotTBuff=\"On\"),1.5%,0%)","v":1.0149999999999999},null,"Templar's Verdict","Normal","AW",null,{"$f":"CONCATENATE(\"Miss in \",Length,\" seconds\")","v":"Miss in 450 seconds"},{"$f":"K47 * MeleeMiss","v":0},{"$f":"L47 * MeleeMiss","v":0},null,"Av Hit (all 3 ticks)",{"$f":"0.2 * O38","v":1618.0204308758402},{"$f":"O48 * 1.2","v":1941.6245170510083}]
[null,"Crit Bonus",null,{"$f":"100% * IF(MetaBonus=\"Crit\",103%,100%)","v":1.03},null,"Effective Cooldown",{"$f":"TVCooldown","v":6.930103635020548},null,null,{"$f":"CONCATENATE(\"Crits in \",Length,\" seconds\")","v":"Crits in 450 seconds"},{"$f":"MIN((K47 * JCrit),(NumJudge3 - K48))","v":6.0602681603427513},{"$f":"MIN((L47 * JCrit),(NumAWJudge3 - L48))","v":1.21205363206855},null,"Av Crit (all 3 ticks)",{"$f":"O48 + (O48/2)","v":2427.0306463137604},{"$f":"O49 * 1.2","v":2912.4367755765124}]
[null,null,null,null,null,{"$f":"CONCATENATE(\"Total Attacks in \",Length,\" seconds\")","v":"Total Attacks in 450 seconds"},{"$f":"NumTV","v":40.508805444138581},{"$f":"NumAWTV","v":24.425288430875423},null,{"$f":"CONCATENATE(\"Hits in \",Length,\" seconds\")","v":"Hits in 450 seconds"},{"$f":"K47 - SUM(K48:K49)","v":21.553540537255618},{"$f":"L47 - SUM(L48:L49)","v":4.3107081074511235},null,"Av Hit Post Buffs/Miti",{"$f":"0.2 * O40","v":5307.0247970796299},{"$f":"O50 * 1.2","v":6368.4297564955559}]
[null,"Holy Damage",null,null,null,{"$f":"CONCATENATE(\"Avoidance in \",Length,\" seconds\")","v":"Avoidance in 450 seconds"},{"$f":"G50 * Avoidance","v":0},{"$f":"H50*Avoidance","v":0},null,"Av Hit",{"$f":"(JoTBase + (JoTAP * CharTotalAP) + (JoTSP * CharSpelldamage)) * (1.5)","v":5076.3769794198652},{"$f":"K51 * 1.2","v":6091.6523753038382},null,"Av Crit Post Buffs/Miti",{"$f":"O50 + ((O50/2) * CritBonus)","v":8040.14256757564},{"$f":"O51 * 1.2","v":9648.171081090768}]
[null,"Spell Damage Debuff",null,{"$f":"IF(CoEBuff=\"On\",108%,100%)","v":1.08},null,{"$f":"CONCATENATE(\"Crits in \",Length,\" seconds\")","v":"Crits in 450 seconds"},{"$f":"MIN((G50 * TVCrit),(G50 - G51))","v":8.8902703185592529},{"$f":"MIN((H50 * TVCrit),(H50 - H51))","v":5.3604991403339595},null,"Av Crit",{"$f":"K51 + K51","v":10152.75395883973},{"$f":"K52 * 1.2","v":12183.304750607676},null,"Total Damage",{"$f":"(O50 * O47) + (O51 * O46)","v":146842.90393067623},{"$f":"(P50 * P47) + (P51 * P46)","v":35242.2969433623}]
[null,"Inquisition",null,{"$f":"100% + (30% * InqUptime)","v":1.2952850054902176},null,{"$f":"CONCATENATE(\"Hits in \",Length,\" seconds\")","v":"Hits in 450 seconds"},{"$f":"G50 - SUM(G51:G52)","v":31.618535125579328},{"$f":"H50 - SUM(H51:H52)","v":19.064789290541462},null,"Av Hit Post Buffs/Miti",{"$f":"K51 * Communion * TotT * TwoHWeapSpec * Inquisition * JudgementDamage * CoE","v":9081.9592076886129},{"$f":"K53 * 1.2","v":10898.351049226336},null,"Dps",null,{"$f":"(O52+P52)/Length * (1 + ICCBuff)","v":404.63377972008561}]
[null,"Crit Chance",null,{"$f":"IF((SpellCrit% - SpellCritReduction) > 100%,100%,(SpellCrit% - SpellCritReduction))","v":0.12150557161981258},null,"Av Hit",{"$f":"((C6 * Weaponspeed) + ((CharTotalAP / 14) * Weaponspeed)) * 235%","v":15691.556977169446},{"$f":"G54 * 1.2","v":18829.868372603334},null,"Av Crit Post Buffs/Miti",{"$f":"(K53 + K53) * CritBonus","v":18708.835967838542},{"$f":"K54 * 1.2","v":22450.603161406249}]
[null,null,null,null,null,"Av Crit",{"$f":"G54 + G54","v":31383.113954338893},{"$f":"G55 * 1.2","v":37659.736745206668},null,"Total Damage",{"$f":"(K54 * K49) + (K53 * K50)","v":309128.9388735856},{"$f":"(L54 * L49) + (L53 * L50)","v":74190.945329660535},null,"Holy Wrath","Normal","AW"]
[null,"Physical Damage",null,null,null,"Av Hit Post Buffs/Miti",{"$f":"G54 * ArmorMitigation * Communion * TotT * TVDamage * TwoHWeapSpec * BloodFrenzy","v":23036.251551405468},{"$f":"G56 * 1.2","v":27643.50186168656},null,"Dps",null,{"$f":"(K55 + L55)/Length * (1 + ICCBuff)","v":851.8219648961026},null,"Effective Cooldown",{"$f":"HWCooldown","v":26.998826301767853}]
[null,"Blood Frenzy / Savage Combat / Brittle Bones",null,{"$f":"IF(BF=\"On\",104%,100%)","v":1.04},null,"Av Crit Post Buffs/Miti",{"$f":"(G56 + G56) * CritBonus","v":47454.678195895263},{"$f":"G57 * 1.2","v":56945.613835074313},null,null,null,null,null,{"$f":"CONCATENATE(\"Total Attacks in \",Length,\" seconds\")","v":"Total Attacks in 450 seconds"},{"$f":"NumHW","v":13.889492669370055},{"$f":"NumAWHW","v":2.7778985338740108}]
[null,null,null,null,null,"Mastery",{"$f":"((G57 * G52) + (G56 * G53)) * MasteryDamageBonus * Inquisition * CoE","v":549472.43743160192},{"$f":"((H57 * H52) + (H56 * H53)) * MasteryDamageBonus * Inquisition * CoE","v":397573.4941162027},null,"Seals of Command","Normal","AW",null,{"$f":"CONCATENATE(\"Miss in \",Length,\" seconds\")","v":"Miss in 450 seconds"},{"$f":"O57 * SpellMiss","v":0},{"$f":"P57 * SpellMiss","v":0}]
[null,"Two Handed Weapon Spec",null,{"$f":"120%","v":1.2},null,"Total Damage",{"$f":"((G57 * G52) + (G56 * G53)) + G58","v":1699729.8833131455},{"$f":"((H57 * H52) + (H56 * H53)) + H58","v":1229847.9463706531},null,{"$f":"CONCATENATE(\"Procs in \",Length,\" seconds\")","v":"Procs in 450 seconds"},{"$f":"IF(SealSelection=\"SoT\",((5 * (TrinketReset +1)) + SUM(K49:K50)),SUM(K14:K15)) + IF(ExtraTargets<3,SUM(G23:G24),(SUM(G38:G39) * (ExtraTargets + 1))) + SUM(G7:G9) + SUM(G52:G53) + SUM(O8:O9) + SUM(O36:O37)","v":350.09417774338789},{"$f":"IF(SealSelection=\"SoT\",((5 * (TrinketReset +1)) + SUM(L49:L50)),SUM(L14:L15)) + IF(ExtraTargets<3,SUM(H23:H24),(SUM(H38:H39) * (ExtraTargets + 1))) + SUM(H7:H9) + SUM(H52:H53) + SUM(P8:P9) + SUM(P36:P37)","v":98.249377043587501},null,{"$f":"CONCATENATE(\"Full Resists in \",Length,\" seconds\")","v":"Full Resists in 450 seconds"},{"$f":"O57 * FullResist","v":6.9447463346850272E-2},{"$f":"P57 * FullResist","v":1.3889492669370054E-2}]
[null,null,null,null,null,"Dps",null,{"$f":"(G59+H59)/Length * (1 + ICCBuff)","v":6510.1729548528856},null,{"$f":"CONCATENATE(\"Avoidance in \",Length,\" seconds\")","v":"Avoidance in 450 seconds"},{"$f":"K59 * Avoidance","v":0},{"$f":"L59 * Avoidance","v":0},null,{"$f":"CONCATENATE(\"Crits in \",Length,\" seconds\")","v":"Crits in 450 seconds"},{"$f":"MIN((O57 * SpellCritChance),(O57 - SUM(O58:O59)))","v":1.6876507463010051},{"$f":"MIN((P57 * SpellCritChance),(P57 - SUM(P58:P59)))","v":0.33753014926020097}]
[null,"Attack Damage",null,null,null,null,null,null,null,{"$f":"CONCATENATE(\"Crits in \",Length,\" seconds\")","v":"Crits in 450 seconds"},{"$f":"MIN((K59 * (CritTotal% - CritReduction)),(K59 - K60))","v":34.822163468576136},{"$f":"MIN((L59 * (CritTotal% - CritReduction)),(L59 - L60))","v":9.7723872192050241},null,{"$f":"CONCATENATE(\"Hits in \",Length,\" seconds\")","v":"Hits in 450 seconds"},{"$f":"O57 - SUM(O58:O60)","v":12.1323944597222},{"$f":"P57 - SUM(P58:P60)","v":2.4264788919444396}]
[null,"Crusader Strike",null,{"$f":"100% * (100% + (CrusadeTalent * 10%) + IF(PvPGloveBonus > 0,5%,0%))","v":1.3},null,null,null,null,null,{"$f":"CONCATENATE(\"Hits in \",Length,\" seconds\")","v":"Hits in 450 seconds"},{"$f":"K59 - SUM(K60:K61)","v":315.27201427481174},{"$f":"L59 - SUM(L60:L61)","v":88.476989824382471},null,"Av Hit",{"$f":"HWBase + (HWAP * CharTotalAP) + (HWSP * CharSpelldamage)","v":5613.8367432457362},{"$f":"O62 * 1.2","v":6736.6040918948829}]
[null,"Exorcism",null,{"$f":"100% * ((10% * BLTalent) + (IF(AoWTalent>0,200%,100%)))","v":2.2000000000000002},null,null,null,null,null,"Av Hit",{"$f":"IF(SoCTalent=1,(7% * WeaponDamage),0)","v":467.40808017100477},{"$f":"K63 * 1.2","v":560.88969620520572},null,"Av Crit",{"$f":"O62 + (O62/2)","v":8420.7551148686034},{"$f":"O63 * 1.2","v":10104.906137842323}]
[null,"Judgement",null,{"$f":"100% * IF(GlyphOfJudgement=\"On\",110%,100%)","v":1},null,null,null,null,null,"Average Crit",{"$f":"K63 + K63","v":934.81616034200954},{"$f":"K64 * 1.2","v":1121.7793924104114},null,"Av Hit Post Buffs/Miti",{"$f":"O62 * Communion * TotT * Inquisition * CoE","v":8369.5905740580383},{"$f":"O64 * 1.2","v":10043.508688869646}]
[null,"Seals",null,{"$f":"100% * (100% + (SotPTalent * 6%))","v":1.1200000000000001},null,null,null,null,null,"Av Hit Post Buffs/Miti",{"$f":"K63 * Communion * TotT * TwoHWeapSpec * BloodFrenzy * Inquisition","v":805.25138522227837},{"$f":"K65 * 1.2","v":966.30166226673396},null,"Av Crit Post Buffs/Miti",{"$f":"(O64 + (O64/2)) * CritBonus","v":12931.01743691967},{"$f":"O65 * 1.2","v":15517.220924303603}]
[null,"Templar's Verdict",null,{"$f":"100% * ((100% + (CrusadeTalent * 10%)) + IF(GlyphOfTV=\"On\",15%,0%) + IF(T11Bonus>1, 10%,0%))","v":1.55},null,null,null,null,null,"Average Crit Post Buffs/Miti",{"$f":"(K65 + K65) * CritBonus","v":1658.8178535578934},{"$f":"K66 * 1.2","v":1990.5814242694719},null,"Total Damage",{"$f":"(O64 * O61) + (O65 * O60)","v":123366.21553869368},{"$f":"(P64 * P61) + (P65 * P60)","v":29607.891729286479}]
[null,null,null,null,null,null,null,null,null,"Total Damage",{"$f":"(K66 * K61) + (K65 * K62)","v":311636.85267779563},{"$f":"(L66 * L61) + (L65 * L62)","v":104948.19480897562},null,"Dps",null,{"$f":"(O66 + P66)/Length * (1 + ICCBuff)","v":339.94246059551148}]
[null,"Attack Crit Chance",null,null,null,null,null,null,null,"Dps",null,{"$f":"(K67+L67) / Length * (1 + ICCBuff)","v":925.74454997060275}]
[null,"Crusader Strike",null,{"$f":"(CritTotal% + IF(GlyphOfCS=\"On\",5%,0%)) - CritReduction + (MIN(RoLTalent,3) * 5%)","v":0.2494651316198126},null,null,null,null,null,null,null,null,null,"Guardian of Ancient Kings","Normal","AW"]
[null,"Hammer of Wrath",null,{"$f":"MIN(100%,(SpellCritChance + (SancWrath * 20%)))","v":0.72150557161981266},null,null,null,null,null,null,null,null,null,"Effective Cooldown"]
[null,"Judgement",null,{"$f":"CritTotal% - CritReduction + (AoLTalent * 6%)","v":0.21946513161981257},null,null,null,null,null,null,null,null,null,{"$f":"CONCATENATE(\"Total Attacks in \",Length,\" seconds\")","v":"Total Attacks in 450 seconds"}]
[null,"Templar's Verdict",null,{"$f":"CritTotal% - CritReduction + (AoLTalent * 6%)","v":0.21946513161981257},null,null,null,null,null,null,null,null,null,{"$f":"CONCATENATE(\"Miss in \",Length,\" seconds\")","v":"Miss in 450 seconds"},{"$f":"O71 * SpellMiss","v":0},{"$f":"P71 * SpellMiss","v":0}]
[null,null,null,null,null,null,null,null,null,null,null,null,null,{"$f":"CONCATENATE(\"Full Resists in \",Length,\" seconds\")","v":"Full Resists in 450 seconds"},{"$f":"O71 * FullResist","v":0},{"$f":"P71 * FullResist","v":0}]
[null,"Special Item Modifiers",null,null,null,null,null,null,null,null,null,null,null,{"$f":"CONCATENATE(\"Crits in \",Length,\" seconds\")","v":"Crits in 450 seconds"},{"$f":"(O71 - SUM(O72:O73)) * SpellCritChance","v":0},{"$f":"(P71 - SUM(P72:P73)) * SpellCritChance","v":0}]
[null,null,null,null,null,null,null,null,null,null,null,null,null,{"$f":"CONCATENATE(\"Hits in \",Length,\" seconds\")","v":"Hits in 450 seconds"},{"$f":"O71 - SUM(O72:O74)","v":0},{"$f":"P71 - SUM(P72:P74)","v":0}]
[null,"Special Items",null,null,null,null,null,null,null,null,null,null,null,"Av Hit",{"$f":"S25 + (T25 * CharTotalAP) + (U25 * CharSpelldamage)","v":0},{"$f":"O76 * 1.2","v":0}]
[null,null,null,null,null,null,null,null,null,null,null,null,null,"Av Crit",{"$f":"O76 + (O76/2)","v":0},{"$f":"O77 * 1.2","v":0}]
[null,null,null,null,null,null,null,null,null,null,null,null,null,"Av Hit Post Buffs/Miti",{"$f":"O76 * Communion * TotT * Inquisition * CoE","v":0},{"$f":"O78 * 1.2","v":0}]
[null,null,null,null,null,null,null,null,null,null,null,null,null,"Av Crit Post Buffs/Miti",{"$f":"O78 +((O78/2) * CritBonus)","v":0},{"$f":"O79 * 1.2","v":0}]
[null,null,null,null,null,null,null,null,null,null,null,null,null,"Total Damage",{"$f":"(O78 * O75) + (O79 * O74)","v":0},{"$f":"(P78 * P75) + (P79 * P74)","v":0}]
[null,null,null,null,null,null,null,null,null,null,null,null,null,"Dps",null,{"$f":"(O80 + P80)/Length * (1 + ICCBuff)","v":0}]

{"sheet":"WoL Compare","index":11,"n_rows":21,"n_cols":19,"rows_kept":21,"cut":false,"hidden":false,"merged":[[3,0,4,18],[6,3,6,5],[6,1,7,2],[6,0,7,0],[6,15,6,17],[6,12,6,14],[6,9,6,11],[6,6,6,8]]}
[null,null,null,null,"Length",{"$f":"CONCATENATE(ROUNDDOWN(Length/60,0),\":\",MOD(Length,60))","v":"7:30"}]
[]
[]
["     Damage Done"]
[]
[]
["Spell","Damage done",null,"Hits",null,null,"Crits",null,null,"Ticks",null,null,"Tick Crits",null,null,"Glances",null,null,"Misses"]
[null,null,null,"#","Avg","Total","#","Avg","Total","#","Avg","Total","#","Avg","Total","#","Avg","Total","Total"]
["Templar's Verdict",{"$f":"SUM(F9,I9)","v":1905280.1390744834},{"$f":"B9/$B$21","v":0.17476034389440839},{"$f":"SUM('DPS Calc'!G53:H53)","v":50.68332441612079},{"$f":"('DPS Calc'!G56 * (5/6)) + ('DPS Calc'!H56 / 6)","v":23804.126603118988},{"$f":"D9*E9","v":1206472.271068291},{"$f":"SUM('DPS Calc'!G52:H52)","v":14.250769458893213},{"$f":"('DPS Calc'!G57 * (5/6)) + ('DPS Calc'!H57 / 6)","v":49036.500802425107},{"$f":"G9*H9","v":698807.86800619226},null,null,null,null,null,null,null,null,null,{"$f":"SUM('DPS Calc'!G51:H51) / SUM(D9,G9,SUM('DPS Calc'!G51:H51))","v":0}]
["Hand of Light",{"$f":"SUM('DPS Calc'!G29:H29,'DPS Calc'!G58:H58)","v":1698338.267679808},{"$f":"B10/$B$21","v":0.15577876115001801},{"$f":"VLOOKUP(\"Templar's Verdict\",$A$9:$G$20,4,FALSE) + VLOOKUP(\"Templar's Verdict\",$A$9:$G$20,7,FALSE) + VLOOKUP(\"Crusader Strike\",$A$9:$G$20,4,FALSE) + VLOOKUP(\"Crusader Strike\",$A$9:$G$20,7,FALSE)","v":179.08096838704179},{"$f":"F10/D10","v":9483.6334814163256},{"$f":"B10","v":1698338.267679808}]
["Crusader Strike",{"$f":"SUM(F11,I11)","v":1572744.2266422126},{"$f":"B11/$B$21","v":0.14425874508903047},{"$f":"SUM('DPS Calc'!G24:H24)","v":85.671209437894547},{"$f":"('DPS Calc'!G27 * (5/6)) + ('DPS Calc'!H27 / 6)","v":10896.781429148417},{"$f":"D11*E11","v":933540.4440155339},{"$f":"SUM('DPS Calc'!G23:H23)","v":28.475665074133243},{"$f":"('DPS Calc'!G28 * (5/6)) + ('DPS Calc'!H28 / 6)","v":22447.369744045744},{"$f":"G11*H11","v":639203.7826266787},null,null,null,null,null,null,null,null,null,{"$f":"SUM('DPS Calc'!G22:H22) / SUM(D10,G10,SUM('DPS Calc'!G22:H22))","v":0}]
["Censure",{"$f":"SUM(L12,O12)","v":1193127.2822600454},{"$f":"B12/$B$21","v":0.10943867512252224},null,null,null,null,null,null,{"$f":"SUM('DPS Calc'!K38:L38)","v":180.04235167761806},{"$f":"('DPS Calc'!K39 * (5/6)) + ('DPS Calc'!L39 / 6)","v":5398.5880861757414},{"$f":"J12*K12","v":971974.49477385182},{"$f":"SUM('DPS Calc'!K37:L37)","v":19.885888748501522},{"$f":"('DPS Calc'!K40 * (5/6)) + ('DPS Calc'!L40 / 6)","v":11121.091457522027},{"$f":"M12*N12","v":221152.78748619367}]
["Seal of Truth",{"$f":"SUM(F13,I13)","v":1004894.9034766054},{"$f":"B13/$B$21","v":9.2173206085388426E-2},{"$f":"SUM('DPS Calc'!K27:L27)","v":394.74365541539231},{"$f":"('DPS Calc'!K30 * (5/6)) + ('DPS Calc'!L30 / 6)","v":2073.8320290186061},{"$f":"D13*E13","v":818632.03585232457},{"$f":"SUM('DPS Calc'!K26:L26)","v":43.599899371583028},{"$f":"('DPS Calc'!K31 * (5/6)) + ('DPS Calc'!L31 / 6)","v":4272.0939797783294},{"$f":"G13*H13","v":186262.86762428083}]
["Melee",{"$f":"SUM(F14,I14)","v":987148.40003913397},{"$f":"B14/$B$21","v":9.0545421813642252E-2},{"$f":"SUM('DPS Calc'!G9:H9)","v":115.29010426419393},{"$f":"('DPS Calc'!G13 * (5/6)) + ('DPS Calc'!H13 / 6)","v":6535.1068230937508},{"$f":"D14*E14","v":753433.14701212372},{"$f":"SUM('DPS Calc'!G7:H7)","v":17.360696526469585},{"$f":"('DPS Calc'!G14 * (5/6)) + ('DPS Calc'!H14 / 6)","v":13462.320055573127},{"$f":"G14*H14","v":233715.25302701021},null,null,null,null,null,null,{"$f":"SUM('DPS Calc'!G8:H8)","v":41.889726565472685},{"$f":"AVERAGE('DPS Calc'!G15:H15)","v":5217.5449635990426},{"$f":"P14*Q14","v":218561.53186822304},{"$f":"SUM('DPS Calc'!G6:H6) / SUM(D13,G13,SUM('DPS Calc'!G6:H6))","v":0}]
["Exorcism",{"$f":"SUM(F15,I15)","v":951910.77157875767},{"$f":"B15/$B$21","v":8.7313277657271551E-2},{"$f":"SUM('DPS Calc'!O37:P37)","v":28.575193126721},{"$f":"('DPS Calc'!O40 * (5/6)) + ('DPS Calc'!P40 / 6)","v":27419.628118244756},{"$f":"D15*E15","v":783521.1689417134},{"$f":"SUM('DPS Calc'!O36:P36)","v":3.974891037882581},{"$f":"('DPS Calc'!O41 * (5/6)) + ('DPS Calc'!P41 / 6)","v":42363.325442688147},{"$f":"G15*H15","v":168389.60263704424},{"$f":"SUM('DPS Calc'!O47:P47) * 3","v":82.353794635901991},{"$f":"(('DPS Calc'!O50 * (5/6)) + ('DPS Calc'!P50 / 6)) / 3","v":1827.9752078829836},{"$f":"J15*K15","v":150540.69486951549},{"$f":"SUM('DPS Calc'!O46:P46) * 3","v":11.390447758156323},{"$f":"(('DPS Calc'!O51 * (5/6)) + ('DPS Calc'!P51 / 6)) / 3","v":2769.3824399427208},{"$f":"M15*N15","v":31544.506004523053},null,null,null,{"$f":"SUM('DPS Calc'!O20:P21) / SUM(D14,G14,SUM('DPS Calc'!O20:P21))","v":5.473749839239957E-5}]
["Hammer of Wrath",{"$f":"SUM(F16,I16)","v":554733.57226079621},{"$f":"B16/$B$21","v":5.0882506918464493E-2},{"$f":"SUM('DPS Calc'!O9:P9)","v":5.2322382481117389},{"$f":"('DPS Calc'!O12 * (5/6)) + ('DPS Calc'!P12 / 6)","v":16477.188842881773},{"$f":"D16*E16","v":86212.577685086013},{"$f":"SUM('DPS Calc'!O8:P8)","v":13.803166193963989},{"$f":"('DPS Calc'!O13 * (5/6)) + ('DPS Calc'!P13 / 6)","v":33943.009016336451},{"$f":"G16*H16","v":468520.99457571015},null,null,null,null,null,null,null,null,null,{"$f":"SUM('DPS Calc'!O6:P7) / SUM(D15,G15,SUM('DPS Calc'!O6:P7))","v":2.9301005361330812E-3}]
["Seals of Command",{"$f":"SUM(F17,I17)","v":412396.80440811784},{"$f":"B17/$B$21","v":3.7826777218350184E-2},{"$f":"SUM('DPS Calc'!K62:L62)","v":403.74900409919422},{"$f":"('DPS Calc'!K65 * (5/6)) + ('DPS Calc'!L65 / 6)","v":832.09309806302099},{"$f":"D17*E17","v":335956.7596607579},{"$f":"SUM('DPS Calc'!K61:L61)","v":44.594550687781158},{"$f":"('DPS Calc'!K66 * (5/6)) + ('DPS Calc'!L66 / 6)","v":1714.1117820098232},{"$f":"G17*H17","v":76440.044747359949},null,null,null,null,null,null,null,null,null,{"$f":"SUM('DPS Calc'!K60:L60) / SUM(D16,G16,SUM('DPS Calc'!K60:L60))","v":0}]
["Judgement of Truth",{"$f":"SUM(F18,I18)","v":383319.8842032461},{"$f":"B18/$B$21","v":3.5159719251293402E-2},{"$f":"SUM('DPS Calc'!K50:L50)","v":25.864248644706741},{"$f":"('DPS Calc'!K53 * (5/6)) + ('DPS Calc'!L53 / 6)","v":9384.6911812782328},{"$f":"D18*E18","v":242727.98616636684},{"$f":"SUM('DPS Calc'!K49:L49)","v":7.2723217924113008},{"$f":"('DPS Calc'!K54 * (5/6)) + ('DPS Calc'!L54 / 6)","v":19332.463833433161},{"$f":"G18*H18","v":140591.89803687928},null,null,null,null,null,null,null,null,null,{"$f":"SUM('DPS Calc'!K48:L48) / SUM(D17,G17,SUM('DPS Calc'!K48:L48))","v":0}]
["Holy Wrath",{"$f":"SUM(F19,I19)","v":152974.10726798017},{"$f":"B19/$B$21","v":1.4031431412536875E-2},{"$f":"SUM('DPS Calc'!O61:P61)","v":14.558873351666639},{"$f":"('DPS Calc'!O64 * (5/6)) + ('DPS Calc'!P64 / 6)","v":8648.576926526639},{"$f":"D19*E19","v":125913.53614544765},{"$f":"SUM('DPS Calc'!O60:P60)","v":2.0251808955612063},{"$f":"('DPS Calc'!O65 * (5/6)) + ('DPS Calc'!P65 / 6)","v":13362.05135148366},{"$f":"G19*H19","v":27060.571122532507},null,null,null,null,null,null,null,null,null,{"$f":"SUM('DPS Calc'!O58:P59) / SUM(D18,G18,SUM('DPS Calc'!O58:P59))","v":2.5086450431660154E-3}]
["Consecration",{"$f":"SUM(F20,I20)","v":85376.948120048357},{"$f":"B20/$B$21","v":7.8311343870736821E-3},{"$f":"SUM('DPS Calc'!O23:P23)","v":71.010922719571198},{"$f":"('DPS Calc'!O26 * (5/6)) + ('DPS Calc'!P26 / 6)","v":990.60295632736484},{"$f":"D20*E20","v":70343.629977541263},{"$f":"SUM('DPS Calc'!O22:P22)","v":9.8226064668066524},{"$f":"('DPS Calc'!O27 * (5/6)) + ('DPS Calc'!P27 / 6)","v":1530.4815675257785},{"$f":"G20*H20","v":15033.318142507094},null,null,null,null,null,null,null,null,null,{"$f":"SUM('DPS Calc'!O20:P21) / SUM(D19,G19,SUM('DPS Calc'!O20:P21))","v":4.3766092042396082E-4}]
[null,{"$f":"SUM(B9:B20)","v":10902245.307011236},0.99999999999999989,1374.4597421106148,116546.2614891179,7055091.8242049953,185.17974750548595,201463.72757529936,2654026.2005461957,262.39614631352003,7226.5632940587248,1122515.1896433672,31.276336506657845,13890.473897464748,252697.29349071672,41.889726565472685,5217.5449635990426,218561.53186822304]

{"sheet":"Export","index":12,"n_rows":104,"n_cols":6,"rows_kept":104,"cut":false,"hidden":true,"merged":[]}
["Current","4.0.1",null,"25 Man (Alliance)",null,"Crusader Strike"]
["Sanctified Lightsworn Helmet (Heroic)",null,"On",null,"Off","Hammer of Wrath"]
["None",null,"Off","On","Off","Exorcism"]
["Arcanum of Torment",null,"Off","On","Off","Judgement"]
["21 agi & 3% Increased Crit Dmg",null,"On","On","Off","Holy Wrath"]
["Bold Cardinal Ruby (20 Str)",0,"On","On","Off","Consecration"]
["Bold Cardinal Ruby (20 Str)",0,"Off","On","On",0.19]
["Bonus:",3,"Off","On","Off","SoT"]
["Sanctified Lightsworn Shoulderplates",0,"Off","On","Off"]
["None",0,"On","On","Off"]
["Greater Inscription of the Axe",2,"Off",10,"Off"]
["Bold Cardinal Ruby (20 Str)",0,"On","On","Off"]
["Bold Cardinal Ruby (20 Str)",1,"On","Off","Off"]
["Bold Cardinal Ruby (20 Str)",3,null,"On","On"]
["Bonus:",2,null,"On","On"]
["Sanctified Lightsworn Battleplate (Heroic)",0,null,"On","Off"]
["Reforge: Haste to Hit",3,null,"On","Str"]
["Powerful Stats",2,null,"On"]
["Bold Cardinal Ruby (20 Str)",1,null,"On"]
["Nightmare Tear (+10 stats)",3,null,0]
["Bold Cardinal Ruby (20 Str)",2]
["Bonus:",1]
["Sanctified Lightsworn Legplates",1]
["Reforge: Expertise to Haste",1]
["Icescale Leg Armor/Nerubian Leg Reinf.",1]
["Bold Cardinal Ruby (20 Str)",3]
["Bold Cardinal Ruby (20 Str)",0]
["Bold Cardinal Ruby (20 Str)",1]
["Bonus:",2]
["Fleshrending Gauntlets (Heroic)",3]
["None",0]
["Crusher",1]
["Inscribed Ametrine (10 Str/10 Crit)"]
["Bold Cardinal Ruby (20 Str)"]
["Bold Cardinal Ruby (20 Str)"]
["Bonus:"]
["Blood-Soaked Saronite Stompers"]
["None"]
["Greater Assault (Boots)"]
["Bold Cardinal Ruby (20 Str)"]
["Bold Cardinal Ruby (20 Str)"]
["Bold Cardinal Ruby (20 Str)"]
["Bonus:"]
["Coldwraith Links (Heroic)"]
["None"]
["Inscribed Ametrine (10 Str/10 Crit)"]
["Bold Cardinal Ruby (20 Str)"]
["Bold Cardinal Ruby (20 Str)"]
["Bonus:"]
["Polar Bear Claw Bracers (Heroic)"]
["None"]
["Greater Assault (Bracer)"]
["Bold Cardinal Ruby (20 Str)"]
["Bold Cardinal Ruby (20 Str)"]
["Bold Cardinal Ruby (20 Str)"]
["Bonus:"]
["Winding Sheet (Heroic)"]
["None"]
["Major Agility (Cloak)"]
["Inscribed Ametrine (10 Str/10 Crit)"]
["Bold Cardinal Ruby (20 Str)"]
["Bold Cardinal Ruby (20 Str)"]
["Bonus:"]
["Penumbra Pendant"]
["None"]
["Inscribed Ametrine (10 Str/10 Crit)"]
["Bold Cardinal Ruby (20 Str)"]
["Bold Cardinal Ruby (20 Str)"]
["Bonus:"]
["Skeleton Lord's Circle (Heroic)"]
["None"]
["None"]
["Bold Cardinal Ruby (20 Str)"]
["Bold Cardinal Ruby (20 Str)"]
["Bold Cardinal Ruby (20 Str)"]
["Bonus:"]
["Ashen Band of Endless Might"]
["None"]
["None"]
["Bold Cardinal Ruby (20 Str)"]
["Bold Cardinal Ruby (20 Str)"]
["Bold Cardinal Ruby (20 Str)"]
["Bonus:"]
["Tiny Abomination in a Jar"]
["None"]
["Bold Cardinal Ruby (20 Str)"]
["Bold Cardinal Ruby (20 Str)"]
["Bold Cardinal Ruby (20 Str)"]
["Bonus:"]
["Death's Verdict"]
["None"]
["Bold Cardinal Ruby (20 Str)"]
["Bold Cardinal Ruby (20 Str)"]
["Bold Cardinal Ruby (20 Str)"]
["Bonus:"]
["Libram of Three Truths"]
["Bold Cardinal Ruby (20 Str)"]
["Shadowmourne"]
[]
["Berserking"]
["Bold Cardinal Ruby (20 Str)"]
["Bold Cardinal Ruby (20 Str)"]
["Bold Cardinal Ruby (20 Str)"]
["Bonus:"]

{"sheet":"Saved","index":13,"n_rows":113,"n_cols":29,"rows_kept":113,"cut":false,"hidden":true,"merged":[]}
["Current","T12","Heroic T12",null,null,null,null,null,null,null,null,null,null,null,null,null,null,null,null,null,null,null,null,null,null,null,"25 Man","Self-Buff (Might)","None"]
["Reinforced Sapphirium Helmet","Immolation Helmet","Immolation Helmet (Heroic)"]
["Reforge: Expertise to Mastery","Reforge: Hit to Mastery","Reforge: Hit to Mastery",null,null,null,null,null,null,null,null,null,null,null,null,null,null,null,null,null,null,null,null,null,null,null,"On","On","Off"]
["Arcanum of the Wildhammer","Arcanum of the Wildhammer","Arcanum of the Wildhammer",null,null,null,null,null,null,null,null,null,null,null,null,null,null,null,null,null,null,null,null,null,null,null,"On","Off","Off"]
["54 Str & 3% Increased Crit Dmg","54 Str & 3% Increased Crit Dmg","54 Str & 3% Increased Crit Dmg",null,null,null,null,null,null,null,null,null,null,null,null,null,null,null,null,null,null,null,null,null,null,null,"On","On","Off"]
["Skillful Ember Topaz (20 Str/20 Mastery)","Bold Chimera's Eye (67 Str)","Bold Chimera's Eye (67 Str)",null,null,null,null,null,null,null,null,null,null,null,null,null,null,null,null,null,null,null,null,null,null,null,"On","Off","Off"]
["Bold Chimera's Eye (67 Str)","Bold Chimera's Eye (67 Str)","Bold Chimera's Eye (67 Str)",null,null,null,null,null,null,null,null,null,null,null,null,null,null,null,null,null,null,null,null,null,null,null,"On","Off","Off"]
["Bonus:","Bonus:","Bonus:",null,null,null,null,null,null,null,null,null,null,null,null,null,null,null,null,null,null,null,null,null,null,null,"On","Off","Off"]
["Reinforced Sapphirium Pauldrons","Immolation Pauldrons","Immolation Pauldrons (Heroic)",null,null,null,null,null,null,null,null,null,null,null,null,null,null,null,null,null,null,null,null,null,null,null,"On","Off","Off"]
["Reforge: Haste to Mastery","Reforge: Haste to Hit","Reforge: Crit to Mastery",null,null,null,null,null,null,null,null,null,null,null,null,null,null,null,null,null,null,null,null,null,null,null,"On","Off","Off"]
["Greater Inscription of Jagged Stone","Greater Inscription of Jagged Stone","Greater Inscription of Jagged Stone",null,null,null,null,null,null,null,null,null,null,null,null,null,null,null,null,null,null,null,null,null,null,null,10,"Off","Off"]
["Bold Chimera's Eye (67 Str)","Skillful Ember Topaz (20 Str/20 Mastery)","Skillful Ember Topaz (20 Str/20 Mastery)",null,null,null,null,null,null,null,null,null,null,null,null,null,null,null,null,null,null,null,null,null,null,null,"On","Off","Off"]
["Bold Chimera's Eye (67 Str)","Bold Chimera's Eye (67 Str)","Bold Chimera's Eye (67 Str)",null,null,null,null,null,null,null,null,null,null,null,null,null,null,null,null,null,null,null,null,null,null,null,"On","Off","Off"]
["Bold Inferno Ruby (40 Str)","Bold Inferno Ruby (40 Str)","Bold Inferno Ruby (40 Str)",null,null,null,null,null,null,null,null,null,null,null,null,null,null,null,null,null,null,null,null,null,null,null,"On","Off","Off"]
["Bonus:","Bonus:","Bonus:",null,null,null,null,null,null,null,null,null,null,null,null,null,null,null,null,null,null,null,null,null,null,null,"On","Off","Off"]
["Immolation Battleplate","Immolation Battleplate","Immolation Battleplate (Heroic)",null,null,null,null,null,null,null,null,null,null,null,null,null,null,null,null,null,null,null,null,null,null,null,"On","Off","Off"]
["Reforge: Expertise to Mastery","Reforge: Expertise to Mastery","Reforge: Expertise to Mastery",null,null,null,null,null,null,null,null,null,null,null,null,null,null,null,null,null,null,null,null,null,null,null,"On","Off","Off"]
["Peerless Stats","Peerless Stats","Peerless Stats",null,null,null,null,null,null,null,null,null,null,null,null,null,null,null,null,null,null,null,null,null,null,null,"On","Off","Off"]
["Bold Inferno Ruby (40 Str)","Bold Inferno Ruby (40 Str)","Bold Inferno Ruby (40 Str)",null,null,null,null,null,null,null,null,null,null,null,null,null,null,null,null,null,null,null,null,null,null,null,"Off","Off","Off"]
["Etched Demonseye (20 Str/20 Hit)","Etched Demonseye (20 Str/20 Hit)","Etched Demonseye (20 Str/20 Hit)"]
["Bold Inferno Ruby (40 Str)","Bold Inferno Ruby (40 Str)","Bold Inferno Ruby (40 Str)"]
["Bonus:","Bonus:","Bonus:"]
["Immolation Legplates","Immolation Legplates","Lavawork Legplates (Heroic)"]
["Reforge: Crit to Hit","Reforge: Crit to Hit","Reforge: Hit to Haste"]
["Dragonscale Leg Armor","Dragonscale Leg Armor","Dragonscale Leg Armor"]
["Bold Inferno Ruby (40 Str)","Bold Inferno Ruby (40 Str)","Bold Inferno Ruby (40 Str)"]
["Skillful Ember Topaz (20 Str/20 Mastery)","Skillful Ember Topaz (20 Str/20 Mastery)","Skillful Ember Topaz (20 Str/20 Mastery)"]
["Bold Inferno Ruby (40 Str)","Bold Inferno Ruby (40 Str)","Bold Inferno Ruby (40 Str)"]
["Bonus:","Bonus:","Bonus:"]
["Fireskin Gauntlets","Fireskin Gauntlets","Immolation Gauntlets (Heroic)"]
["None","Reforge: Hit to Haste","Reforge: Hit to Haste"]
["Mighty Strength","Mighty Strength","Mighty Strength"]
["Bold Inferno Ruby (40 Str)","Bold Inferno Ruby (40 Str)","Etched Demonseye (20 Str/20 Hit)"]
["Bold Inferno Ruby (40 Str)","Bold Inferno Ruby (40 Str)","Bold Inferno Ruby (40 Str)"]
["Bold Inferno Ruby (40 Str)","Bold Inferno Ruby (40 Str)","Bold Inferno Ruby (40 Str)"]
["Bonus:","Bonus:","Bonus:"]
["None","None","None"]
["Arachnaflame Treads","Warboots of Mighty Lords","Arachnaflame Treads (Heroic)"]
["Reforge: Crit to Mastery","Reforge: Hit to Expertise","Reforge: Haste to Hit"]
["Mastery","Mastery","Mastery"]
["Bold Inferno Ruby (40 Str)","Bold Inferno Ruby (40 Str)","Bold Inferno Ruby (40 Str)"]
["Bold Inferno Ruby (40 Str)","Bold Inferno Ruby (40 Str)","Bold Inferno Ruby (40 Str)"]
["Bold Inferno Ruby (40 Str)","Bold Inferno Ruby (40 Str)","Bold Inferno Ruby (40 Str)"]
["Bonus:","Bonus:","Bonus:"]
["Cinch of the Flaming Ember","Cinch of the Flaming Ember","Cinch of the Flaming Ember"]
[]
["Reforge: Crit to Mastery","Reforge: Hit to Mastery","Reforge: Crit to Mastery"]
["Etched Demonseye (20 Str/20 Hit)","Etched Demonseye (20 Str/20 Hit)","Etched Demonseye (20 Str/20 Hit)"]
["Bold Inferno Ruby (40 Str)","Bold Inferno Ruby (40 Str)","Bold Inferno Ruby (40 Str)"]
["Bold Inferno Ruby (40 Str)","Bold Inferno Ruby (40 Str)","Bold Inferno Ruby (40 Str)"]
["Bonus:","Bonus:","Bonus:"]
["Earthcrack Bracers","Gigantiform Bracers","Gigantiform Bracers (Heroic)"]
["Reforge: Crit to Mastery","Reforge: Hit to Haste","Reforge: Hit to Haste"]
["Major Strength","Major Strength","Major Strength"]
["Bold Inferno Ruby (40 Str)","Bold Inferno Ruby (40 Str)","Bold Inferno Ruby (40 Str)"]
["Bold Inferno Ruby (40 Str)","Bold Inferno Ruby (40 Str)","Bold Inferno Ruby (40 Str)"]
["Bold Inferno Ruby (40 Str)","Bold Inferno Ruby (40 Str)","Bold Inferno Ruby (40 Str)"]
["Bonus:","Bonus:","Bonus:"]
["Bladed Flamewrath Cover","Bladed Flamewrath Cover","Bladed Flamewrath Cover"]
["Reforge: Expertise to Mastery","Reforge: Expertise to Mastery","Reforge: Expertise to Mastery"]
["Critical Strike","Greater Critical Strike","Greater Critical Strike"]
["Bold Inferno Ruby (40 Str)","Bold Inferno Ruby (40 Str)","Bold Inferno Ruby (40 Str)"]
["Bold Inferno Ruby (40 Str)","Bold Inferno Ruby (40 Str)","Bold Inferno Ruby (40 Str)"]
["Bold Inferno Ruby (40 Str)","Bold Inferno Ruby (40 Str)","Bold Inferno Ruby (40 Str)"]
["Gift of Nadun","Necklace of Fetishes","Necklace of Fetishes (Heroic)"]
["Reforge: Crit to Mastery","Reforge: Hit to Mastery","Reforge: Hit to Mastery"]
["Bold Inferno Ruby (40 Str)","Bold Inferno Ruby (40 Str)","Bold Inferno Ruby (40 Str)"]
["Bold Inferno Ruby (40 Str)","Bold Inferno Ruby (40 Str)","Bold Inferno Ruby (40 Str)"]
["Bold Inferno Ruby (40 Str)","Bold Inferno Ruby (40 Str)","Bold Inferno Ruby (40 Str)"]
["Bonus:","Bonus:","Bonus:"]
["Serrated Brimstone Signet","Alysrazor's Band","Alysrazor's Band (Heroic)"]
["Reforge: Crit to Hit","Reforge: Expertise to Hit","Reforge: Expertise to Mastery"]
["None","None","None"]
["Bold Inferno Ruby (40 Str)","Bold Inferno Ruby (40 Str)","Bold Inferno Ruby (40 Str)"]
["Bold Inferno Ruby (40 Str)","Bold Inferno Ruby (40 Str)","Bold Inferno Ruby (40 Str)"]
["Bold Inferno Ruby (40 Str)","Bold Inferno Ruby (40 Str)","Bold Inferno Ruby (40 Str)"]
["Bonus:","Bonus:","Bonus:"]
["Alysrazor's Band","Obsidian Signet of the Avengers","Obsidian Signet of the Avengers"]
["Reforge: Expertise to Hit","Reforge: Crit to Mastery","Reforge: Hit to Mastery"]
["None","None","None"]
["Bold Inferno Ruby (40 Str)","Bold Inferno Ruby (40 Str)","Bold Inferno Ruby (40 Str)"]
["Bold Inferno Ruby (40 Str)","Bold Inferno Ruby (40 Str)","Bold Inferno Ruby (40 Str)"]
["Bold Inferno Ruby (40 Str)","Bold Inferno Ruby (40 Str)","Bold Inferno Ruby (40 Str)"]
["Bonus:","Bonus:","Bonus:"]
["Essence of the Eternal Flame","Essence of the Eternal Flame","Apparatus of Khaz'goroth (Heroic)"]
["Reforge: Mastery to Hit","Reforge: Hit to Haste","None"]
["None","None","None"]
["Bold Inferno Ruby (40 Str)","Bold Inferno Ruby (40 Str)","Bold Inferno Ruby (40 Str)"]
["Bold Inferno Ruby (40 Str)","Bold Inferno Ruby (40 Str)","Bold Inferno Ruby (40 Str)"]
["Bold Inferno Ruby (40 Str)","Bold Inferno Ruby (40 Str)","Bold Inferno Ruby (40 Str)"]
["Bonus:","Bonus:","Bonus:"]
["Darkmoon Card: Hurricane","Vessel of Acceleration","Vessel of Acceleration (Heroic)"]
["None","None","None"]
["None","None","None"]
["Bold Inferno Ruby (40 Str)","Bold Inferno Ruby (40 Str)","Bold Inferno Ruby (40 Str)"]
["Bold Inferno Ruby (40 Str)","Bold Inferno Ruby (40 Str)","Bold Inferno Ruby (40 Str)"]
["Bold Inferno Ruby (40 Str)","Bold Inferno Ruby (40 Str)","Bold Inferno Ruby (40 Str)"]
["Bonus:","Bonus:","Bonus:"]
["Relic of the Elemental Lords","Relic of the Elemental Lords","Relic of the Elemental Lords (Heroic)"]
["Reforge: Crit to Hit","Reforge: Crit to Mastery","Reforge: Crit to Expertise"]
["None","None","None"]
["Bold Inferno Ruby (40 Str)","Bold Inferno Ruby (40 Str)","Bold Inferno Ruby (40 Str)"]
["None","None","None"]
["None","None","None"]
["Zoid's Firelit Greatsword","Sulfuras- The Extinguished Hand","Sulfuras- The Extinguished Hand (Heroic)"]
["Reforge: Crit to Mastery","Reforge: Crit to Haste","Reforge: Crit to Haste"]
["Landslide","Landslide","Landslide"]
["Etched Demonseye (20 Str/20 Hit)","Bold Inferno Ruby (40 Str)","Bold Inferno Ruby (40 Str)"]
["Bold Inferno Ruby (40 Str)","Bold Inferno Ruby (40 Str)","Bold Inferno Ruby (40 Str)"]
["Bold Inferno Ruby (40 Str)","Bold Inferno Ruby (40 Str)","Bold Inferno Ruby (40 Str)"]
["Bonus:","Bonus:","Bonus:"]
["Bold Inferno Ruby (40 Str)"]
["Bonus:"]

{"sheet":"Probability","index":14,"n_rows":93,"n_cols":16,"rows_kept":93,"cut":false,"hidden":true,"merged":[[90,0,90,1],[91,0,91,1],[92,0,92,1],[85,0,85,1],[86,0,86,1],[87,0,87,1],[88,0,88,1],[89,0,89,1],[8,10,8,11],[9,10,9,11],[0,10,0,15],[83,0,83,5],[84,0,84,1],[3,10,3,11],[4,10,4,11],[5,10,5,11],[6,10,6,11],[7,10,7,11],[0,5,0,8],[0,0,0,2],[1,10,1,11],[2,10,2,11]]}
["Base Information",null,null,null,null,"Templar's Verdict Calculations",null,null,null,null,"Ability Usage"]
["Ability","Minimum Cooldowns","GCD",null,null,"Ability","#","Divine Purpose","Totals",null,"Ability",null,"Total Usage","In AW","Outside AW","Effective CD"]
["Consecration",{"$f":"IF(Fillers=2,(30 * IF(GlyphOfConsecration=\"On\",1.2,1)),CEILING((30 * IF(GlyphOfConsecration=\"On\",1.2,1)),CSCD))","v":30},{"$f":"SpellGCD","v":1.1254037924829599},null,null,"Crusader Strike",{"$f":"VLOOKUP(F3,$A$17:$L$66,12,FALSE)","v":114.14687451202778},"N/A",{"$f":"(G3 * IF(T12Bonus>3,(35/120),(20/120))) + ((G3 * (1 - IF(T12Bonus>3,(35/120),(20/120)))) / 3)","v":50.731944227567901},null,"Consecration",null,{"$f":"VLOOKUP(K3,$A$17:$L$66,12,FALSE)","v":8.0840790556842137},{"$f":"M3 / 6","v":1.3473465092807022},{"$f":"M3 * 5 / 6","v":6.7367325464035117},{"$f":"Length / SUM(N3:O3)","v":55.664967759511015}]
["Crusader Strike",{"$f":"CSCD","v":3.3762113774488793},1.5,null,null,"Exorcism",{"$f":"VLOOKUP(F4,$A$17:$L$66,12,FALSE)","v":32.713652426737269},{"$f":"IF(DivPurpTalent=1,7%,IF(DivPurpTalent=2,15%,0))","v":0.15},{"$f":"G4*H4","v":4.9070478640105906},null,"Crusader Strike",null,114.14687451202778,{"$f":"M4 / 6","v":19.024479085337962},{"$f":"M4 * 5 / 6","v":95.12239542668982},3.9422892823279452]
["Exorcism",{"$f":"IF(Fillers=2,(HastedWeaponspeed / 0.2),CEILING((HastedWeaponspeed / 0.2),CSCD))","v":12.8909888957139},{"$f":"SpellGCD","v":1.1254037924829599},null,null,"Hammer of Wrath",{"$f":"VLOOKUP(F5,$A$17:$L$66,12,FALSE)","v":19.131059740779627},0.15,{"$f":"G5*H5","v":2.8696589611169441},null,"Exorcism",null,32.713652426737269,{"$f":"M5 / 6","v":5.4522754044562118},{"$f":"M5 * 5 / 6","v":27.261377022281057},13.755724800456994]
["Hammer of Wrath",{"$f":"IF(Fillers=2,(Length / (((HoWPercent * Length) / 6) + (((1 - HoWPercent) * Length) * (IF(VLOOKUP(\"Templar's Verdict\",A17:D66,4,FALSE)<VLOOKUP(\"Exorcism\",A17:D66,4,FALSE),2,3) / 20) * (1 / 6)))),CEILING((Length / (((HoWPercent * Length) / 6) + (((1 - HoWPercent) * Length) * (IF(VLOOKUP(\"Templar's Verdict\",A17:D66,4,FALSE)<VLOOKUP(\"Exorcism\",A17:D66,4,FALSE),2,3) / 20) * (1 / 6)))),CSCD))","v":19.261637239165331},1.5,null,null,"Holy Wrath",16.667391203244065,0.15,2.5001086804866097,null,"Hammer of Wrath",null,19.131059740779627,{"$f":"((HoWPercent / 6) + ((1 - HoWPercent) / 6)) / (HoWPercent + ((1 - HoWPercent) / 6)) * M6","v":9.8107998670664767},{"$f":"(1 - ((HoWPercent / 6) + ((1 - HoWPercent) / 6)) / (HoWPercent + ((1 - HoWPercent) / 6))) * M6","v":9.3202598737131499},23.52195885107103]
["Holy Wrath",{"$f":"IF(Fillers=2,15,CEILING(15,CSCD))","v":15},{"$f":"SpellGCD","v":1.1254037924829599},null,null,{"$f":"IF(InqRefresh=\"Unused\",\"Unused\",\"Inquisition\")","v":"Inquisition"},12.688547652926875,0.15,1.9032821479390312,null,"Holy Wrath",null,16.667391203244065,{"$f":"M7 / 6","v":2.7778985338740108},{"$f":"M7 * 5 / 6","v":13.889492669370055},26.998826301767853]
[{"$f":"IF(SealSelection=\"SoT\",\"Judgement of Truth\",\"Judgement of Righteousness\")","v":"Judgement of Truth"},{"$f":"IF(Fillers=2,(8 - IF(PvPBonus>3,1,0)),CEILING((8 - IF(PvPBonus>3,1,0)),CSCD))","v":8},1.5,null,null,{"$f":"IF(SealSelection=\"SoT\",\"Judgement of Truth\", \"Judgement of Righteousness\")","v":"Judgement of Truth"},33.136570437118039,0.15,4.9704855655677056,null,{"$f":"IF(SealSelection=\"SoT\",\"Judgement of Truth\", \"Judgement of Righteousness\")","v":"Judgement of Truth"},null,33.136570437118039,{"$f":"M8 / 6","v":5.5227617395196731},{"$f":"M8 * 5 / 6","v":27.613808697598369},13.580162161136959]
["Inquisition",{"$f":"IF(T11Bonus>3,IF(Fillers=2,(IF(InqRefresh=\"Unused\",0,(24 - AVERAGE(InqRefresh,(InqRefresh - TVMinCD))))),IF(CEILING((IF(InqRefresh=\"Unused\",0,(24 - AVERAGE(InqRefresh,(InqRefresh - TVMinCD))))),CSCD)>24,(CEILING((IF(InqRefresh=\"Unused\",0,(24 - AVERAGE(InqRefresh,(InqRefresh - TVMinCD))))),CSCD) - CSCD),CEILING((IF(InqRefresh=\"Unused\",0,(24 - AVERAGE(InqRefresh,(InqRefresh - TVMinCD))))),CSCD))),IF(Fillers=2,(IF(InqRefresh=\"Unused\",0,(36 - AVERAGE(InqRefresh,(InqRefresh - TVMinCD))))),IF(CEILING((IF(InqRefresh=\"Unused\",0,(36 - AVERAGE(InqRefresh,(InqRefresh - TVMinCD))))),CSCD)>36,(CEILING((IF(InqRefresh=\"Unused\",0,(36 - AVERAGE(InqRefresh,(InqRefresh - TVMinCD))))),CSCD) - CSCD),CEILING((IF(InqRefresh=\"Unused\",0,(36 - AVERAGE(InqRefresh,(InqRefresh - TVMinCD))))),CSCD))))","v":35.465051817510272},{"$f":"SpellGCD","v":1.1254037924829599},null,null,"Templar's Verdict",64.934093875014,0.15,9.7401140812521003,null,{"$f":"IF(InqRefresh=\"Unused\",\"Unused\",\"Inquisition\")","v":"Inquisition"},null,12.688547652926875,{"$f":"M9 / 6","v":2.1147579421544793},{"$f":"M9 * 5 / 6","v":10.573789710772395},{"$f":"IF(InqRefresh=\"Unused\",0,(Length / SUM(N9:O9)))","v":35.465051817510272}]
["Templar's Verdict",{"$f":"IF(Fillers=2,I11,CEILING(I11,CSCD))","v":6.9301036350205463},1.5,null,null,null,null,"Total",{"$f":"SUM(I3:I9) - IF(T11Bonus>3,(G7/2),G7)","v":64.934093875014014},null,"Templar's Verdict",null,{"$f":"IF(CircRef=\"Off\",6.5,SUM(N10:O10))","v":64.934093875014},{"$f":"IF(CircRef=\"Off\",5,IF(AWZeal=\"Together\",(N4 + (0.15 * SUM(N5:N10)) - IF(T11Bonus>3,(N9/2),N9)),((N4 / 3) + (0.15 * SUM(N5:N10)) - IF(T11Bonus>3,(N9/2),N9))))","v":24.425288430875423},{"$f":"IF(CircRef=\"Off\",5,IF(AWZeal=\"Together\",((IF(T12Bonus>3,((O4 * 15/120) + (O4 * (1  -15/120) / 3)),(O4/3))) + (0.15 * SUM(O5:O10)) - IF(T11Bonus>3,(O9/2),O9)),((O4 * (IF(T12Bonus>3,35,20)/100)) + (O4 * (IF(T12Bonus>3,65,80)/100) / 3) + (0.15 * SUM(O5:O10)) - IF(T11Bonus>3,(O9/2),O9))))","v":40.508805444138581},6.930103635020548]
[null,null,null,null,null,null,null,"Average CD",{"$f":"Length / I10","v":6.9301036350205463}]
["Timeslice",0.01]
["Circular References","On"]
[]
[]
[null,null,null,null,null,"Ability per Timeslice","Chance happens * timeslices in GCD","Total chance * new ability's chance","Length / Timeslice / Timeslice","Timeslices Lost","Remaining Timeslice","#","Adjusted Ability per Timeslice"]
[{"$f":"IF(InqRefresh=\"Unused\",\"Unused\",\"Inquisition\")","v":"Inquisition"},null,{"$f":"IF(InqRefresh=\"Unused\",0,VLOOKUP(A17,Probability!A3:C10,3,FALSE))","v":1.1254037924829599},1,null,{"$f":"IF(InqRefresh=\"Unused\",0,(1/VLOOKUP(A17,$A$3:$B$10,2,FALSE)) * TimeSlice)","v":2.8196772562059724E-4},{"$f":"IF(InqRefresh=\"Unused\",0,(M18 * ((IF(Fillers=1,CSCD,C18) / TimeSlice) - TimeSlice)))","v":0.38046421573464551},null,null,null,{"$f":"(Length / TimeSlice)","v":45000},{"$f":"IF(CircRef=\"Off\",6,(K17*F17))","v":12.688547652926875},{"$f":"IF(InqRefresh=\"Unused\",0,(1/VLOOKUP(A17,$A$3:$B$10,2,FALSE)) * TimeSlice)","v":2.8196772562059724E-4}]
[{"$f":"IF(AND(SealSelection=\"SoR\",Ability1=\"Judgement of Truth\"),\"Judgement of Righteousness\",Ability1)","v":"Crusader Strike"},{"$f":"IF(InqRefresh=\"Unused\",\"Unused\",\"Inquisition\")","v":"Inquisition"},{"$f":"VLOOKUP(A18,Probability!$A$3:$C$10,3,FALSE)","v":1.5},2,1,{"$f":"(1/VLOOKUP(A18,$A$3:$B$10,2,FALSE)) * TimeSlice","v":2.9618998581647351E-3},{"$f":"IF(InqRefresh=\"Unused\",0,(M17 * ((IF(Fillers=1,CSCD,C17) / TimeSlice) - TimeSlice)))","v":3.172993509986527E-2},{"$f":"$M$18*G18","v":8.0486064891535696E-5},{"$f":"Length / TimeSlice / TimeSlice","v":4500000},{"$f":"H18*I18","v":362.18729201191064},{"$f":"IF(A18=\"Exorcism\",((Length / TimeSlice) - SUM(J18:J24)),(K17 - SUM(J18:J24)))","v":38538.397642773765},{"$f":"IF(A18=\"Templar's Verdict\",$M$10,IF(CircRef=\"Off\",6,(K18*F18)))","v":114.14687451202778},{"$f":"TimeSlice / (Length / L18)","v":2.5365972113783951E-3}]
["Crusader Strike",{"$f":"IF(AND(SealSelection=\"SoR\",Ability2=\"Judgement of Truth\"),\"Judgement of Righteousness\",Ability2)","v":"Hammer of Wrath"},{"$f":"VLOOKUP(A19,Probability!$A$3:$C$10,3,FALSE)","v":1.5},2,3,2.9618998581647351E-3,{"$f":"(VLOOKUP(B19,$A$17:$M$66,13,FALSE) * ((IF(Fillers=1,CSCD,VLOOKUP(B19,$A$17:$C$66,3,FALSE)) / TimeSlice) - TimeSlice))","v":6.3765947789323041E-2},{"$f":"$M$18*G19","v":1.6174852534329715E-4},4500000,{"$f":"H19*I19","v":727.86836404483722}]
["Crusader Strike",{"$f":"IF(AND(SealSelection=\"SoR\",Ability3=\"Judgement of Truth\"),\"Judgement of Righteousness\",Ability3)","v":"Exorcism"},{"$f":"VLOOKUP(A20,Probability!$A$3:$C$10,3,FALSE)","v":1.5},2,4,2.9618998581647351E-3,{"$f":"(VLOOKUP(B20,$A$17:$M$66,13,FALSE) * (IF(Fillers=1,CSCD,(VLOOKUP(B20,$A$17:$C$66,3,FALSE)) / TimeSlice) - TimeSlice))","v":8.1806215870615179E-2},2.0750941905082148E-4,4500000,933.79238572869667]
["Crusader Strike",{"$f":"IF(AND(SealSelection=\"SoR\",Ability4=\"Judgement of Truth\"),\"Judgement of Righteousness\",Ability4)","v":"Templar's Verdict"},{"$f":"VLOOKUP(A21,Probability!$A$3:$C$10,3,FALSE)","v":1.5},2,5,2.9618998581647351E-3,{"$f":"(VLOOKUP(B21,$A$17:$M$66,13,FALSE) * (IF(Fillers=1,CSCD,(VLOOKUP(B21,$A$17:$C$66,3,FALSE)) / TimeSlice) - TimeSlice))","v":0.21643254978474114},5.4900220223549001E-4,4500000,2470.5099100597049]
["Crusader Strike",{"$f":"IF(AND(SealSelection=\"SoR\",Ability5=\"Judgement of Truth\"),\"Judgement of Righteousness\",Ability5)","v":"Judgement of Truth"},{"$f":"VLOOKUP(A22,Probability!$A$3:$C$10,3,FALSE)","v":1.5},2,6,2.9618998581647351E-3,{"$f":"(VLOOKUP(B22,$A$17:$M$66,13,FALSE) * (IF(Fillers=1,CSCD,(VLOOKUP(B22,$A$17:$C$66,3,FALSE)) / TimeSlice) - TimeSlice))","v":0.11044787110807412},2.8016176185542121E-4,4500000,1260.7279283493954]
["Crusader Strike",{"$f":"IF(AND(SealSelection=\"SoR\",Ability6=\"Judgement of Truth\"),\"Judgement of Righteousness\",Ability6)","v":"Holy Wrath"},{"$f":"VLOOKUP(A23,Probability!$A$3:$C$10,3,FALSE)","v":1.5},2,7,2.9618998581647351E-3,{"$f":"(VLOOKUP(B23,$A$17:$M$66,13,FALSE) * (IF(Fillers=1,CSCD,(VLOOKUP(B23,$A$17:$C$66,3,FALSE)) / TimeSlice) - TimeSlice))","v":4.1679730070683707E-2},1.0572468706830053E-4,4500000,475.76109180735239]
["Crusader Strike",{"$f":"IF(AND(SealSelection=\"SoR\",Ability7=\"Judgement of Truth\"),\"Judgement of Righteousness\",Ability7)","v":"Consecration"},{"$f":"VLOOKUP(A24,Probability!$A$3:$C$10,3,FALSE)","v":1.5},2,8,2.9618998581647351E-3,{"$f":"(VLOOKUP(B24,$A$17:$M$66,13,FALSE) * (IF(Fillers=1,CSCD,(VLOOKUP(B24,$A$17:$C$66,3,FALSE)) / TimeSlice) - TimeSlice))","v":2.0215655155763353E-2},5.1278974494296597E-5,4500000,230.75538522433467]
[{"$f":"IF(AND(SealSelection=\"SoR\",Ability2=\"Judgement of Truth\"),\"Judgement of Righteousness\",Ability2)","v":"Hammer of Wrath"},{"$f":"IF(InqRefresh=\"Unused\",\"Unused\",\"Inquisition\")","v":"Inquisition"},{"$f":"VLOOKUP(A25,Probability!$A$3:$C$10,3,FALSE)","v":1.5},3,1,5.1916666666666658E-4,{"$f":"IF(InqRefresh=\"Unused\",0,(M17 * ((IF(Fillers=1,CSCD,C17) / TimeSlice) - TimeSlice)))","v":3.172993509986527E-2},{"$f":"$M$25*G25","v":1.3489495199257397E-5},4500000,60.702728396658287,{"$f":"IF(A25=\"Exorcism\",((Length / TimeSlice) - SUM(J25:J31)),(K17 - SUM(J18:J31)))","v":36849.55327276975},{"$f":"IF(A25=\"Templar's Verdict\",$M$10,IF(CircRef=\"Off\",6,(K25*F25)))","v":19.131059740779627},{"$f":"TimeSlice / (Length / L25)","v":4.2513466090621395E-4}]
["Hammer of Wrath",{"$f":"IF(AND(SealSelection=\"SoR\",Ability1=\"Judgement of Truth\"),\"Judgement of Righteousness\",Ability1)","v":"Crusader Strike"},{"$f":"VLOOKUP(A26,Probability!$A$3:$C$10,3,FALSE)","v":1.5},3,2,5.1916666666666658E-4,{"$f":"(VLOOKUP(B26,$A$17:$M$66,13,FALSE) * (IF(Fillers=1,CSCD,(VLOOKUP(B26,$A$17:$C$66,3,FALSE)) / TimeSlice) - TimeSlice))","v":0.38046421573464551},1.6174852534329715E-4,4500000,727.86836404483722]
["Hammer of Wrath",{"$f":"IF(AND(SealSelection=\"SoR\",Ability3=\"Judgement of Truth\"),\"Judgement of Righteousness\",Ability3)","v":"Exorcism"},{"$f":"VLOOKUP(A27,Probability!$A$3:$C$10,3,FALSE)","v":1.5},3,4,5.1916666666666658E-4,8.1806215870615179E-2,3.4778657844174525E-5,4500000,156.50396029878536]
["Hammer of Wrath",{"$f":"IF(AND(SealSelection=\"SoR\",Ability4=\"Judgement of Truth\"),\"Judgement of Righteousness\",Ability4)","v":"Templar's Verdict"},{"$f":"VLOOKUP(A28,Probability!$A$3:$C$10,3,FALSE)","v":1.5},3,5,5.1916666666666658E-4,0.21643254978474114,9.2012978661803194E-5,4500000,414.05840397811437]
["Hammer of Wrath",{"$f":"IF(AND(SealSelection=\"SoR\",Ability5=\"Judgement of Truth\"),\"Judgement of Righteousness\",Ability5)","v":"Judgement of Truth"},{"$f":"VLOOKUP(A29,Probability!$A$3:$C$10,3,FALSE)","v":1.5},3,6,5.1916666666666658E-4,0.11044787110807412,4.6955218231344318E-5,4500000,211.29848204104943]
["Hammer of Wrath",{"$f":"IF(AND(SealSelection=\"SoR\",Ability6=\"Judgement of Truth\"),\"Judgement of Righteousness\",Ability6)","v":"Holy Wrath"},{"$f":"VLOOKUP(A30,Probability!$A$3:$C$10,3,FALSE)","v":1.5},3,7,5.1916666666666658E-4,4.1679730070683707E-2,1.7719497910262646E-5,4500000,79.737740596181908]
["Hammer of Wrath",{"$f":"IF(AND(SealSelection=\"SoR\",Ability7=\"Judgement of Truth\"),\"Judgement of Righteousness\",Ability7)","v":"Consecration"},{"$f":"VLOOKUP(A31,Probability!$A$3:$C$10,3,FALSE)","v":1.5},3,8,5.1916666666666658E-4,2.0215655155763353E-2,8.5943756996424079E-6,4500000,38.674690648390836]
[{"$f":"IF(AND(SealSelection=\"SoR\",Ability3=\"Judgement of Truth\"),\"Judgement of Righteousness\",Ability3)","v":"Exorcism"},{"$f":"IF(InqRefresh=\"Unused\",\"Unused\",\"Inquisition\")","v":"Inquisition"},{"$f":"VLOOKUP(A32,Probability!$A$3:$C$10,3,FALSE)","v":1.1254037924829599},4,1,7.7573567713838318E-4,{"$f":"IF(InqRefresh=\"Unused\",0,(M17 * ((IF(Fillers=1,CSCD,C17) / TimeSlice) - TimeSlice)))","v":3.172993509986527E-2},{"$f":"$M$32*G32","v":2.3066712630664967E-5},4500000,103.80020683799235,{"$f":"IF(A32=\"Exorcism\",((Length / TimeSlice) - SUM(J32:J38)),(K17 - SUM(J18:J38)))","v":42171.133017131418},{"$f":"IF(A32=\"Templar's Verdict\",$M$10,IF(CircRef=\"Off\",6,(K32*F32)))","v":32.713652426737269},{"$f":"TimeSlice / (Length / L32)","v":7.2697005392749492E-4}]
["Exorcism",{"$f":"IF(AND(SealSelection=\"SoR\",Ability1=\"Judgement of Truth\"),\"Judgement of Righteousness\",Ability1)","v":"Crusader Strike"},{"$f":"VLOOKUP(A33,Probability!$A$3:$C$10,3,FALSE)","v":1.1254037924829599},4,2,7.7573567713838318E-4,{"$f":"(VLOOKUP(B33,$A$17:$M$66,13,FALSE) * (IF(Fillers=1,CSCD,(VLOOKUP(B33,$A$17:$C$66,3,FALSE)) / TimeSlice) - TimeSlice))","v":0.38046421573464551},2.7658609143009732E-4,4500000,1244.637411435438]
["Exorcism",{"$f":"IF(AND(SealSelection=\"SoR\",Ability2=\"Judgement of Truth\"),\"Judgement of Righteousness\",Ability2)","v":"Hammer of Wrath"},{"$f":"VLOOKUP(A34,Probability!$A$3:$C$10,3,FALSE)","v":1.1254037924829599},4,3,7.7573567713838318E-4,6.3765947789323041E-2,4.6355934503141996E-5,4500000,208.60170526413899]
["Exorcism",{"$f":"IF(AND(SealSelection=\"SoR\",Ability4=\"Judgement of Truth\"),\"Judgement of Righteousness\",Ability4)","v":"Templar's Verdict"},{"$f":"VLOOKUP(A35,Probability!$A$3:$C$10,3,FALSE)","v":1.1254037924829599},4,5,7.7573567713838318E-4,0.21643254978474114,1.5733998238867848E-4,4500000,708.02992074905319]
["Exorcism",{"$f":"IF(AND(SealSelection=\"SoR\",Ability5=\"Judgement of Truth\"),\"Judgement of Righteousness\",Ability5)","v":"Judgement of Truth"},{"$f":"VLOOKUP(A36,Probability!$A$3:$C$10,3,FALSE)","v":1.1254037924829599},4,6,7.7573567713838318E-4,0.11044787110807412,8.029229481561365E-5,4500000,361.31532667026141]
["Exorcism",{"$f":"IF(AND(SealSelection=\"SoR\",Ability6=\"Judgement of Truth\"),\"Judgement of Righteousness\",Ability6)","v":"Holy Wrath"},{"$f":"VLOOKUP(A37,Probability!$A$3:$C$10,3,FALSE)","v":1.1254037924829599},4,7,7.7573567713838318E-4,4.1679730070683707E-2,3.0299915617168367E-5,4500000,136.34962027725766]
["Exorcism",{"$f":"IF(AND(SealSelection=\"SoR\",Ability7=\"Judgement of Truth\"),\"Judgement of Righteousness\",Ability7)","v":"Consecration"},{"$f":"VLOOKUP(A38,Probability!$A$3:$C$10,3,FALSE)","v":1.1254037924829599},4,8,7.7573567713838318E-4,2.0215655155763353E-2,1.4696175918764925E-5,4500000,66.132791634442157]
[{"$f":"IF(AND(SealSelection=\"SoR\",Ability4=\"Judgement of Truth\"),\"Judgement of Righteousness\",Ability4)","v":"Templar's Verdict"},{"$f":"IF(InqRefresh=\"Unused\",\"Unused\",\"Inquisition\")","v":"Inquisition"},{"$f":"VLOOKUP(A39,Probability!$A$3:$C$10,3,FALSE)","v":1.5},5,1,1.4429798638892002E-3,{"$f":"IF(InqRefresh=\"Unused\",0,(M17 * ((IF(Fillers=1,CSCD,C17) / TimeSlice) - TimeSlice)))","v":3.172993509986527E-2},{"$f":"$M$39*G39","v":4.5785657431616738E-5},4500000,206.03545844227531,{"$f":"IF(A39=\"Exorcism\",((Length / TimeSlice) - SUM(J39:J45)),(K17 - SUM(J18:J45)))","v":29279.785948775716},{"$f":"IF(A39=\"Templar's Verdict\",$M$10,IF(CircRef=\"Off\",6,(K39*F39)))","v":64.934093875014},{"$f":"TimeSlice / (Length / L39)","v":1.4429798638892E-3}]
["Templar's Verdict",{"$f":"IF(AND(SealSelection=\"SoR\",Ability1=\"Judgement of Truth\"),\"Judgement of Righteousness\",Ability1)","v":"Crusader Strike"},{"$f":"VLOOKUP(A40,Probability!$A$3:$C$10,3,FALSE)","v":1.5},5,2,1.4429798638892002E-3,{"$f":"(VLOOKUP(B40,$A$17:$M$66,13,FALSE) * (IF(Fillers=1,CSCD,(VLOOKUP(B40,$A$17:$C$66,3,FALSE)) / TimeSlice) - TimeSlice))","v":0.38046421573464551},5.4900220223549001E-4,4500000,2470.5099100597049]
["Templar's Verdict",{"$f":"IF(AND(SealSelection=\"SoR\",Ability2=\"Judgement of Truth\"),\"Judgement of Righteousness\",Ability2)","v":"Hammer of Wrath"},{"$f":"VLOOKUP(A41,Probability!$A$3:$C$10,3,FALSE)","v":1.5},5,3,1.4429798638892002E-3,6.3765947789323041E-2,9.2012978661803194E-5,4500000,414.05840397811437]
["Templar's Verdict",{"$f":"IF(AND(SealSelection=\"SoR\",Ability3=\"Judgement of Truth\"),\"Judgement of Righteousness\",Ability3)","v":"Exorcism"},{"$f":"VLOOKUP(A42,Probability!$A$3:$C$10,3,FALSE)","v":1.5},5,4,1.4429798638892002E-3,8.1806215870615179E-2,1.180447222422708E-4,4500000,531.20125009021865]
["Templar's Verdict",{"$f":"IF(AND(SealSelection=\"SoR\",Ability5=\"Judgement of Truth\"),\"Judgement of Righteousness\",Ability5)","v":"Judgement of Truth"},{"$f":"VLOOKUP(A43,Probability!$A$3:$C$10,3,FALSE)","v":1.5},5,6,1.4429798638892002E-3,0.11044787110807412,1.5937405401838069E-4,4500000,717.18324308271315]
["Templar's Verdict",{"$f":"IF(AND(SealSelection=\"SoR\",Ability6=\"Judgement of Truth\"),\"Judgement of Righteousness\",Ability6)","v":"Holy Wrath"},{"$f":"VLOOKUP(A44,Probability!$A$3:$C$10,3,FALSE)","v":1.5},5,7,1.4429798638892002E-3,4.1679730070683707E-2,6.0143011224333776E-5,4500000,270.64355050950201]
["Templar's Verdict",{"$f":"IF(AND(SealSelection=\"SoR\",Ability7=\"Judgement of Truth\"),\"Judgement of Righteousness\",Ability7)","v":"Consecration"},{"$f":"VLOOKUP(A45,Probability!$A$3:$C$10,3,FALSE)","v":1.5},5,8,1.4429798638892002E-3,2.0215655155763353E-2,2.9170783325094408E-5,4500000,131.26852496292483]
[{"$f":"IF(AND(SealSelection=\"SoR\",Ability5=\"Judgement of Truth\"),\"Judgement of Righteousness\",Ability5)","v":"Judgement of Truth"},{"$f":"IF(InqRefresh=\"Unused\",\"Unused\",\"Inquisition\")","v":"Inquisition"},{"$f":"VLOOKUP(A46,Probability!$A$3:$C$10,3,FALSE)","v":1.5},6,1,1.25E-3,{"$f":"IF(InqRefresh=\"Unused\",0,(M17 * ((IF(Fillers=1,CSCD,C17) / TimeSlice) - TimeSlice)))","v":3.172993509986527E-2},{"$f":"$M$46*G46","v":2.3364916208930435E-5},4500000,105.14212294018697,{"$f":"IF(A46=\"Exorcism\",((Length / TimeSlice) - SUM(J46:J52)),(K17 - SUM(J18:J52)))","v":26509.256349694428},{"$f":"IF(A46=\"Templar's Verdict\",$M$10,IF(CircRef=\"Off\",6,(K46*F46)))","v":33.136570437118039},{"$f":"TimeSlice / (Length / L46)","v":7.3636823193595649E-4}]
["Judgement of Truth",{"$f":"IF(AND(SealSelection=\"SoR\",Ability1=\"Judgement of Truth\"),\"Judgement of Righteousness\",Ability1)","v":"Crusader Strike"},{"$f":"VLOOKUP(A47,Probability!$A$3:$C$10,3,FALSE)","v":1.5},6,2,1.25E-3,{"$f":"(VLOOKUP(B47,$A$17:$M$66,13,FALSE) * (IF(Fillers=1,CSCD,(VLOOKUP(B47,$A$17:$C$66,3,FALSE)) / TimeSlice) - TimeSlice))","v":0.38046421573464551},2.8016176185542121E-4,4500000,1260.7279283493954]
["Judgement of Truth",{"$f":"IF(AND(SealSelection=\"SoR\",Ability2=\"Judgement of Truth\"),\"Judgement of Righteousness\",Ability2)","v":"Hammer of Wrath"},{"$f":"VLOOKUP(A48,Probability!$A$3:$C$10,3,FALSE)","v":1.5},6,3,1.25E-3,6.3765947789323041E-2,4.6955218231344318E-5,4500000,211.29848204104943]
["Judgement of Truth",{"$f":"IF(AND(SealSelection=\"SoR\",Ability3=\"Judgement of Truth\"),\"Judgement of Righteousness\",Ability3)","v":"Exorcism"},{"$f":"VLOOKUP(A49,Probability!$A$3:$C$10,3,FALSE)","v":1.5},6,4,1.25E-3,8.1806215870615179E-2,6.0239498542016084E-5,4500000,271.07774343907238]
["Judgement of Truth",{"$f":"IF(AND(SealSelection=\"SoR\",Ability4=\"Judgement of Truth\"),\"Judgement of Righteousness\",Ability4)","v":"Templar's Verdict"},{"$f":"VLOOKUP(A50,Probability!$A$3:$C$10,3,FALSE)","v":1.5},6,5,{"$f":"(1/VLOOKUP(A50,$A$3:$B$10,2,FALSE)) * TimeSlice","v":1.25E-3},0.21643254978474114,1.5937405401838072E-4,{"$f":"Length / TimeSlice / TimeSlice","v":4500000},717.18324308271326]
["Judgement of Truth",{"$f":"IF(AND(SealSelection=\"SoR\",Ability6=\"Judgement of Truth\"),\"Judgement of Righteousness\",Ability6)","v":"Holy Wrath"},{"$f":"VLOOKUP(A51,Probability!$A$3:$C$10,3,FALSE)","v":1.5},6,7,1.25E-3,4.1679730070683707E-2,3.069162913971728E-5,4500000,138.11233112872776]
["Judgement of Truth",{"$f":"IF(AND(SealSelection=\"SoR\",Ability7=\"Judgement of Truth\"),\"Judgement of Righteousness\",Ability7)","v":"Consecration"},{"$f":"VLOOKUP(A52,Probability!$A$3:$C$10,3,FALSE)","v":1.5},6,8,1.25E-3,2.0215655155763353E-2,1.4886166244476463E-5,4500000,66.987748100144088]
[{"$f":"IF(AND(SealSelection=\"SoR\",Ability6=\"Judgement of Truth\"),\"Judgement of Righteousness\",Ability6)","v":"Holy Wrath"},{"$f":"IF(InqRefresh=\"Unused\",\"Unused\",\"Inquisition\")","v":"Inquisition"},{"$f":"VLOOKUP(A53,Probability!$A$3:$C$10,3,FALSE)","v":1.1254037924829599},7,1,6.6666666666666664E-4,{"$f":"IF(InqRefresh=\"Unused\",0,(M17 * ((IF(Fillers=1,CSCD,C17) / TimeSlice) - TimeSlice)))","v":3.172993509986527E-2},{"$f":"$M$53*G53","v":1.17523386925111E-5},4500000,52.885524116299948,{"$f":"IF(A53=\"Exorcism\",((Length / TimeSlice) - SUM(J53:J59)),(K17 - SUM(J18:J59)))","v":25001.0868048661},{"$f":"IF(A53=\"Templar's Verdict\",$M$10,IF(CircRef=\"Off\",6,(K53*F53)))","v":16.667391203244065},{"$f":"TimeSlice / (Length / L53)","v":3.7038647118320145E-4}]
["Holy Wrath",{"$f":"IF(AND(SealSelection=\"SoR\",Ability1=\"Judgement of Truth\"),\"Judgement of Righteousness\",Ability1)","v":"Crusader Strike"},{"$f":"VLOOKUP(A54,Probability!$A$3:$C$10,3,FALSE)","v":1.1254037924829599},7,2,6.6666666666666664E-4,{"$f":"(VLOOKUP(B54,$A$17:$M$66,13,FALSE) * (IF(Fillers=1,CSCD,(VLOOKUP(B54,$A$17:$C$66,3,FALSE)) / TimeSlice) - TimeSlice))","v":0.38046421573464551},1.4091879827743962E-4,4500000,634.13459224847827]
["Holy Wrath",{"$f":"IF(AND(SealSelection=\"SoR\",Ability2=\"Judgement of Truth\"),\"Judgement of Righteousness\",Ability2)","v":"Hammer of Wrath"},{"$f":"VLOOKUP(A55,Probability!$A$3:$C$10,3,FALSE)","v":1.1254037924829599},7,3,6.6666666666666664E-4,6.3765947789323041E-2,2.3618044383339628E-5,4500000,106.28119972502833]
["Holy Wrath",{"$f":"IF(AND(SealSelection=\"SoR\",Ability3=\"Judgement of Truth\"),\"Judgement of Righteousness\",Ability3)","v":"Exorcism"},{"$f":"VLOOKUP(A56,Probability!$A$3:$C$10,3,FALSE)","v":1.1254037924829599},7,4,6.6666666666666664E-4,8.1806215870615179E-2,3.0299915617168367E-5,4500000,136.34962027725766]
["Holy Wrath",{"$f":"IF(AND(SealSelection=\"SoR\",Ability4=\"Judgement of Truth\"),\"Judgement of Righteousness\",Ability4)","v":"Templar's Verdict"},{"$f":"VLOOKUP(A57,Probability!$A$3:$C$10,3,FALSE)","v":1.1254037924829599},7,5,6.6666666666666664E-4,0.21643254978474114,8.0163688363952832E-5,4500000,360.73659763778772]
["Holy Wrath",{"$f":"IF(AND(SealSelection=\"SoR\",Ability5=\"Judgement of Truth\"),\"Judgement of Righteousness\",Ability5)","v":"Judgement of Truth"},{"$f":"VLOOKUP(A58,Probability!$A$3:$C$10,3,FALSE)","v":1.1254037924829599},7,6,6.6666666666666664E-4,0.11044787110807412,4.0908397229416646E-5,4500000,184.0877875323749]
["Holy Wrath",{"$f":"IF(AND(SealSelection=\"SoR\",Ability7=\"Judgement of Truth\"),\"Judgement of Righteousness\",Ability7)","v":"Consecration"},{"$f":"VLOOKUP(A59,Probability!$A$3:$C$10,3,FALSE)","v":1.1254037924829599},7,8,6.6666666666666664E-4,2.0215655155763353E-2,7.4876051757996812E-6,4500000,33.694223291098567]
[{"$f":"IF(AND(SealSelection=\"SoR\",Ability7=\"Judgement of Truth\"),\"Judgement of Righteousness\",Ability7)","v":"Consecration"},{"$f":"IF(InqRefresh=\"Unused\",\"Unused\",\"Inquisition\")","v":"Inquisition"},{"$f":"VLOOKUP(A60,Probability!$A$3:$C$10,3,FALSE)","v":1.1254037924829599},8,1,3.3333333333333332E-4,{"$f":"IF(InqRefresh=\"Unused\",0,(M17 * ((IF(Fillers=1,CSCD,C17) / TimeSlice) - TimeSlice)))","v":3.172993509986527E-2},{"$f":"$M$60*G60","v":5.7001623062008937E-6},4500000,25.650730377904022,{"$f":"IF(A60=\"Exorcism\",((Length / TimeSlice) - SUM(J60:J66)),(K17 - SUM(J18:J66)))","v":24252.237167052641},{"$f":"IF(A60=\"Templar's Verdict\",$M$10,IF(CircRef=\"Off\",6,(K60*F60)))","v":8.0840790556842137},{"$f":"TimeSlice / (Length / L60)","v":1.7964620123742697E-4}]
["Consecration",{"$f":"IF(AND(SealSelection=\"SoR\",Ability1=\"Judgement of Truth\"),\"Judgement of Righteousness\",Ability1)","v":"Crusader Strike"},{"$f":"VLOOKUP(A61,Probability!$A$3:$C$10,3,FALSE)","v":1.1254037924829599},8,2,3.3333333333333332E-4,{"$f":"(VLOOKUP(B61,$A$17:$M$66,13,FALSE) * (IF(Fillers=1,CSCD,(VLOOKUP(B61,$A$17:$C$66,3,FALSE)) / TimeSlice) - TimeSlice))","v":0.38046421573464551},{"$f":"$M$60*G61","v":6.8348951063505961E-5},4500000,307.57027978577685]
["Consecration",{"$f":"IF(AND(SealSelection=\"SoR\",Ability2=\"Judgement of Truth\"),\"Judgement of Righteousness\",Ability2)","v":"Hammer of Wrath"},{"$f":"VLOOKUP(A62,Probability!$A$3:$C$10,3,FALSE)","v":1.1254037924829599},8,3,3.3333333333333332E-4,6.3765947789323041E-2,1.1455310288655988E-5,4500000,51.548896298951945]
["Consecration",{"$f":"IF(AND(SealSelection=\"SoR\",Ability3=\"Judgement of Truth\"),\"Judgement of Righteousness\",Ability3)","v":"Exorcism"},{"$f":"VLOOKUP(A63,Probability!$A$3:$C$10,3,FALSE)","v":1.1254037924829599},8,4,3.3333333333333332E-4,8.1806215870615179E-2,1.4696175918764927E-5,4500000,66.132791634442171]
["Consecration",{"$f":"IF(AND(SealSelection=\"SoR\",Ability4=\"Judgement of Truth\"),\"Judgement of Righteousness\",Ability4)","v":"Templar's Verdict"},{"$f":"VLOOKUP(A64,Probability!$A$3:$C$10,3,FALSE)","v":1.1254037924829599},8,5,3.3333333333333332E-4,0.21643254978474114,3.8881285392959037E-5,4500000,174.96578426831567]
["Consecration",{"$f":"IF(AND(SealSelection=\"SoR\",Ability5=\"Judgement of Truth\"),\"Judgement of Righteousness\",Ability5)","v":"Judgement of Truth"},{"$f":"VLOOKUP(A65,Probability!$A$3:$C$10,3,FALSE)","v":1.1254037924829599},8,6,3.3333333333333332E-4,0.11044787110807412,1.9841540479326481E-5,4500000,89.286932156969158]
["Consecration",{"$f":"IF(AND(SealSelection=\"SoR\",Ability6=\"Judgement of Truth\"),\"Judgement of Righteousness\",Ability6)","v":"Holy Wrath"},{"$f":"VLOOKUP(A66,Probability!$A$3:$C$10,3,FALSE)","v":1.1254037924829599},8,7,3.3333333333333332E-4,4.1679730070683707E-2,7.4876051757996812E-6,4500000,33.694223291098567]
[]
[]
[]
[]
[]
[]
[]
[]
[]
[]
[]
[]
[]
[]
[]
[]
["Backup Calc"]
["Ability Usage"]
["Ability",null,"Total Usage","In AW","Outside AW","Effective CD"]
["Consecration",null,{"$f":"VLOOKUP(A86,$A$17:$L$66,12,FALSE)","v":8.0840790556842137},{"$f":"C86 / 6","v":1.3473465092807022},{"$f":"C86 * 5 / 6","v":6.7367325464035117},{"$f":"Length / SUM(D86:E86)","v":55.664967759511015}]
["Crusader Strike",null,114.14687451202778,{"$f":"C87 / 6","v":19.024479085337962},{"$f":"C87 * 5 / 6","v":95.12239542668982},3.9422892823279452]
["Exorcism",null,32.713652426737269,{"$f":"C88 / 6","v":5.4522754044562118},{"$f":"C88 * 5 / 6","v":27.261377022281057},13.755724800456994]
["Hammer of Wrath",null,19.131059740779627,{"$f":"((HoWPercent / 6) + ((1 - HoWPercent) / 6)) / (HoWPercent + ((1 - HoWPercent) / 6)) * C89","v":9.8107998670664767},{"$f":"(1 - ((HoWPercent / 6) + ((1 - HoWPercent) / 6)) / (HoWPercent + ((1 - HoWPercent) / 6))) * C89","v":9.3202598737131499},23.52195885107103]
["Holy Wrath",null,16.667391203244065,{"$f":"C90 / 6","v":2.7778985338740108},{"$f":"C90 * 5 / 6","v":13.889492669370055},26.998826301767853]
[{"$f":"IF(SealSelection=\"SoT\",\"Judgement of Truth\", \"Judgement of Righteousness\")","v":"Judgement of Truth"},null,33.136570437118039,{"$f":"C91 / 6","v":5.5227617395196731},{"$f":"C91 * 5 / 6","v":27.613808697598369},13.580162161136959]
[{"$f":"IF(InqRefresh=\"Unused\",\"Unused\",\"Inquisition\")","v":"Inquisition"},null,12.688547652926875,{"$f":"C92 / 6","v":2.1147579421544793},{"$f":"C92 * 5 / 6","v":10.573789710772395},{"$f":"IF(InqRefresh=\"Unused\",0,(Length / SUM(D92:E92)))","v":35.465051817510272}]
["Templar's Verdict",null,{"$f":"SUM(D93:E93)","v":{"$error":"#N/A"}},{"$f":"IF(AWZeal=\"Together\",(D87 + (0.15 * SUM(D88:D93)) - D92),((D87 / 3) + (0.15 * SUM(D88:D93)) - D92))","v":{"$error":"#N/A"}},{"$f":"IF(AWZeal=\"Together\",((E87/3) + (0.15 * SUM(E88:E93)) - E92),((E87 * (20/100)) + (E87 * (80/100) / 3) + (0.15 * SUM(E88:E93)) - E92))","v":{"$error":"#N/A"}},{"$error":"#N/A"}]